"vertexlitgeneric"
{
	"$additive" 1

	"$basetexture" "models\doctormemes\shalka\Glass"
	"$envmap" "env_cubemap"
	"$envmapcontrast" "1"
	"$envmaptint" "[ 0.4 0.2 0 ]"
	"$model" 1
	"$halflambert" 1
	"$phong" "1"
	"$phongexponent" "30"
	"$phongboost" "0.1"	
	"$phongfresnelranges"	"[ 8 4 8 ]"

}
