"VertexlitGeneric"
{
	"$basetexture" "models/doctorwho1200/hellbent/screen"
	"$nodecal" "1"
	"$selfillum" 1
	"$selfillummask" "models/doctorwho1200/hellbent/white"
	"$surfaceprop" "Glass"
	Proxies
	{
		"AnimatedTexture"
			{
				"animatedTextureVar" "$basetexture"
				"animatedTextureFrameNumVar" "$frame"
				"animatedTextureFrameRate" "15"
			}
	}
}
