{
	"title": "Hell Bent TARDIS Extension",
	"type": "vehicle",
	"tags": [
		"roleplay",
		"fun"
	],
	"ignore":
    [
        "*.md",
        "*.txt",
        "*.fgd",
        "*.psd",
        "*.vcproj",
        "*.svn*",
        "*.git*",
        ".vscode*",
        "*.sh",
        "*.gma",
        "CODEOWNERS",
        "assets/*"
    ],
    "workshop_id": "2945605353",
    "icon_path": "assets/icon.jpg"
}