"VertexlitGeneric"
{
	"$basetexture" "coreylz/smith-capaldi/Tracer Light Anim"
$alphatest 1
"Proxies" 
{ 
"AnimatedTexture" 
{ 
"animatedTextureVar" "$basetexture" 
"animatedTextureFrameNumVar" "$frame" 
"animatedTextureFrameRate" "7" 
}
} 
}