"VertexlitGeneric"
{
	"$basetexture" "models/doctorwho1200/toyota/rotor"
	"$surfaceprop" "Metal"
	"$nodecal" "1"
	"$envmap" "models/doctorwho1200/toyota/environment"
	"$envmaptint" "[0.1 0.1 0.1]"
}
