"VertexlitGeneric"
{
	"$basetexture" "models/doctorwho1200/toyota/catwalklights"
	"$surfaceprop" "water"
	"$selfillum" 1
        "$selfillummask" "models/doctorwho1200/toyota/white"
	"$nodecal" "1"
		"Proxies"
		{
			"AnimatedTexture"
				{
					"animatedTextureVar" "$basetexture"
					"animatedTextureFrameNumVar" "$frame"
					"animatedTextureFrameRate" "15"
				}
		}
}