"VertexlitGeneric"
{
	"$basetexture" "models/doctorwho1200/toyota/vortex"
	"$surfaceprop" "cardboard"
	"$selfillum" 1
	"$selfillummask" "/dw_materials/other/white"
                "$nodecal" "0"

		"Proxies"
		{
			"AnimatedTexture"
				{
					"animatedTextureVar" "$basetexture"
					"animatedTextureFrameNumVar" "$frame"
					"animatedTextureFrameRate" "20"
				}
		}
}