"VertexlitGeneric"
{
	"$basetexture" "models/doctorwho1200/toyota/doors"
	"$bumpmap" "models/doctorwho1200/toyota/doorsn"
	"$normalmap" "models/doctorwho1200/toyota/doorsn"
	"$surfaceprop" "Glass"
	"$selfillum" 1
        "$selfillummask" "models/doctorwho1200/toyota/white"
	"$envmap" "models/doctorwho1200/toyota/environment"
	"$envmaptint" "[0.8 0.8 0.8]"
	"$nodecal" "1"
}
