"VertexlitGeneric"
{
	"$basetexture" "models/doctorwho1200/toyota/windows2"
	"$bumpmap" "models/doctorwho1200/toyota/windowsn"
	"$normalmap" "models/doctorwho1200/toyota/windowsn"
	"$surfaceprop" "Glass"
	"$selfillum" 1
        "$selfillummask" "models/doctorwho1200/toyota/white"
	"$envmap" "models/doctorwho1200/toyota/environment"
	"$envmaptint" "[0.1 0.1 0.1]"
	"$nodecal" "1"
}