"VertexlitGeneric"
{
	"$basetexture" "models/artixc/hellbent/telepathic"
	"$envmap" "models/artixc/hellbent/environment"
	"$envmaptint" "[0.8 0.8 0.8]"
	"$nodecal" "1"
	"$selfillum" 1
	"$selfillummask" "models/artixc/hellbent/white"
	"$surfaceprop" "Wood"
}
