"VertexLitGeneric"
{
	"$basetexture" "models/artixc/hellbent/glass1"
	"$surfaceprop" "Glass"
	"$envmap" "models/artixc/hellbent/environment"
	"$envmaptint" "[0.5 0.5 0.5]"
	"$nodecal" "0"
	"$additive" "1"


}
