"VertexlitGeneric"
{
	"$basetexture" "models/artixc/hellbent/doubledoorwall"
	"$envmap" "models/artixc/hellbent/environment"
	"$envmaptint" "[0.02 0.02 0.02]"
	"$nodecal" "1"
	"$surfaceprop" "Wood"
}
