"VertexlitGeneric"
{
	"$basetexture" "models/karmal/73/light_switch"
	"$bumpmap" "models/karmal/73/light_switch_normal"
	"$surfaceprop" "Plastic"
	"$nodecal" "1"
	"$color2" "[ 0.9 0.9 0.845 ]"

	$phong 1
	$phongexponent			20
	$phongboost			0.15
	$phongfresnelranges	"[1 1 1]"
}
