"VertexlitGeneric"
{
	"$basetexture" "models/karmal/73/console_lamps"
	"$bumpmap" "models/karmal/73/generic_normal"
	"$envmap" "cubemaps/karmal/73/cubemap_specular002.hdr"
	"$envmaptint" "[0.03 0.03 0.03]"
	"$nodecal" "1"
	"$selfillum" "1"
	"$selfillummask" "models/karmal/73/white"
	"$surfaceprop" "Plastic"

	$phong 								1
	$phongexponent 							5
	$phongboost 							25
	$phongtint 							"[1 1 0.6]"
	$phongfresnelranges 						"[0.05 0.5 1]"
}
