"VertexlitGeneric"
{
	"$basetexture" "models/karmal/73/big_levers_throttle"
	"$bumpmap" "models/karmal/73/big_levers_normal"
	"$surfaceprop" "Metal"
	"$nodecal" "1"
//	"$color2" "[0.9 0.9 0.92]"

	"$detail"				"detail/metal_detail_01"
	"$detailscale"			"4.283"
	"$detailblendfactor"	"0.1"
	"$detailblendmode"		"0"

	$phong 							1
	$phongexponent 						25
	$phongboost 						5
//	$phongtint 						"[ .35 .35 .35 ]"
	$phongfresnelranges 					"[0.05 0.5 1]"

	$rimlight 							"1"
	$rimlightexponent 						"25"
}
