"VertexlitGeneric"
{
	"$basetexture" "models/karmal/73/exterior/exterior2"
	"$envmapmask" "models/karmal/73/metal_spec_b"
	"$envmap" "models/karmal/73/environment"
	"$envmaptint" "[ .30 .30 .30 ]"
	"$envmapfresnel" "0.75"



}