"VertexlitGeneric"
{
	"$basetexture" "models/karmal/73/rotor_lights_off"
	"$envmap" "cubemaps/karmal/73/cubemap_specular002.hdr"
	"$envmaptint" "[0.3 0.3 0.3]"
	"$nocull" "1"
	"$nodecal" "1"
	"$additive" "1"
	"$surfaceprop" "Plastic"

}
