"VertexLitGeneric"
{
	"$basetexture" "models/karmal/73/rotor_green_tubes"
	"$bumpmap" "models/karmal/73/glass_normal"
	"$surfaceprop" "glass"
	"$envmap" "models/karmal/73/environment"
	"$envmaptint" "[ .1 .2 .1 ]"
	"$envmapfresnel" "0.75"
	"$translucent" "1"
	"$nocull" "1"
//	"$additive" "1"

	"$detail"				"detail/detailash001a"
	"$detailscale"			"2"
	"$detailblendfactor"	"0.35"
	"$detailblendmode"		"2"

	"$phong"     "1"
	"$phongexponent"  "33"
	"$phongboost"   "33"
	"$phongfresnelranges"   "[1 8 4]"
	"$halflambert" "1"

	"$rimlight" "1"
	"$rimlightexponent" "12"	
	"$rimlightboost" "0.4"

}

