"VertexlitGeneric"
{
	"$basetexture" "models/karmal/73/telepathic_circuit_lens"
	"$bumpmap" "models/karmal/73/telepathic_circuit_lens_normal"
	"$surfaceprop" "Metal"
	"$nodecal" "1"
//	"$envmap" "cubemaps/karmal/73/cubemap_specular002.hdr"
	"$envmaptint" "[ 0.2 0.1 0.1 ]"

	$phong 1
	$phongexponent			20
	$phongboost			0.8
	$phongfresnelranges	"[1 1 1]"
	$phongtint	"[1 0.5 0.5]"
}
