"VertexlitGeneric"
{
	"$basetexture" "models/karmal/73/demat_circuit"
	"$envmapmask" "models/karmal/73/demat_circuit_spec"
	"$surfaceprop" "Metal"
	"$nodecal" "1"
	"$envmap" "cubemaps/karmal/73/cubemap_sheen002.hdr"
	"$envmaptint" "[ 0.7 0.7 0.7 ]"
}
