"VertexlitGeneric"
{
	"$basetexture" "models/karmal/73/floor2"
	"$bumpmap" "models/karmal/73/glass_normal"
	"$envmap" "models/karmal/73/environment"
	"$envmaptint" "[0.015 0.015 0.015]"
	"$nodecal" "1"
	"$surfaceprop" "Concrete"

	"$detail"				"detail/metal_detail_01"
	"$detailscale"			"8"
	"$detailblendfactor"	"0.15"
	"$detailblendmode"		"0"

	"$phong"					"1"
	"$phongexponent"			"10"
	"$phongboost"				"10"
	"$phongfresnelranges"		"[0.05 0.5 1]"
}
