"VertexlitGeneric"
{
	"$basetexture" "models/karmal/73/walls4"
	"$bumpmap" "models/karmal/73/glass_normal"
//	"$envmap" "cubemaps/karmal/73/cubemap_specular002.hdr"
//	"$envmapmask" "models/karmal/73/metal_spec_b"
	"$envmaptint" "[0.3 0.3 0.3]"
	"$nodecal" "1"
	"$surfaceprop" "metal"

	"$detail"				"detail/metal_detail_01"
	"$detailscale"			"8"
	"$detailblendfactor"	"0.1"
	"$detailblendmode"		"2"

	$phong 								1
    $phongexponent 						15
    $phongboost 						0.25
    $phongtint 							"[ 25 25 25 ]"
//    $halflambert 						1
	$phongfresnelranges 				"[0.5 1.5 0.5]"  //The angle of the dangle

	$rimlight 							"1"
	$rimlightexponent 					"25" //Range
//	$rimlightboost 						"1"
}
