"VertexlitGeneric"
{
	"$basetexture" "models/karmal/73/soffit_controls"
	"$bumpmap" "models/karmal/73/generic_normal"
	"$nodecal" "1"
	"$surfaceprop" "Wood_Solid"

	$phong 1
//	$phongexponent			20
	$phongboost			0.15
	$phongfresnelranges 		"[0.05 0.5 1]"

	$rimlight 							"1"
	$rimlightexponent 					"25" //Range
	$rimlightboost 						"2"
}
