"VertexlitGeneric"
{
	"$basetexture" "models/karmal/73/roundel_bowls"
	"$bumpmap" "models/karmal/73/glass_normal"
	"$envmap" "cubemaps/karmal/73/cubemap_specular001.hdr"
	"$envmaptint" "[0.05 0.05 0.05]"
	"$nodecal" "1"
	"$surfaceprop" "plastic"

	$phong 1
	$phongexponent			20
	$phongboost			0.5
	$phongfresnelranges	"[1 1 1]"
}
