"VertexlitGeneric"
{
	"$basetexture" "models/karmal/73/roundel_backing"
	"$bumpmap" "models/karmal/73/generic_normal"
	"$envmap" "models/karmal/73/metal_generic_003"
	"$envmaptint" "[0.01 0.01 0.01]"
	"$nocull" "1"
	"$nodecal" "1"
	"$color2" "[ 0.55 0.52 0.55 ]"
	"$surfaceprop" "Plastic"

	$phong 1
	$phongexponent			20
	$phongboost			0.1
	$phongfresnelranges	"[1 1 1]"
}
