"VertexlitGeneric"
{
	"$basetexture" "models/karmal/73/rotor_lights_flight"
	"$envmap" "cubemaps/karmal/73/cubemap_specular002.hdr"
	"$envmaptint" "[0.3 0.3 0.3]"
	"$nocull" "1"
	"$nodecal" "1"
	"$selfillum" "1"
	"$selfillummask" "models/karmal/73/white"
	"$selfillumtint" "[0.7 1 0.7]"
	"$additive" "1"
	"$surfaceprop" "Plastic"

	Proxies
	{
		"AnimatedTexture"
			{
				"animatedTextureVar" "$basetexture"
				"animatedTextureFrameNumVar" "$frame"
				"animatedTextureFrameRate" "20"
			}
	}

}
