"VertexlitGeneric"
{
	"$basetexture" "models/karmal/73/rotor_metal"
	"$bumpmap" "models/karmal/73/rotor_metal_normal"
	"$envmap" "cubemaps/karmal/73/cubemap_specular002.hdr"
	"$envmaptint" "[0.07 0.07 0.07]"
	"$nodecal" "1"
	"$nocull" "1"
	"$surfaceprop" "metal"

	$phong 								1
	$phongexponent 							5
	$phongboost 							20
	$phongtint 							"[ 25 25 25 ]"
	$phongfresnelranges 						"[0.05 0.5 1]"

	$rimlight 							"1"
	$rimlightexponent 						"25"
}
