"VertexlitGeneric"
{
	"$basetexture" "models/karmal/72/microphone"
	"$bumpmap" "models/karmal/72/microphone_normal"
	"$surfaceprop" "Metal"
	"$nodecal" "1"

	"$detail"				"detail/metal_detail_01"
	"$detailscale"			"1"
	"$detailblendfactor"	"0.3"
	"$detailblendmode"		"0"

	$phong 								1
	$phongexponent 							15
	$phongboost 							1
	$phongfresnelranges 						"[0.05 0.5 1]"

	$rimlight 							"1"
	$rimlightexponent 						"25"
}
