"VertexLitGeneric"
{
	"$basetexture" "models/karmal/73/rotor_red_center"
	"$bumpmap" "models/karmal/73/glass_normal"
	"$surfaceprop" "glass"
	"$envmap" "models/karmal/73/environment"
	"$envmaptint" "[ .05 .02 .02 ]"
	"$envmapfresnel" "0.75"
	"$translucent" "1"
	"$nocull" "1"
//	"$additive" "1"
//	"$color2" "[0.8 0.8 0.8]"

	"$detail"				"detail/detailash001a"
	"$detailscale"			"2"
	"$detailblendfactor"	"0.35"
	"$detailblendmode"		"2"

	"$phong"     "1"
	"$phongexponent"  "3"
	"$phongboost"   "3"
	"$phongtint" "[1 0.8 0.8]"
	"$phongfresnelranges"   "[1 8 4]"
	"$halflambert" "1"

	"$rimlight" "1"
	"$rimlightexponent" "12"	
	"$rimlightboost" "0.4"

}

