"VertexlitGeneric"
{
	"$basetexture" "models/karmal/73/walls1"
	"$bumpmap" "models/karmal/73/wall_normal"
//	"$envmapmask" "models/karmal/73/walls_spec"
//	"$envmap" "cubemaps/karmal/73/cubemap_specular002.hdr"
	"$envmaptint" "[ .2 .2 .2 ]"
	"$envmapfresnel" "0.75"
	"$nodecal" "1"
	"$surfaceprop" "Wood_Solid"

	"$detail"				"detail/metal_detail_01"
	"$detailscale"			"8"
	"$detailblendfactor"	"0.01"
	"$detailblendmode"		"2"

	$phong 								1
//    $phongexponent 						25
 //   $phongboost 						3
    $phongtint 							"[ .5 .5 .5 ]"
//    $halflambert 						1
	$phongfresnelranges 				"[0.05 0.5 1]"  //The angle of the dangle

	$rimlight 							"1"
	$rimlightexponent 					"25" //Range
	$rimlightboost 						"2"
}
