"VertexlitGeneric"
{
	"$basetexture" "models/karmal/73/exterior/doorsign"
	"$bumpmap" "models/karmal/73/metal_normal"
//	"$envmap" "cubemaps/karmal/73/cubemap_specular002.hdr"
	"$envmaptint" "[ .45 .45 .45 ]"
	"$envmapfresnel" "0.75"

	$diffuseexp 1
	$halflambert 1
	$phong 1
	$phongalbedotint 1
	$phongalbedoboost 255
	$phongboost .2
	$phongfresnelranges "[.25 .25 .25]"
	$rimlight               1
	$rimlightexponent       11
	$rimlightboost          .5

	"$detail"                "detail/metal_detail_01"
    "$detailscale"            "1"
    "$detailblendfactor"    "0.03"
    "$detailblendmode"        "1"
}