"VertexlitGeneric"
{
	"$basetexture" "models/karmal/73/exterior/1973"
	"$bumpmap" "models/karmal/73/exterior/1973_normal"
	"$model" "1"
	"$surfaceprop"				"Wood_Furniture"
	"$nodecal"					"1"

	"$phong"					"1"
	"$phongexponent"			"30"
	"$phongboost"				"1"
	"$phongfresnelranges"		"[0.05 0.5 1]"

	"$rimlight"					"1"
	"$rimlightexponent"			"2"
	"$rimlightboost"			"0.2"

}