"VertexlitGeneric"
{
	"$basetexture" "models/karmal/73/metal_wall_panel"
	"$envmapmask" "models/karmal/73/metal_wall_panel_spec"
	"$envmap" "cubemaps/karmal/73/cubemap_specular002.hdr"
	"$envmaptint" "[0.45 0.45 0.45]"
	"$nodecal" "1"
	"$surfaceprop" "metal"
}
