"VertexLitGeneric"
{
	"$basetexture" "models/karmal/73/glass"
	"$bumpmap" "models/karmal/73/glass_normal"
	"$surfaceprop" "glass"
	"$envmap" "models/karmal/73/metal_generic_003"
	"$envmaptint" "[ .035 .035 .035 ]"
	"$envmapfresnel" "0.75"
	"$translucent" "1"
	"$nocull" "1"
	"$additive" "1"

	"$phong"     "1"
	"$phongexponent"  "33"
	"$phongboost"   "3"
	"$phongfresnelranges"   "[1 8 4]"
	"$halflambert" "1"

	"$rimlight" "1"
	"$rimlightexponent" "12"	
	"$rimlightboost" "0.4"

}

