"VertexlitGeneric"
{
	"$basetexture" "models/karmal/72/roundel_scanner_anim"
	"$bumpmap" "models/karmal/73/glass_normal"
	"$nodecal" "1"
	"$surfaceprop" "metal"
	"$selfillum" "1"
	"$selfillummask" "models/karmal/73/white"

//	$phong 1
	$phongexponent			20
	$phongboost			0.35
	$phongfresnelranges	"[1 1 1]"

	Proxies
	{
		"AnimatedTexture"
			{
				"animatedTextureVar" "$basetexture"
				"animatedTextureFrameNumVar" "$frame"
				"animatedTextureFrameRate" "20"
			}
	}

}
