"VertexlitGeneric"
{
    "$basetexture" "models/jorj/type35/type35_woodwhite"
    "$surfaceprop" "Wood"
    "$nodecal" "1"
    "$envmap" "models/jorj/type35/environment"
	"$envmaptint" "[0.2 0.2 0.2]"
    "$bumpmap" "models/jorj/type35/type35_wood_bump"
}