"VertexlitGeneric"
{
    "$basetexture" "models/jorj/type35/type35_siderooms"
    "$surfaceprop" "Wood"
    "$nodecal" "1"
    "$envmap" "models/jorj/type35/environment"
	"$envmaptint" "[0.3 0.3 0.3]"
}