"VertexlitGeneric"
{
    "$basetexture" "models/jorj/type35/type35_struts"
    "$surfaceprop" "Wood"
    "$nodecal" "1"
    "$envmap" "models/jorj/type35/environment"
	"$envmaptint" "[0.15 0.15 0.15]"
    "$bumpmap" "models/jorj/type35/type35_struts_bump"
}