VertexLitGeneric
{
	$baseTexture	"models\FuzzyLeo\Silence\pipes"

	$bumpmap	"models\FuzzyLeo\Silence\pipes_normal"

	$phong 					1
	$phongexponent 			15
	$phongboost 			5
	$phongtint 				"[ .5 .5 .5 ]"
	$phongfresnelranges 	"[0.05 0.5 1]"

}