VertexLitGeneric
{
	$baseTexture	"models\FuzzyLeo\Silence\curtain"

	$bumpmap	"models\FuzzyLeo\Silence\curtain_n"

	$phong 					1
	$phongexponent 			30
	$phongboost 			2
	$phongtint 				"[ .5 .5 .5 ]"
	$phongfresnelranges 	"[0.05 0.5 1]"
}