"VertexLitGeneric"
{
	"$basetexture"	"models\FuzzyLeo\PortalTARDIS/elevator_caps"
	"$surfaceprop"	"metal"
	//"$envmap"	"env_cubemap"
	//"$envmapmask"	"models\FuzzyLeo\PortalTARDIS/elevatorshaft_wall_env"
	"$basemapalphaphongmask" "1"
	"$phong" 1
	"$phongboost"	"4"
	"$phongexponenttexture"	"models\FuzzyLeo\PortalTARDIS/elevator_caps_exp"
	"$phongfresnelranges"	"[5 1.5 2]"
}