"VertexLitGeneric"
{
	"$baseTexture" "models\FuzzyLeo\PortalTARDIS/clear_tubes_glass"

	"$envmap" "models\FuzzyLeo\PortalTARDIS\portalcubemap"
	"$envmaptint" "[.20 .30 .35]"
	"$additive" "1"
	"$translucent" 1
	"$nocull" "0"


	//"$bumpmap" "models\FuzzyLeo\PortalTARDIS/clear_tubes_glass_normal"

	//"$phong" "0"
	//"$phongexponenttexture" "models\FuzzyLeo\PortalTARDIS/clear_tubes_glass_exponent"
	//"$phongboost" "1"	
	//"$lightwarptexture" "models\FuzzyLeo\PortalTARDIS/clear_tubes_glass_lightwarp"
	//"$phongfresnelranges"	"[0.5 1 2.5]"


//  	"$normalmapalphaenvmapmask" 1
	"$alphaenvmapmask" 1

}