"VertexLitGeneric"
{
	"$basetexture"	"models\FuzzyLeo\PortalTARDIS/Round_elevator_sheet_1"
	"$surfaceprop"	"metal"
	"$bumpmap"	"models\FuzzyLeo\PortalTARDIS/Round_elevator_sheet_1_normal"
	"$normalmapalphaenvmapmask" 1
	//"$envmap"	"models\FuzzyLeo\PortalTARDIS\portalelevatorcubemap"
	//"$envmaptint"	"[9 9 9]"
	//phong properties
	"$phong"	"1"
	"$phongboost"	"3"
	"$phongexponenttexture"	"models\FuzzyLeo\PortalTARDIS/Round_elevator_sheet_1_exponent"
	"$phongfresnelranges"	"[2 1.5 2]"
}