"VertexLitGeneric"
{
	"$baseTexture" "models\FuzzyLeo\PortalTARDIS/lab_floorlight"
	"envmap" "env_cubemap"
	"$surfaceprop"	"metal"
	"$bumpmap"	"models\FuzzyLeo\PortalTARDIS/lab_floorlight_normal"
        "$selfillum" 1
	//phong properties
	"$phong"	"1"
	"$phongboost"	"1"
	"$phongexponenttexture"	"models\FuzzyLeo\PortalTARDIS/lab_floorlight_exponent"
	"$phongfresnelranges"	"[1 1.5 2]"


}