"VertexLitGeneric"
{
	"$basetexture"	"models\FuzzyLeo\PortalTARDIS/elevatorshaft_wall"
	"$surfaceprop"	"metal"
	"%noportal" 1
	//"$envmap"	"models\FuzzyLeo\PortalTARDIS\portalelevatorcubemap"
	//"$envmapmask"	"models\FuzzyLeo\PortalTARDIS/elevatorshaft_wall_env"
	"$basemapalphaphongmask" "1"
	"$phong" 1
	"$phongboost"	"4"
	"$phongexponenttexture"	"models\FuzzyLeo\PortalTARDIS/elevatorshaft_wall_exp"
	"$phongfresnelranges"	"[5 1.5 2]"
}