"VertexLitGeneric"
{
	"$basetexture"	"models\FuzzyLeo\PortalTARDIS/kb_mouse"
	"$surfaceprop"	"plastic"
	"$bumpmap"	"models\FuzzyLeo\PortalTARDIS/kb_mouse_n"
	"$selfillum"	1
	//phong properties
	"$phong"	"1"
	"$phongboost"	"2"
	"$phongexponenttexture"	"models\FuzzyLeo\PortalTARDIS/kb_mouse_exp"
	"$phongfresnelranges"	"[1 1.5 2]"
}