"VertexLitGeneric"
{
	"$basetexture" "models\FuzzyLeo\PortalTARDIS\concrete/modularwallglow"
	"$selfillum" "1"
	"$surfaceprop" "concrete"
	"%keywords" "portal"

	"LightmappedGeneric_HDR_DX9"
	{
		"$bumpmap" "models\FuzzyLeo\PortalTARDIS\concrete/concrete_modular_floor001_height-ssbump"
		"$ssbump" "1"
	}

	"LightmappedGeneric_DX9"
	{
		"$bumpmap" "models\FuzzyLeo\PortalTARDIS\concrete/concrete_modular_floor001_height-ssbump"
		"$ssbump" "1"
	}

	"LightmappedGeneric_DX8"
	{
		"$bumpmap" "models\FuzzyLeo\PortalTARDIS\concrete/concrete_modular_ceiling001a_normal"
		"$nodiffusebumplighting" 1
		"$normalmapalphaenvmapmask" 1
	}

	"LightmappedGeneric_NoBump_DX8"
	{
		"$basetexture" "models\FuzzyLeo\PortalTARDIS\concrete/concrete_modular_ceiling001a"
		"$basealphaenvmapmask" 1
	}
}
