"UnlitGeneric"
{
	"$baseTexture" "models/FuzzyLeo/kleinerxenvortex"
	"Proxies"
	{
		"TextureScroll"
		{
			"texturescrollvar" "$baseTextureTransform"
			"texturescrollrate" -0.01
			"texturescrollangle" 0
		}
	}

}


