// Created by Crowbar 0.72

$modelname "The_Sniper_9/DoctorWho/Tardis/TardisInterior.mdl"

$staticprop

$bodygroup "TardisInterior1"
{
	studio "TardisInterior1.smd"
}
$bodygroup "TardisInterior2"
{
	studio "TardisInterior2.smd"
}
$bodygroup "TardisInterior3"
{
	studio "TardisInterior3.smd"
}
$bodygroup "TardisInterior4"
{
	studio "TardisInterior4.smd"
}
$bodygroup "TardisInteriorCenter"
{
	studio "TardisInteriorCenter.smd"
}
$bodygroup "TardisInteriorDetail"
{
	studio "TardisInteriorDetail.smd"
}
$bodygroup "TardisSupport"
{
	studio "TardisSupport.smd"
}


$surfaceprop "concrete"

$contents "solid"

$illumposition 0 27.275 164.678

$cdmaterials "The_Sniper_9\DoctorWho\Tardis\"

$cbox 0 0 0 0 0 0

$bbox -383.422 -333.749 -2.196 328.871 333.749 331.552

$definebone "static_prop" "" 0 0 0 0 0 0 0 0 0 0 0 0


$sequence "idle" {
	"tardisinterior_anims\idle.smd"
	fadein 0.2
	fadeout 0.2
	fps 1
}

$collisionmodel "tardisinterior_physics.smd"
{
	$mass 500
	$inertia 1
	$damping 0
	$rotdamping 0
	$rootbone " "
	$concave
	$maxconvexpieces 88

}
