"VertexLitGeneric"
{
	"$baseTexture" "models\doctor_who\gman sheet 2"
	"$bumpmap" "Doctor_Who/normals/Doctor_Suit_NRM"
	"$model" "1"
	"$halflambert" "1"
	"$rimlight" "1"									
	"$rimlightexponent" "5"								
	"$rimlightboost" "0.8"
}