"VertexlitGeneric"
{
	"$basetexture" "The_Sniper_9/DoctorWho/Daleks/PureDalek/ScientistDalek"
	"$bumpmap" "The_Sniper_9/DoctorWho/Daleks/PureDalek/SupremeDalek_NRM"
	"$phong" "1"
	"$phongboost"   "1"
	"$phongfresnelranges"	"[0.4 1 2]"
	"$phongexponent"	"5"
	"$surfaceprop" "Metal"
}
