// Created by Crowbar 0.72
version 1
nodes
  0 "static_prop" -1
end
skeleton
  time 0
    0 0.000000 0.000000 0.000000 0.000000 0.000000 0.000000
end
triangles
  phy
    0 28.913005 29.328658 -0.894409 -0.041782 0.995588 0.084013 0 0
    0 -28.901656 29.328653 -0.894409 -0.164982 0.982804 -0.082934 0 0
    0 28.913005 29.328658 3.984313 -0.164982 -0.982804 0.082934 0 0
  phy
    0 28.913005 29.328658 3.984313 -0.164982 -0.982804 0.082934 0 0
    0 -28.901656 29.328653 -0.894409 -0.164982 0.982804 -0.082934 0 0
    0 -28.901656 29.328653 3.984313 -0.041782 -0.995588 -0.084013 0 0
  phy
    0 -28.901654 -28.796834 3.984313 0.164982 -0.982804 -0.082934 0 0
    0 -28.901656 29.328653 3.984313 -0.041782 -0.995588 -0.084013 0 0
    0 -28.901654 -28.796834 -0.894409 0.041782 0.995588 -0.084013 0 0
  phy
    0 -28.901654 -28.796834 -0.894409 0.041782 0.995588 -0.084013 0 0
    0 -28.901656 29.328653 3.984313 -0.041782 -0.995588 -0.084013 0 0
    0 -28.901656 29.328653 -0.894409 -0.164982 0.982804 -0.082934 0 0
  phy
    0 -28.901654 -28.796834 -0.894409 0.041782 0.995588 -0.084013 0 0
    0 -28.901656 29.328653 -0.894409 -0.164982 0.982804 -0.082934 0 0
    0 28.913005 29.328658 -0.894409 -0.041782 0.995588 0.084013 0 0
  phy
    0 -28.901654 -28.796834 -0.894409 0.041782 0.995588 -0.084013 0 0
    0 28.913005 29.328658 -0.894409 -0.041782 0.995588 0.084013 0 0
    0 28.913009 -28.796832 -0.894409 0.164982 0.982804 0.082934 0 0
  phy
    0 28.913009 -28.796832 -0.894409 0.164982 0.982804 0.082934 0 0
    0 -28.901654 -28.796834 3.984313 0.164982 -0.982804 -0.082934 0 0
    0 -28.901654 -28.796834 -0.894409 0.041782 0.995588 -0.084013 0 0
  phy
    0 28.913009 -28.796832 -0.894409 0.164982 0.982804 0.082934 0 0
    0 28.913009 -28.796832 3.984313 0.041782 -0.995588 0.084013 0 0
    0 -28.901654 -28.796834 3.984313 0.164982 -0.982804 -0.082934 0 0
  phy
    0 28.913005 29.328658 -0.894409 -0.041782 0.995588 0.084013 0 0
    0 28.913009 -28.796832 3.984313 0.041782 -0.995588 0.084013 0 0
    0 28.913009 -28.796832 -0.894409 0.164982 0.982804 0.082934 0 0
  phy
    0 28.913005 29.328658 -0.894409 -0.041782 0.995588 0.084013 0 0
    0 28.913005 29.328658 3.984313 -0.164982 -0.982804 0.082934 0 0
    0 28.913009 -28.796832 3.984313 0.041782 -0.995588 0.084013 0 0
  phy
    0 28.913005 29.328658 3.984313 -0.164982 -0.982804 0.082934 0 0
    0 -28.901656 29.328653 3.984313 -0.041782 -0.995588 -0.084013 0 0
    0 28.913009 -28.796832 3.984313 0.041782 -0.995588 0.084013 0 0
  phy
    0 -28.901656 29.328653 3.984313 -0.041782 -0.995588 -0.084013 0 0
    0 -28.901654 -28.796834 3.984313 0.164982 -0.982804 -0.082934 0 0
    0 28.913009 -28.796832 3.984313 0.041782 -0.995588 0.084013 0 0
  phy
    0 -23.336992 -23.614947 86.600349 0.862821 -0.246465 -0.441357 0 0
    0 23.348348 -23.614945 2.998573 0.649155 0.370863 0.664122 0 0
    0 23.348348 -23.614945 86.600349 0.546181 -0.624066 0.558773 0 0
  phy
    0 -23.336992 -23.614947 86.600349 0.862821 -0.246465 -0.441357 0 0
    0 -23.336992 -23.614947 2.998573 0.425900 0.243317 -0.871439 0 0
    0 23.348348 -23.614945 2.998573 0.649155 0.370863 0.664122 0 0
  phy
    0 -23.336992 -23.614947 2.998573 0.425900 0.243317 -0.871439 0 0
    0 -23.336995 24.146766 2.998573 -0.546181 0.624066 -0.558773 0 0
    0 23.348348 -23.614945 2.998573 0.649155 0.370863 0.664122 0 0
  phy
    0 23.348348 -23.614945 2.998573 0.649155 0.370863 0.664122 0 0
    0 -23.336995 24.146766 2.998573 -0.546181 0.624066 -0.558773 0 0
    0 23.348346 24.146771 2.998573 -0.862821 0.246465 0.441357 0 0
  phy
    0 -23.336992 -23.614947 2.998573 0.425900 0.243317 -0.871439 0 0
    0 -23.336995 24.146766 86.600349 -0.649155 -0.370863 -0.664122 0 0
    0 -23.336995 24.146766 2.998573 -0.546181 0.624066 -0.558773 0 0
  phy
    0 -23.336995 24.146766 86.600349 -0.649155 -0.370863 -0.664122 0 0
    0 -23.336992 -23.614947 2.998573 0.425900 0.243317 -0.871439 0 0
    0 -23.336992 -23.614947 86.600349 0.862821 -0.246465 -0.441357 0 0
  phy
    0 -23.336995 24.146766 2.998573 -0.546181 0.624066 -0.558773 0 0
    0 -23.336995 24.146766 86.600349 -0.649155 -0.370863 -0.664122 0 0
    0 23.348346 24.146771 2.998573 -0.862821 0.246465 0.441357 0 0
  phy
    0 23.348346 24.146771 2.998573 -0.862821 0.246465 0.441357 0 0
    0 -23.336995 24.146766 86.600349 -0.649155 -0.370863 -0.664122 0 0
    0 23.348346 24.146771 86.600349 -0.425900 -0.243317 0.871439 0 0
  phy
    0 -23.336992 -23.614947 86.600349 0.862821 -0.246465 -0.441357 0 0
    0 23.348348 -23.614945 86.600349 0.546181 -0.624066 0.558773 0 0
    0 -23.336995 24.146766 86.600349 -0.649155 -0.370863 -0.664122 0 0
  phy
    0 23.348348 -23.614945 86.600349 0.546181 -0.624066 0.558773 0 0
    0 23.348346 24.146771 86.600349 -0.425900 -0.243317 0.871439 0 0
    0 -23.336995 24.146766 86.600349 -0.649155 -0.370863 -0.664122 0 0
  phy
    0 23.348346 24.146771 86.600349 -0.425900 -0.243317 0.871439 0 0
    0 23.348348 -23.614945 2.998573 0.649155 0.370863 0.664122 0 0
    0 23.348346 24.146771 2.998573 -0.862821 0.246465 0.441357 0 0
  phy
    0 23.348346 24.146771 86.600349 -0.425900 -0.243317 0.871439 0 0
    0 23.348348 -23.614945 86.600349 0.546181 -0.624066 0.558773 0 0
    0 23.348348 -23.614945 2.998573 0.649155 0.370863 0.664122 0 0
  phy
    0 25.845815 17.797556 86.600349 0.437743 -0.085028 0.895070 0 0
    0 25.845813 25.917043 2.998573 -0.438935 0.042630 0.897507 0 0
    0 25.845813 25.917043 86.600349 -0.889577 -0.043198 0.454738 0 0
  phy
    0 25.845815 17.797556 86.600349 0.437743 -0.085028 0.895070 0 0
    0 25.845815 17.797556 2.998573 0.887097 0.086156 0.453470 0 0
    0 25.845813 25.917043 2.998573 -0.438935 0.042630 0.897507 0 0
  phy
    0 17.903973 25.917041 86.600349 -0.437743 -0.085028 -0.895070 0 0
    0 25.845813 25.917043 86.600349 -0.889577 -0.043198 0.454738 0 0
    0 17.903973 25.917041 2.998573 -0.887097 0.086156 -0.453470 0 0
  phy
    0 17.903973 25.917041 2.998573 -0.887097 0.086156 -0.453470 0 0
    0 25.845813 25.917043 86.600349 -0.889577 -0.043198 0.454738 0 0
    0 25.845813 25.917043 2.998573 -0.438935 0.042630 0.897507 0 0
  phy
    0 17.903973 25.917041 2.998573 -0.887097 0.086156 -0.453470 0 0
    0 25.845813 25.917043 2.998573 -0.438935 0.042630 0.897507 0 0
    0 25.845815 17.797556 2.998573 0.887097 0.086156 0.453470 0 0
  phy
    0 17.903973 25.917041 2.998573 -0.887097 0.086156 -0.453470 0 0
    0 25.845815 17.797556 2.998573 0.887097 0.086156 0.453470 0 0
    0 17.903974 17.797554 2.998573 0.438935 0.042630 -0.897507 0 0
  phy
    0 25.845815 17.797556 2.998573 0.887097 0.086156 0.453470 0 0
    0 17.903974 17.797554 86.600349 0.889577 -0.043198 -0.454737 0 0
    0 17.903974 17.797554 2.998573 0.438935 0.042630 -0.897507 0 0
  phy
    0 25.845815 17.797556 2.998573 0.887097 0.086156 0.453470 0 0
    0 25.845815 17.797556 86.600349 0.437743 -0.085028 0.895070 0 0
    0 17.903974 17.797554 86.600349 0.889577 -0.043198 -0.454737 0 0
  phy
    0 25.845813 25.917043 86.600349 -0.889577 -0.043198 0.454738 0 0
    0 17.903973 25.917041 86.600349 -0.437743 -0.085028 -0.895070 0 0
    0 25.845815 17.797556 86.600349 0.437743 -0.085028 0.895070 0 0
  phy
    0 17.903973 25.917041 86.600349 -0.437743 -0.085028 -0.895070 0 0
    0 17.903974 17.797554 86.600349 0.889577 -0.043198 -0.454737 0 0
    0 25.845815 17.797556 86.600349 0.437743 -0.085028 0.895070 0 0
  phy
    0 17.903974 17.797554 2.998573 0.438935 0.042630 -0.897507 0 0
    0 17.903973 25.917041 86.600349 -0.437743 -0.085028 -0.895070 0 0
    0 17.903973 25.917041 2.998573 -0.887097 0.086156 -0.453470 0 0
  phy
    0 17.903973 25.917041 86.600349 -0.437743 -0.085028 -0.895070 0 0
    0 17.903974 17.797554 2.998573 0.438935 0.042630 -0.897507 0 0
    0 17.903974 17.797554 86.600349 0.889577 -0.043198 -0.454737 0 0
  phy
    0 30.047621 -21.442776 93.654394 0.160197 -0.980274 0.115760 0 0
    0 -30.036271 21.974597 93.654394 -0.080880 -0.989846 -0.116890 0 0
    0 -30.036278 -21.442769 93.654394 0.160197 -0.980274 -0.115760 0 0
  phy
    0 30.047621 -21.442776 93.654394 0.160197 -0.980274 0.115760 0 0
    0 30.047628 21.974590 93.654394 -0.308729 -0.944587 0.111546 0 0
    0 -30.036271 21.974597 93.654394 -0.080880 -0.989846 -0.116890 0 0
  phy
    0 -30.036278 -21.442769 93.654394 0.160197 -0.980274 -0.115760 0 0
    0 -30.036278 -21.442769 86.559114 0.303124 0.927436 -0.219041 0 0
    0 30.047621 -21.442776 93.654394 0.160197 -0.980274 0.115760 0 0
  phy
    0 -30.036278 -21.442769 86.559114 0.303124 0.927436 -0.219041 0 0
    0 -30.036278 -21.442769 93.654394 0.160197 -0.980274 -0.115760 0 0
    0 -30.036271 21.974597 93.654394 -0.080880 -0.989846 -0.116890 0 0
  phy
    0 30.047621 -21.442776 93.654394 0.160197 -0.980274 0.115760 0 0
    0 30.047628 21.974590 86.559114 -0.157071 0.961145 0.227002 0 0
    0 30.047628 21.974590 93.654394 -0.308729 -0.944587 0.111546 0 0
  phy
    0 30.047621 -21.442776 93.654394 0.160197 -0.980274 0.115760 0 0
    0 30.047621 -21.442776 86.559114 0.081298 0.994957 0.058747 0 0
    0 30.047628 21.974590 86.559114 -0.157071 0.961145 0.227002 0 0
  phy
    0 -30.036278 -21.442769 86.559114 0.303124 0.927436 -0.219041 0 0
    0 30.047621 -21.442776 86.559114 0.081298 0.994957 0.058747 0 0
    0 30.047621 -21.442776 93.654394 0.160197 -0.980274 0.115760 0 0
  phy
    0 30.047628 21.974590 86.559114 -0.157071 0.961145 0.227002 0 0
    0 -30.036271 21.974597 86.559114 -0.161008 0.985237 -0.058173 0 0
    0 30.047628 21.974590 93.654394 -0.308729 -0.944587 0.111546 0 0
  phy
    0 30.047628 21.974590 93.654394 -0.308729 -0.944587 0.111546 0 0
    0 -30.036271 21.974597 86.559114 -0.161008 0.985237 -0.058173 0 0
    0 -30.036271 21.974597 93.654394 -0.080880 -0.989846 -0.116890 0 0
  phy
    0 -30.036271 21.974597 86.559114 -0.161008 0.985237 -0.058173 0 0
    0 30.047628 21.974590 86.559114 -0.157071 0.961145 0.227002 0 0
    0 30.047621 -21.442776 86.559114 0.081298 0.994957 0.058747 0 0
  phy
    0 -30.036271 21.974597 86.559114 -0.161008 0.985237 -0.058173 0 0
    0 30.047621 -21.442776 86.559114 0.081298 0.994957 0.058747 0 0
    0 -30.036278 -21.442769 86.559114 0.303124 0.927436 -0.219041 0 0
  phy
    0 -30.036278 -21.442769 86.559114 0.303124 0.927436 -0.219041 0 0
    0 -30.036271 21.974597 93.654394 -0.080880 -0.989846 -0.116890 0 0
    0 -30.036271 21.974597 86.559114 -0.161008 0.985237 -0.058173 0 0
  phy
    0 -23.650583 -24.258473 100.886090 0.145123 -0.977908 -0.150448 0 0
    0 23.661939 -24.258469 100.886090 0.145122 -0.977908 0.150448 0 0
    0 -23.650586 24.790290 100.886090 -0.145122 -0.977908 -0.150448 0 0
  phy
    0 23.661939 -24.258469 100.886090 0.145122 -0.977908 0.150448 0 0
    0 23.661936 24.790295 100.886090 -0.145123 -0.977908 0.150448 0 0
    0 -23.650586 24.790290 100.886090 -0.145122 -0.977908 -0.150448 0 0
  phy
    0 -23.650586 24.790290 100.886090 -0.145122 -0.977908 -0.150448 0 0
    0 23.661936 24.790295 100.886090 -0.145123 -0.977908 0.150448 0 0
    0 23.661936 24.790295 93.607208 -0.272909 0.919497 0.282923 0 0
  phy
    0 -23.650586 24.790290 93.607208 -0.073780 0.994337 -0.076488 0 0
    0 -23.650586 24.790290 100.886090 -0.145122 -0.977908 -0.150448 0 0
    0 23.661936 24.790295 93.607208 -0.272909 0.919497 0.282923 0 0
  phy
    0 -23.650583 -24.258473 100.886090 0.145123 -0.977908 -0.150448 0 0
    0 -23.650586 24.790290 100.886090 -0.145122 -0.977908 -0.150448 0 0
    0 -23.650583 -24.258473 93.607208 0.272909 0.919497 -0.282923 0 0
  phy
    0 -23.650586 24.790290 100.886090 -0.145122 -0.977908 -0.150448 0 0
    0 -23.650586 24.790290 93.607208 -0.073780 0.994337 -0.076488 0 0
    0 -23.650583 -24.258473 93.607208 0.272909 0.919497 -0.282923 0 0
  phy
    0 23.661939 -24.258469 100.886090 0.145122 -0.977908 0.150448 0 0
    0 23.661936 24.790295 93.607208 -0.272909 0.919497 0.282923 0 0
    0 23.661936 24.790295 100.886090 -0.145123 -0.977908 0.150448 0 0
  phy
    0 23.661939 -24.258469 100.886090 0.145122 -0.977908 0.150448 0 0
    0 23.661939 -24.258469 93.607208 0.073780 0.994337 0.076488 0 0
    0 23.661936 24.790295 93.607208 -0.272909 0.919497 0.282923 0 0
  phy
    0 -23.650583 -24.258473 100.886090 0.145123 -0.977908 -0.150448 0 0
    0 -23.650583 -24.258473 93.607208 0.272909 0.919497 -0.282923 0 0
    0 23.661939 -24.258469 100.886090 0.145122 -0.977908 0.150448 0 0
  phy
    0 23.661939 -24.258469 100.886090 0.145122 -0.977908 0.150448 0 0
    0 -23.650583 -24.258473 93.607208 0.272909 0.919497 -0.282923 0 0
    0 23.661939 -24.258469 93.607208 0.073780 0.994337 0.076488 0 0
  phy
    0 -23.650586 24.790290 93.607208 -0.073780 0.994337 -0.076488 0 0
    0 23.661936 24.790295 93.607208 -0.272909 0.919497 0.282923 0 0
    0 23.661939 -24.258469 93.607208 0.073780 0.994337 0.076488 0 0
  phy
    0 -23.650586 24.790290 93.607208 -0.073780 0.994337 -0.076488 0 0
    0 23.661939 -24.258469 93.607208 0.073780 0.994337 0.076488 0 0
    0 -23.650583 -24.258473 93.607208 0.272909 0.919497 -0.282923 0 0
  phy
    0 -4.962139 -4.638966 104.418514 0.859425 0.285282 -0.424268 0 0
    0 -4.962139 -4.638966 119.194656 0.387425 -0.514417 -0.765034 0 0
    0 -4.962139 5.170787 104.418514 -0.387425 0.514417 -0.765034 0 0
  phy
    0 -4.962139 5.170787 104.418514 -0.387425 0.514417 -0.765034 0 0
    0 -4.962139 -4.638966 119.194656 0.387425 -0.514417 -0.765034 0 0
    0 -4.962139 5.170787 119.194656 -0.859425 -0.285282 -0.424268 0 0
  phy
    0 -4.962139 -4.638966 104.418514 0.859425 0.285282 -0.424268 0 0
    0 4.973492 -4.638966 119.194656 0.859425 -0.285282 0.424268 0 0
    0 -4.962139 -4.638966 119.194656 0.387425 -0.514417 -0.765034 0 0
  phy
    0 -4.962139 -4.638966 104.418514 0.859425 0.285282 -0.424268 0 0
    0 4.973492 -4.638966 104.418514 0.387425 0.514417 0.765034 0 0
    0 4.973492 -4.638966 119.194656 0.859425 -0.285282 0.424268 0 0
  phy
    0 -4.962139 -4.638966 119.194656 0.387425 -0.514417 -0.765034 0 0
    0 4.973492 5.170787 119.194656 -0.387425 -0.514417 0.765034 0 0
    0 -4.962139 5.170787 119.194656 -0.859425 -0.285282 -0.424268 0 0
  phy
    0 -4.962139 -4.638966 119.194656 0.387425 -0.514417 -0.765034 0 0
    0 4.973492 -4.638966 119.194656 0.859425 -0.285282 0.424268 0 0
    0 4.973492 5.170787 119.194656 -0.387425 -0.514417 0.765034 0 0
  phy
    0 -4.962139 -4.638966 104.418514 0.859425 0.285282 -0.424268 0 0
    0 -4.962139 5.170787 104.418514 -0.387425 0.514417 -0.765034 0 0
    0 4.973492 -4.638966 104.418514 0.387425 0.514417 0.765034 0 0
  phy
    0 4.973492 -4.638966 104.418514 0.387425 0.514417 0.765034 0 0
    0 -4.962139 5.170787 104.418514 -0.387425 0.514417 -0.765034 0 0
    0 4.973492 5.170787 104.418514 -0.859425 0.285282 0.424268 0 0
  phy
    0 -4.962139 5.170787 104.418514 -0.387425 0.514417 -0.765034 0 0
    0 -4.962139 5.170787 119.194656 -0.859425 -0.285282 -0.424268 0 0
    0 4.973492 5.170787 104.418514 -0.859425 0.285282 0.424268 0 0
  phy
    0 4.973492 5.170787 104.418514 -0.859425 0.285282 0.424268 0 0
    0 -4.962139 5.170787 119.194656 -0.859425 -0.285282 -0.424268 0 0
    0 4.973492 5.170787 119.194656 -0.387425 -0.514417 0.765034 0 0
  phy
    0 4.973492 5.170787 119.194656 -0.387425 -0.514417 0.765034 0 0
    0 4.973492 -4.638966 104.418514 0.387425 0.514417 0.765034 0 0
    0 4.973492 5.170787 104.418514 -0.859425 0.285282 0.424268 0 0
  phy
    0 4.973492 5.170787 119.194656 -0.387425 -0.514417 0.765034 0 0
    0 4.973492 -4.638966 119.194656 0.859425 -0.285282 0.424268 0 0
    0 4.973492 -4.638966 104.418514 0.387425 0.514417 0.765034 0 0
  phy
    0 17.903976 -25.800021 2.998573 0.887098 0.086156 -0.453470 0 0
    0 17.903976 -25.800021 86.600349 0.437744 -0.085028 -0.895070 0 0
    0 17.903974 -17.680534 2.998573 -0.438935 0.042630 -0.897507 0 0
  phy
    0 17.903974 -17.680534 2.998573 -0.438935 0.042630 -0.897507 0 0
    0 17.903976 -25.800021 86.600349 0.437744 -0.085028 -0.895070 0 0
    0 17.903974 -17.680534 86.600349 -0.889577 -0.043198 -0.454738 0 0
  phy
    0 17.903976 -25.800021 2.998573 0.887098 0.086156 -0.453470 0 0
    0 25.845818 -25.800021 86.600349 0.889577 -0.043198 0.454738 0 0
    0 17.903976 -25.800021 86.600349 0.437744 -0.085028 -0.895070 0 0
  phy
    0 17.903976 -25.800021 2.998573 0.887098 0.086156 -0.453470 0 0
    0 25.845818 -25.800021 2.998573 0.438935 0.042630 0.897507 0 0
    0 25.845818 -25.800021 86.600349 0.889577 -0.043198 0.454738 0 0
  phy
    0 17.903976 -25.800021 86.600349 0.437744 -0.085028 -0.895070 0 0
    0 25.845815 -17.680533 86.600349 -0.437744 -0.085028 0.895070 0 0
    0 17.903974 -17.680534 86.600349 -0.889577 -0.043198 -0.454738 0 0
  phy
    0 17.903976 -25.800021 86.600349 0.437744 -0.085028 -0.895070 0 0
    0 25.845818 -25.800021 86.600349 0.889577 -0.043198 0.454738 0 0
    0 25.845815 -17.680533 86.600349 -0.437744 -0.085028 0.895070 0 0
  phy
    0 17.903976 -25.800021 2.998573 0.887098 0.086156 -0.453470 0 0
    0 17.903974 -17.680534 2.998573 -0.438935 0.042630 -0.897507 0 0
    0 25.845815 -17.680533 2.998573 -0.887098 0.086156 0.453470 0 0
  phy
    0 17.903976 -25.800021 2.998573 0.887098 0.086156 -0.453470 0 0
    0 25.845815 -17.680533 2.998573 -0.887098 0.086156 0.453470 0 0
    0 25.845818 -25.800021 2.998573 0.438935 0.042630 0.897507 0 0
  phy
    0 25.845815 -17.680533 86.600349 -0.437744 -0.085028 0.895070 0 0
    0 25.845818 -25.800021 2.998573 0.438935 0.042630 0.897507 0 0
    0 25.845815 -17.680533 2.998573 -0.887098 0.086156 0.453470 0 0
  phy
    0 25.845815 -17.680533 86.600349 -0.437744 -0.085028 0.895070 0 0
    0 25.845818 -25.800021 86.600349 0.889577 -0.043198 0.454738 0 0
    0 25.845818 -25.800021 2.998573 0.438935 0.042630 0.897507 0 0
  phy
    0 25.845815 -17.680533 86.600349 -0.437744 -0.085028 0.895070 0 0
    0 25.845815 -17.680533 2.998573 -0.887098 0.086156 0.453470 0 0
    0 17.903974 -17.680534 86.600349 -0.889577 -0.043198 -0.454738 0 0
  phy
    0 17.903974 -17.680534 86.600349 -0.889577 -0.043198 -0.454738 0 0
    0 25.845815 -17.680533 2.998573 -0.887098 0.086156 0.453470 0 0
    0 17.903974 -17.680534 2.998573 -0.438935 0.042630 -0.897507 0 0
  phy
    0 -25.884479 -17.680536 2.998573 -0.887097 0.086156 -0.453470 0 0
    0 -25.884476 -25.800023 2.998573 0.438935 0.042630 -0.897507 0 0
    0 -25.884479 -17.680536 86.600349 -0.437743 -0.085028 -0.895070 0 0
  phy
    0 -25.884479 -17.680536 86.600349 -0.437743 -0.085028 -0.895070 0 0
    0 -25.884476 -25.800023 2.998573 0.438935 0.042630 -0.897507 0 0
    0 -25.884476 -25.800023 86.600349 0.889577 -0.043198 -0.454738 0 0
  phy
    0 -17.942636 -25.800021 2.998573 0.697636 0.067755 0.713241 0 0
    0 -25.884476 -25.800023 86.600349 0.889577 -0.043198 -0.454738 0 0
    0 -25.884476 -25.800023 2.998573 0.438935 0.042630 -0.897507 0 0
  phy
    0 -17.942636 -25.800021 2.998573 0.697636 0.067755 0.713241 0 0
    0 -17.942636 -25.800021 86.600349 0.692881 -0.134587 0.708380 0 0
    0 -25.884476 -25.800023 86.600349 0.889577 -0.043198 -0.454738 0 0
  phy
    0 -17.942636 -25.800021 2.998573 0.697636 0.067755 0.713241 0 0
    0 -25.884476 -25.800023 2.998573 0.438935 0.042630 -0.897507 0 0
    0 -25.884479 -17.680536 2.998573 -0.887097 0.086156 -0.453470 0 0
  phy
    0 -17.942636 -25.800021 2.998573 0.697636 0.067755 0.713241 0 0
    0 -25.884479 -17.680536 2.998573 -0.887097 0.086156 -0.453470 0 0
    0 -17.942638 -17.680534 2.998573 -0.697636 0.067755 0.713241 0 0
  phy
    0 -17.942638 -17.680534 2.998573 -0.697636 0.067755 0.713241 0 0
    0 -25.884479 -17.680536 2.998573 -0.887097 0.086156 -0.453470 0 0
    0 -17.942638 -17.680534 86.600349 -0.698840 -0.033936 0.714472 0 0
  phy
    0 -17.942638 -17.680534 86.600349 -0.698840 -0.033936 0.714472 0 0
    0 -25.884479 -17.680536 2.998573 -0.887097 0.086156 -0.453470 0 0
    0 -25.884479 -17.680536 86.600349 -0.437743 -0.085028 -0.895070 0 0
  phy
    0 -25.884479 -17.680536 86.600349 -0.437743 -0.085028 -0.895070 0 0
    0 -17.942636 -25.800021 86.600349 0.692881 -0.134587 0.708380 0 0
    0 -17.942638 -17.680534 86.600349 -0.698840 -0.033936 0.714472 0 0
  phy
    0 -25.884479 -17.680536 86.600349 -0.437743 -0.085028 -0.895070 0 0
    0 -25.884476 -25.800023 86.600349 0.889577 -0.043198 -0.454738 0 0
    0 -17.942636 -25.800021 86.600349 0.692881 -0.134587 0.708380 0 0
  phy
    0 -17.942636 -25.800021 2.998573 0.697636 0.067755 0.713241 0 0
    0 -17.942638 -17.680534 86.600349 -0.698840 -0.033936 0.714472 0 0
    0 -17.942636 -25.800021 86.600349 0.692881 -0.134587 0.708380 0 0
  phy
    0 -17.942638 -17.680534 2.998573 -0.697636 0.067755 0.713241 0 0
    0 -17.942638 -17.680534 86.600349 -0.698840 -0.033936 0.714472 0 0
    0 -17.942636 -25.800021 2.998573 0.697636 0.067755 0.713241 0 0
  phy
    0 -25.884479 17.797552 86.600349 0.887098 -0.086156 -0.453470 0 0
    0 -25.884481 25.917041 86.600349 -0.438935 -0.042630 -0.897507 0 0
    0 -25.884479 17.797552 2.998573 0.437744 0.085028 -0.895070 0 0
  phy
    0 -25.884479 17.797552 2.998573 0.437744 0.085028 -0.895070 0 0
    0 -25.884481 25.917041 86.600349 -0.438935 -0.042630 -0.897507 0 0
    0 -25.884481 25.917041 2.998573 -0.889577 0.043198 -0.454738 0 0
  phy
    0 -17.942638 17.797554 2.998573 0.698840 0.033936 0.714472 0 0
    0 -25.884479 17.797552 2.998573 0.437744 0.085028 -0.895070 0 0
    0 -17.942640 25.917041 2.998573 -0.692881 0.134587 0.708380 0 0
  phy
    0 -17.942640 25.917041 2.998573 -0.692881 0.134587 0.708380 0 0
    0 -25.884479 17.797552 2.998573 0.437744 0.085028 -0.895070 0 0
    0 -25.884481 25.917041 2.998573 -0.889577 0.043198 -0.454738 0 0
  phy
    0 -17.942638 17.797554 2.998573 0.698840 0.033936 0.714472 0 0
    0 -25.884479 17.797552 86.600349 0.887098 -0.086156 -0.453470 0 0
    0 -25.884479 17.797552 2.998573 0.437744 0.085028 -0.895070 0 0
  phy
    0 -17.942638 17.797554 2.998573 0.698840 0.033936 0.714472 0 0
    0 -17.942640 25.917041 86.600349 -0.697636 -0.067755 0.713241 0 0
    0 -17.942638 17.797554 86.600349 0.697636 -0.067755 0.713241 0 0
  phy
    0 -17.942638 17.797554 2.998573 0.698840 0.033936 0.714472 0 0
    0 -17.942640 25.917041 2.998573 -0.692881 0.134587 0.708380 0 0
    0 -17.942640 25.917041 86.600349 -0.697636 -0.067755 0.713241 0 0
  phy
    0 -17.942640 25.917041 2.998573 -0.692881 0.134587 0.708380 0 0
    0 -25.884481 25.917041 2.998573 -0.889577 0.043198 -0.454738 0 0
    0 -17.942640 25.917041 86.600349 -0.697636 -0.067755 0.713241 0 0
  phy
    0 -17.942640 25.917041 86.600349 -0.697636 -0.067755 0.713241 0 0
    0 -25.884481 25.917041 2.998573 -0.889577 0.043198 -0.454738 0 0
    0 -25.884481 25.917041 86.600349 -0.438935 -0.042630 -0.897507 0 0
  phy
    0 -17.942640 25.917041 86.600349 -0.697636 -0.067755 0.713241 0 0
    0 -25.884479 17.797552 86.600349 0.887098 -0.086156 -0.453470 0 0
    0 -17.942638 17.797554 86.600349 0.697636 -0.067755 0.713241 0 0
  phy
    0 -17.942640 25.917041 86.600349 -0.697636 -0.067755 0.713241 0 0
    0 -25.884481 25.917041 86.600349 -0.438935 -0.042630 -0.897507 0 0
    0 -25.884479 17.797552 86.600349 0.887098 -0.086156 -0.453470 0 0
  phy
    0 -17.942638 17.797554 86.600349 0.697636 -0.067755 0.713241 0 0
    0 -25.884479 17.797552 86.600349 0.887098 -0.086156 -0.453470 0 0
    0 -17.942638 17.797554 2.998573 0.698840 0.033936 0.714472 0 0
  phy
    0 -21.703009 30.611317 93.361806 -0.216234 -0.964574 -0.151131 0 0
    0 -21.703009 30.611317 86.559114 -0.106353 0.948833 -0.297329 0 0
    0 -21.703004 -30.079493 93.361806 0.055284 -0.986436 -0.154556 0 0
  phy
    0 -21.703004 -30.079493 93.361806 0.055284 -0.986436 -0.154556 0 0
    0 -21.703009 30.611317 86.559114 -0.106353 0.948833 -0.297329 0 0
    0 -21.703004 -30.079493 86.559114 0.111054 0.990779 -0.077618 0 0
  phy
    0 -21.703004 -30.079493 93.361806 0.055284 -0.986436 -0.154556 0 0
    0 21.714357 30.611317 93.361806 -0.055284 -0.986436 0.154556 0 0
    0 -21.703009 30.611317 93.361806 -0.216234 -0.964574 -0.151131 0 0
  phy
    0 -21.703004 -30.079493 93.361806 0.055284 -0.986436 -0.154556 0 0
    0 21.714362 -30.079493 93.361806 0.216234 -0.964574 0.151131 0 0
    0 21.714357 30.611317 93.361806 -0.055284 -0.986436 0.154556 0 0
  phy
    0 -21.703004 -30.079493 86.559114 0.111054 0.990779 -0.077618 0 0
    0 21.714362 -30.079493 93.361806 0.216234 -0.964574 0.151131 0 0
    0 -21.703004 -30.079493 93.361806 0.055284 -0.986436 -0.154556 0 0
  phy
    0 -21.703004 -30.079493 86.559114 0.111054 0.990779 -0.077618 0 0
    0 21.714362 -30.079493 86.559114 0.106353 0.948833 0.297329 0 0
    0 21.714362 -30.079493 93.361806 0.216234 -0.964574 0.151131 0 0
  phy
    0 -21.703009 30.611317 86.559114 -0.106353 0.948833 -0.297329 0 0
    0 -21.703009 30.611317 93.361806 -0.216234 -0.964574 -0.151131 0 0
    0 21.714357 30.611317 86.559114 -0.111054 0.990779 0.077618 0 0
  phy
    0 21.714357 30.611317 86.559114 -0.111054 0.990779 0.077618 0 0
    0 -21.703009 30.611317 93.361806 -0.216234 -0.964574 -0.151131 0 0
    0 21.714357 30.611317 93.361806 -0.055284 -0.986436 0.154556 0 0
  phy
    0 -21.703004 -30.079493 86.559114 0.111054 0.990779 -0.077618 0 0
    0 -21.703009 30.611317 86.559114 -0.106353 0.948833 -0.297329 0 0
    0 21.714357 30.611317 86.559114 -0.111054 0.990779 0.077618 0 0
  phy
    0 -21.703004 -30.079493 86.559114 0.111054 0.990779 -0.077618 0 0
    0 21.714357 30.611317 86.559114 -0.111054 0.990779 0.077618 0 0
    0 21.714362 -30.079493 86.559114 0.106353 0.948833 0.297329 0 0
  phy
    0 21.714357 30.611317 93.361806 -0.055284 -0.986436 0.154556 0 0
    0 21.714362 -30.079493 86.559114 0.106353 0.948833 0.297329 0 0
    0 21.714357 30.611317 86.559114 -0.111054 0.990779 0.077618 0 0
  phy
    0 21.714357 30.611317 93.361806 -0.055284 -0.986436 0.154556 0 0
    0 21.714362 -30.079493 93.361806 0.216234 -0.964574 0.151131 0 0
    0 21.714362 -30.079493 86.559114 0.106353 0.948833 0.297329 0 0
end
