// Created by Crowbar 0.72
version 1
nodes
  0 "static_prop" -1
end
skeleton
  time 0
    0 0.000000 0.000000 0.000000 0.000000 0.000000 0.000000
end
triangles
  phy
    0 31.038612 -33.679959 -9.428408 0.106187 0.992947 0.052723 0 0
    0 -36.073616 -33.679959 -5.864928 0.053376 -0.998223 -0.026501 0 0
    0 -36.073616 -33.679959 -9.428408 0.026688 0.998238 -0.053004 0 0
  phy
    0 31.038612 -33.679959 -9.428408 0.106187 0.992947 0.052723 0 0
    0 31.038612 -33.679959 -5.864928 0.053097 -0.993006 0.105452 0 0
    0 -36.073616 -33.679959 -5.864928 0.053376 -0.998223 -0.026501 0 0
  phy
    0 31.038612 -33.679959 -9.428408 0.106187 0.992947 0.052723 0 0
    0 -36.073616 -33.679959 -9.428408 0.026688 0.998238 -0.053004 0 0
    0 31.038607 32.963673 -9.428408 -0.026688 0.998238 0.053004 0 0
  phy
    0 31.038607 32.963673 -9.428408 -0.026688 0.998238 0.053004 0 0
    0 -36.073616 -33.679959 -9.428408 0.026688 0.998238 -0.053004 0 0
    0 -36.073616 32.963673 -9.428408 -0.106187 0.992947 -0.052723 0 0
  phy
    0 -36.073616 32.963673 -9.428408 -0.106187 0.992947 -0.052723 0 0
    0 -36.073616 -33.679959 -9.428408 0.026688 0.998238 -0.053004 0 0
    0 -36.073616 32.963673 -5.864928 -0.053097 -0.993006 -0.105452 0 0
  phy
    0 -36.073616 32.963673 -5.864928 -0.053097 -0.993006 -0.105452 0 0
    0 -36.073616 -33.679959 -9.428408 0.026688 0.998238 -0.053004 0 0
    0 -36.073616 -33.679959 -5.864928 0.053376 -0.998223 -0.026501 0 0
  phy
    0 31.038607 32.963673 -9.428408 -0.026688 0.998238 0.053004 0 0
    0 31.038612 -33.679959 -5.864928 0.053097 -0.993006 0.105452 0 0
    0 31.038612 -33.679959 -9.428408 0.106187 0.992947 0.052723 0 0
  phy
    0 31.038607 32.963673 -9.428408 -0.026688 0.998238 0.053004 0 0
    0 31.038607 32.963673 -5.864928 -0.053376 -0.998223 0.026501 0 0
    0 31.038612 -33.679959 -5.864928 0.053097 -0.993006 0.105452 0 0
  phy
    0 31.038607 32.963673 -9.428408 -0.026688 0.998238 0.053004 0 0
    0 -36.073616 32.963673 -9.428408 -0.106187 0.992947 -0.052723 0 0
    0 31.038607 32.963673 -5.864928 -0.053376 -0.998223 0.026501 0 0
  phy
    0 31.038607 32.963673 -5.864928 -0.053376 -0.998223 0.026501 0 0
    0 -36.073616 32.963673 -9.428408 -0.106187 0.992947 -0.052723 0 0
    0 -36.073616 32.963673 -5.864928 -0.053097 -0.993006 -0.105452 0 0
  phy
    0 -36.073616 32.963673 -5.864928 -0.053097 -0.993006 -0.105452 0 0
    0 -36.073616 -33.679959 -5.864928 0.053376 -0.998223 -0.026501 0 0
    0 31.038607 32.963673 -5.864928 -0.053376 -0.998223 0.026501 0 0
  phy
    0 -36.073616 -33.679959 -5.864928 0.053376 -0.998223 -0.026501 0 0
    0 31.038612 -33.679959 -5.864928 0.053097 -0.993006 0.105452 0 0
    0 31.038607 32.963673 -5.864928 -0.053376 -0.998223 0.026501 0 0
  phy
    0 -26.054988 25.678845 -5.772036 -0.035847 0.039365 0.998582 0 0
    0 -26.054983 -26.799351 89.806468 0.035868 -0.019694 0.999162 0 0
    0 -26.054983 -26.799351 -5.772036 0.142027 0.038991 0.989095 0 0
  phy
    0 -26.054988 25.678845 -5.772036 -0.035847 0.039365 0.998582 0 0
    0 -26.054988 25.678845 89.806468 -0.141704 -0.077804 0.986847 0 0
    0 -26.054983 -26.799351 89.806468 0.035868 -0.019694 0.999162 0 0
  phy
    0 -26.054983 -26.799351 -5.772036 0.142027 0.038991 0.989095 0 0
    0 -29.822729 -26.799351 -5.772036 0.071392 0.078396 -0.994363 0 0
    0 -26.054988 25.678845 -5.772036 -0.035847 0.039365 0.998582 0 0
  phy
    0 -26.054988 25.678845 -5.772036 -0.035847 0.039365 0.998582 0 0
    0 -29.822729 -26.799351 -5.772036 0.071392 0.078396 -0.994363 0 0
    0 -29.822733 25.678845 -5.772036 -0.071598 0.019656 -0.997240 0 0
  phy
    0 -26.054983 -26.799351 -5.772036 0.142027 0.038991 0.989095 0 0
    0 -29.822729 -26.799351 89.806468 0.071557 -0.039289 -0.996662 0 0
    0 -29.822729 -26.799351 -5.772036 0.071392 0.078396 -0.994363 0 0
  phy
    0 -26.054983 -26.799351 -5.772036 0.142027 0.038991 0.989095 0 0
    0 -26.054983 -26.799351 89.806468 0.035868 -0.019694 0.999162 0 0
    0 -29.822729 -26.799351 89.806468 0.071557 -0.039289 -0.996662 0 0
  phy
    0 -26.054988 25.678845 -5.772036 -0.035847 0.039365 0.998582 0 0
    0 -29.822733 25.678845 -5.772036 -0.071598 0.019656 -0.997240 0 0
    0 -26.054988 25.678845 89.806468 -0.141704 -0.077804 0.986847 0 0
  phy
    0 -26.054988 25.678845 89.806468 -0.141704 -0.077804 0.986847 0 0
    0 -29.822733 25.678845 -5.772036 -0.071598 0.019656 -0.997240 0 0
    0 -29.822733 25.678845 89.806468 -0.071557 -0.039289 -0.996662 0 0
  phy
    0 -29.822733 25.678845 89.806468 -0.071557 -0.039289 -0.996662 0 0
    0 -29.822729 -26.799351 89.806468 0.071557 -0.039289 -0.996662 0 0
    0 -26.054988 25.678845 89.806468 -0.141704 -0.077804 0.986847 0 0
  phy
    0 -29.822729 -26.799351 89.806468 0.071557 -0.039289 -0.996662 0 0
    0 -26.054983 -26.799351 89.806468 0.035868 -0.019694 0.999162 0 0
    0 -26.054988 25.678845 89.806468 -0.141704 -0.077804 0.986847 0 0
  phy
    0 -29.822733 25.678845 -5.772036 -0.071598 0.019656 -0.997240 0 0
    0 -29.822729 -26.799351 -5.772036 0.071392 0.078396 -0.994363 0 0
    0 -29.822729 -26.799351 89.806468 0.071557 -0.039289 -0.996662 0 0
  phy
    0 -29.822733 25.678845 -5.772036 -0.071598 0.019656 -0.997240 0 0
    0 -29.822729 -26.799351 89.806468 0.071557 -0.039289 -0.996662 0 0
    0 -29.822733 25.678845 89.806468 -0.071557 -0.039289 -0.996662 0 0
  phy
    0 24.866427 -23.613917 -5.772036 -0.997240 0.019656 0.071598 0 0
    0 24.866427 -27.381665 -5.772036 0.998582 0.039365 0.035847 0 0
    0 -27.611770 -23.613919 -5.772036 -0.994363 0.078396 -0.071392 0 0
  phy
    0 -27.611770 -23.613919 -5.772036 -0.994363 0.078396 -0.071392 0 0
    0 24.866427 -27.381665 -5.772036 0.998582 0.039365 0.035847 0 0
    0 -27.611770 -27.381667 -5.772036 0.989095 0.038991 -0.142027 0 0
  phy
    0 24.866427 -23.613917 -5.772036 -0.997240 0.019656 0.071598 0 0
    0 24.866427 -27.381665 89.806468 0.986847 -0.077804 0.141704 0 0
    0 24.866427 -27.381665 -5.772036 0.998582 0.039365 0.035847 0 0
  phy
    0 24.866427 -23.613917 -5.772036 -0.997240 0.019656 0.071598 0 0
    0 24.866427 -23.613917 89.806468 -0.996662 -0.039289 0.071557 0 0
    0 24.866427 -27.381665 89.806468 0.986847 -0.077804 0.141704 0 0
  phy
    0 24.866427 -27.381665 -5.772036 0.998582 0.039365 0.035847 0 0
    0 -27.611770 -27.381667 89.806468 0.999162 -0.019694 -0.035868 0 0
    0 -27.611770 -27.381667 -5.772036 0.989095 0.038991 -0.142027 0 0
  phy
    0 24.866427 -27.381665 89.806468 0.986847 -0.077804 0.141704 0 0
    0 -27.611770 -27.381667 89.806468 0.999162 -0.019694 -0.035868 0 0
    0 24.866427 -27.381665 -5.772036 0.998582 0.039365 0.035847 0 0
  phy
    0 -27.611770 -23.613919 -5.772036 -0.994363 0.078396 -0.071392 0 0
    0 -27.611770 -27.381667 -5.772036 0.989095 0.038991 -0.142027 0 0
    0 -27.611770 -23.613919 89.806468 -0.996662 -0.039289 -0.071557 0 0
  phy
    0 -27.611770 -23.613919 89.806468 -0.996662 -0.039289 -0.071557 0 0
    0 -27.611770 -27.381667 -5.772036 0.989095 0.038991 -0.142027 0 0
    0 -27.611770 -27.381667 89.806468 0.999162 -0.019694 -0.035868 0 0
  phy
    0 24.866427 -23.613917 89.806468 -0.996662 -0.039289 0.071557 0 0
    0 -27.611770 -23.613919 89.806468 -0.996662 -0.039289 -0.071557 0 0
    0 24.866427 -27.381665 89.806468 0.986847 -0.077804 0.141704 0 0
  phy
    0 -27.611770 -23.613919 89.806468 -0.996662 -0.039289 -0.071557 0 0
    0 -27.611770 -27.381667 89.806468 0.999162 -0.019694 -0.035868 0 0
    0 24.866427 -27.381665 89.806468 0.986847 -0.077804 0.141704 0 0
  phy
    0 -27.611770 -23.613919 -5.772036 -0.994363 0.078396 -0.071392 0 0
    0 -27.611770 -23.613919 89.806468 -0.996662 -0.039289 -0.071557 0 0
    0 24.866427 -23.613917 -5.772036 -0.997240 0.019656 0.071598 0 0
  phy
    0 24.866427 -23.613917 -5.772036 -0.997240 0.019656 0.071598 0 0
    0 -27.611770 -23.613919 89.806468 -0.996662 -0.039289 -0.071557 0 0
    0 24.866427 -23.613917 89.806468 -0.996662 -0.039289 0.071557 0 0
  phy
    0 24.866422 23.192630 -5.772036 0.997240 0.019656 0.071598 0 0
    0 -27.611772 23.192627 89.806468 0.997240 -0.019656 -0.071598 0 0
    0 -27.611772 23.192627 -5.772036 0.994363 0.078396 -0.071392 0 0
  phy
    0 24.866422 23.192630 -5.772036 0.997240 0.019656 0.071598 0 0
    0 24.866422 23.192630 89.806468 0.994363 -0.078396 0.071392 0 0
    0 -27.611772 23.192627 89.806468 0.997240 -0.019656 -0.071598 0 0
  phy
    0 24.866422 23.192630 -5.772036 0.997240 0.019656 0.071598 0 0
    0 -27.611772 23.192627 -5.772036 0.994363 0.078396 -0.071392 0 0
    0 24.866422 26.960375 -5.772036 -0.994363 0.078396 0.071392 0 0
  phy
    0 24.866422 26.960375 -5.772036 -0.994363 0.078396 0.071392 0 0
    0 -27.611772 23.192627 -5.772036 0.994363 0.078396 -0.071392 0 0
    0 -27.611772 26.960375 -5.772036 -0.997240 0.019656 -0.071598 0 0
  phy
    0 24.866422 23.192630 -5.772036 0.997240 0.019656 0.071598 0 0
    0 24.866422 26.960375 89.806468 -0.997240 -0.019656 0.071598 0 0
    0 24.866422 23.192630 89.806468 0.994363 -0.078396 0.071392 0 0
  phy
    0 24.866422 23.192630 -5.772036 0.997240 0.019656 0.071598 0 0
    0 24.866422 26.960375 -5.772036 -0.994363 0.078396 0.071392 0 0
    0 24.866422 26.960375 89.806468 -0.997240 -0.019656 0.071598 0 0
  phy
    0 -27.611772 23.192627 -5.772036 0.994363 0.078396 -0.071392 0 0
    0 -27.611772 23.192627 89.806468 0.997240 -0.019656 -0.071598 0 0
    0 -27.611772 26.960375 -5.772036 -0.997240 0.019656 -0.071598 0 0
  phy
    0 -27.611772 26.960375 -5.772036 -0.997240 0.019656 -0.071598 0 0
    0 -27.611772 23.192627 89.806468 0.997240 -0.019656 -0.071598 0 0
    0 -27.611772 26.960375 89.806468 -0.994363 -0.078396 -0.071392 0 0
  phy
    0 24.866422 23.192630 89.806468 0.994363 -0.078396 0.071392 0 0
    0 -27.611772 26.960375 89.806468 -0.994363 -0.078396 -0.071392 0 0
    0 -27.611772 23.192627 89.806468 0.997240 -0.019656 -0.071598 0 0
  phy
    0 24.866422 23.192630 89.806468 0.994363 -0.078396 0.071392 0 0
    0 24.866422 26.960375 89.806468 -0.997240 -0.019656 0.071598 0 0
    0 -27.611772 26.960375 89.806468 -0.994363 -0.078396 -0.071392 0 0
  phy
    0 24.866422 26.960375 -5.772036 -0.994363 0.078396 0.071392 0 0
    0 -27.611772 26.960375 -5.772036 -0.997240 0.019656 -0.071598 0 0
    0 24.866422 26.960375 89.806468 -0.997240 -0.019656 0.071598 0 0
  phy
    0 24.866422 26.960375 89.806468 -0.997240 -0.019656 0.071598 0 0
    0 -27.611772 26.960375 -5.772036 -0.997240 0.019656 -0.071598 0 0
    0 -27.611772 26.960375 89.806468 -0.994363 -0.078396 -0.071392 0 0
  phy
    0 2.613367 4.461129 102.516967 -0.435778 0.224698 0.871555 0 0
    0 2.613367 -5.338442 121.522203 0.664328 -0.342544 0.664328 0 0
    0 2.613367 -5.338442 102.516967 0.571338 0.589192 0.571338 0 0
  phy
    0 2.613367 4.461129 102.516967 -0.435778 0.224698 0.871555 0 0
    0 2.613367 4.461129 121.522203 -0.871555 -0.224698 0.435778 0 0
    0 2.613367 -5.338442 121.522203 0.664328 -0.342544 0.664328 0 0
  phy
    0 2.613367 4.461129 102.516967 -0.435778 0.224698 0.871555 0 0
    0 -7.186205 4.461129 102.516967 -0.812212 0.418796 -0.406106 0 0
    0 2.613367 4.461129 121.522203 -0.871555 -0.224698 0.435778 0 0
  phy
    0 2.613367 4.461129 121.522203 -0.871555 -0.224698 0.435778 0 0
    0 -7.186205 4.461129 102.516967 -0.812212 0.418796 -0.406106 0 0
    0 -7.186205 4.461129 121.522203 -0.406106 -0.418796 -0.812212 0 0
  phy
    0 2.613367 4.461129 121.522203 -0.871555 -0.224698 0.435778 0 0
    0 -7.186205 4.461129 121.522203 -0.406106 -0.418796 -0.812212 0 0
    0 2.613367 -5.338442 121.522203 0.664328 -0.342544 0.664328 0 0
  phy
    0 -7.186205 4.461129 121.522203 -0.406106 -0.418796 -0.812212 0 0
    0 -7.186205 -5.338443 121.522203 0.664328 -0.342544 -0.664328 0 0
    0 2.613367 -5.338442 121.522203 0.664328 -0.342544 0.664328 0 0
  phy
    0 2.613367 -5.338442 121.522203 0.664328 -0.342544 0.664328 0 0
    0 -7.186205 -5.338443 102.516967 0.695642 0.179345 -0.695642 0 0
    0 2.613367 -5.338442 102.516967 0.571338 0.589192 0.571338 0 0
  phy
    0 2.613367 -5.338442 121.522203 0.664328 -0.342544 0.664328 0 0
    0 -7.186205 -5.338443 121.522203 0.664328 -0.342544 -0.664328 0 0
    0 -7.186205 -5.338443 102.516967 0.695642 0.179345 -0.695642 0 0
  phy
    0 2.613367 4.461129 102.516967 -0.435778 0.224698 0.871555 0 0
    0 2.613367 -5.338442 102.516967 0.571338 0.589192 0.571338 0 0
    0 -7.186205 4.461129 102.516967 -0.812212 0.418796 -0.406106 0 0
  phy
    0 -7.186205 4.461129 102.516967 -0.812212 0.418796 -0.406106 0 0
    0 2.613367 -5.338442 102.516967 0.571338 0.589192 0.571338 0 0
    0 -7.186205 -5.338443 102.516967 0.695642 0.179345 -0.695642 0 0
  phy
    0 -7.186205 4.461129 102.516967 -0.812212 0.418796 -0.406106 0 0
    0 -7.186205 -5.338443 102.516967 0.695642 0.179345 -0.695642 0 0
    0 -7.186205 4.461129 121.522203 -0.406106 -0.418796 -0.812212 0 0
  phy
    0 -7.186205 4.461129 121.522203 -0.406106 -0.418796 -0.812212 0 0
    0 -7.186205 -5.338443 102.516967 0.695642 0.179345 -0.695642 0 0
    0 -7.186205 -5.338443 121.522203 0.664328 -0.342544 -0.664328 0 0
  phy
    0 27.854689 30.593325 92.433334 -0.154079 -0.975241 0.158633 0 0
    0 -32.427527 30.593321 92.433334 -0.154079 -0.975241 -0.158633 0 0
    0 27.854691 -31.470633 92.433334 0.077735 -0.984041 0.160064 0 0
  phy
    0 -32.427527 30.593321 92.433334 -0.154079 -0.975241 -0.158633 0 0
    0 -32.427527 -31.470635 92.433334 0.297737 -0.942264 -0.153269 0 0
    0 27.854691 -31.470633 92.433334 0.077735 -0.984041 0.160064 0 0
  phy
    0 27.854691 -31.470633 92.433334 0.077735 -0.984041 0.160064 0 0
    0 27.854689 30.593325 82.627826 -0.287770 0.910719 0.296275 0 0
    0 27.854689 30.593325 92.433334 -0.154079 -0.975241 0.158633 0 0
  phy
    0 -32.427527 30.593321 92.433334 -0.154079 -0.975241 -0.158633 0 0
    0 27.854689 30.593325 92.433334 -0.154079 -0.975241 0.158633 0 0
    0 27.854689 30.593325 82.627826 -0.287770 0.910719 0.296275 0 0
  phy
    0 -32.427527 -31.470635 92.433334 0.297737 -0.942264 -0.153269 0 0
    0 27.854691 -31.470633 82.627826 0.155554 0.984577 0.080076 0 0
    0 27.854691 -31.470633 92.433334 0.077735 -0.984041 0.160064 0 0
  phy
    0 -32.427527 -31.470635 92.433334 0.297737 -0.942264 -0.153269 0 0
    0 -32.427527 -31.470635 82.627826 0.148573 0.940390 -0.305928 0 0
    0 27.854691 -31.470633 82.627826 0.155554 0.984577 0.080076 0 0
  phy
    0 27.854689 30.593325 82.627826 -0.287770 0.910719 0.296275 0 0
    0 27.854691 -31.470633 82.627826 0.155554 0.984577 0.080076 0 0
    0 -32.427527 30.593321 82.627826 -0.078492 0.993634 -0.080812 0 0
  phy
    0 -32.427527 30.593321 82.627826 -0.078492 0.993634 -0.080812 0 0
    0 27.854691 -31.470633 82.627826 0.155554 0.984577 0.080076 0 0
    0 -32.427527 -31.470635 82.627826 0.148573 0.940390 -0.305928 0 0
  phy
    0 27.854691 -31.470633 82.627826 0.155554 0.984577 0.080076 0 0
    0 27.854689 30.593325 82.627826 -0.287770 0.910719 0.296275 0 0
    0 27.854691 -31.470633 92.433334 0.077735 -0.984041 0.160064 0 0
  phy
    0 -32.427527 30.593321 82.627826 -0.078492 0.993634 -0.080812 0 0
    0 -32.427527 -31.470635 82.627826 0.148573 0.940390 -0.305928 0 0
    0 -32.427527 30.593321 92.433334 -0.154079 -0.975241 -0.158633 0 0
  phy
    0 -32.427527 30.593321 92.433334 -0.154079 -0.975241 -0.158633 0 0
    0 -32.427527 -31.470635 82.627826 0.148573 0.940390 -0.305928 0 0
    0 -32.427527 -31.470635 92.433334 0.297737 -0.942264 -0.153269 0 0
  phy
    0 -32.427527 30.593321 82.627826 -0.078492 0.993634 -0.080812 0 0
    0 -32.427527 30.593321 92.433334 -0.154079 -0.975241 -0.158633 0 0
    0 27.854689 30.593325 82.627826 -0.287770 0.910719 0.296275 0 0
  phy
    0 -26.191435 -24.343677 92.154422 0.381086 0.842346 -0.381086 0 0
    0 21.618600 -24.343675 102.969286 0.215449 -0.952451 0.215449 0 0
    0 -26.191435 -24.343677 102.969286 0.215449 -0.952451 -0.215449 0 0
  phy
    0 -26.191435 -24.343677 92.154422 0.381086 0.842346 -0.381086 0 0
    0 21.618600 -24.343675 92.154422 0.111683 0.987448 0.111683 0 0
    0 21.618600 -24.343675 102.969286 0.215449 -0.952451 0.215449 0 0
  phy
    0 -26.191435 -24.343677 92.154422 0.381086 0.842346 -0.381086 0 0
    0 -26.191438 23.466358 92.154422 -0.111683 0.987448 -0.111683 0 0
    0 21.618600 -24.343675 92.154422 0.111683 0.987448 0.111683 0 0
  phy
    0 21.618600 -24.343675 92.154422 0.111683 0.987448 0.111683 0 0
    0 -26.191438 23.466358 92.154422 -0.111683 0.987448 -0.111683 0 0
    0 21.618598 23.466360 92.154422 -0.381086 0.842346 0.381086 0 0
  phy
    0 21.618598 23.466360 92.154422 -0.381086 0.842346 0.381086 0 0
    0 21.618600 -24.343675 102.969286 0.215449 -0.952451 0.215449 0 0
    0 21.618600 -24.343675 92.154422 0.111683 0.987448 0.111683 0 0
  phy
    0 21.618598 23.466360 92.154422 -0.381086 0.842346 0.381086 0 0
    0 21.618598 23.466360 102.969286 -0.215449 -0.952451 0.215449 0 0
    0 21.618600 -24.343675 102.969286 0.215449 -0.952451 0.215449 0 0
  phy
    0 -26.191435 -24.343677 92.154422 0.381086 0.842346 -0.381086 0 0
    0 -26.191438 23.466358 102.969286 -0.215449 -0.952451 -0.215449 0 0
    0 -26.191438 23.466358 92.154422 -0.111683 0.987448 -0.111683 0 0
  phy
    0 -26.191438 23.466358 102.969286 -0.215449 -0.952451 -0.215449 0 0
    0 -26.191435 -24.343677 92.154422 0.381086 0.842346 -0.381086 0 0
    0 -26.191435 -24.343677 102.969286 0.215449 -0.952451 -0.215449 0 0
  phy
    0 -26.191438 23.466358 102.969286 -0.215449 -0.952451 -0.215449 0 0
    0 21.618600 -24.343675 102.969286 0.215449 -0.952451 0.215449 0 0
    0 21.618598 23.466360 102.969286 -0.215449 -0.952451 0.215449 0 0
  phy
    0 -26.191438 23.466358 102.969286 -0.215449 -0.952451 -0.215449 0 0
    0 -26.191435 -24.343677 102.969286 0.215449 -0.952451 -0.215449 0 0
    0 21.618600 -24.343675 102.969286 0.215449 -0.952451 0.215449 0 0
  phy
    0 21.618598 23.466360 92.154422 -0.381086 0.842346 0.381086 0 0
    0 -26.191438 23.466358 102.969286 -0.215449 -0.952451 -0.215449 0 0
    0 21.618598 23.466360 102.969286 -0.215449 -0.952451 0.215449 0 0
  phy
    0 -26.191438 23.466358 92.154422 -0.111683 0.987448 -0.111683 0 0
    0 -26.191438 23.466358 102.969286 -0.215449 -0.952451 -0.215449 0 0
    0 21.618598 23.466360 92.154422 -0.381086 0.842346 0.381086 0 0
end
