// Created by Crowbar 0.72

$modelname "The_Sniper_9/DoctorWho/Tardis/TardisInteriorSmith.mdl"

$staticprop

$bodygroup "TardisInteriorSmith"
{
	studio "TardisInteriorSmith.smd"
}


$surfaceprop "concrete"

$contents "solid"

$illumposition -67.612 33.967 215.616

$cdmaterials "The_Sniper_9\DoctorWho\Tardis\"

$cbox 0 0 0 0 0 0

$bbox -748.313 -725.368 -7.561 696.323 719.268 438.793

$definebone "static_prop" "" 0 0 0 0 0 0 0 0 0 0 0 0


$sequence "idle" {
	"tardisinteriorsmith_anims\idle.smd"
	fadein 0.2
	fadeout 0.2
	fps 1
}

$collisionmodel "tardisinteriorsmith_physics.smd"
{
	$mass 500
	$inertia 1
	$damping 0
	$rotdamping 0
	$rootbone " "
	$concave
	$maxconvexpieces 67

}
