// envmaptint_fix
"VertexLitGeneric"
{
	"$baseTexture" "Models/humans\jackets/breen_sheet"
	"$envmap" 			"env_cubemap"
        "$bumpmap" "models/humans\jackets/breen_sheet_normal"
	"$normalmapalphaenvmapmask" 1
	"$envmapcontrast" 0.7
	"$envmapsaturation" 0.7
	"$envmaptint" "[ .36 .36 .36 ]"
        "$halflambert" 1
}
