// Created by Crowbar 0.72

$modelname "Doctor_Who/Tardis/Tardis_Interior.mdl"

$staticprop

$bodygroup "Body"
{
	studio "Tardis_Interior.smd"
}


$surfaceprop "metal"

$contents "solid"

$illumposition 0 0 204.371

$cdmaterials "Doctor_Who\Tardis\"

$cbox 0 0 0 0 0 0

$bbox -422.979 -411.317 -0.25 422.979 411.317 437.395

$definebone "static_prop" "" 0 0 0 0 0 0 0 0 0 0 0 0


$sequence "idle" {
	"tardis_interior_anims\idle.smd"
	fadein 0.2
	fadeout 0.2
	fps 1
}

$collisionmodel "tardis_interior_physics.smd"
{
	$mass 1000
	$inertia 1
	$damping 0
	$rotdamping 0
	$rootbone " "
	$concave
	$maxconvexpieces 80

}
