VertexLitGeneric
{
	$baseTexture	"models/fuzzyleo/sonics/5thsonic/emitter2"
	$bumpmap "models/fuzzyleo/sonics/4thsonic/emitter_n"

	$selfillum 0

	$phong 					1
	$phongexponent 			40
	$phongboost 			10
	$phongtint 				"[ .5 .5 .5 ]"
	$phongfresnelranges 	"[0.05 0.5 1]"



	Proxies
	{
		SonicSDColor2Static
		{
			resultVar	$color2
	}

}