VertexLitGeneric
{
	$baseTexture	"models/fuzzyleo/sonics/3rdsonic/metal"
	$bumpmap "models/fuzzyleo/sonics/4thsonic/metal_n"
	$surfaceprop "metal"

	$envmap "env_cubemap"
	$envmaptint "[0.1 0.1 0.1]"

	$phong 					1
	$phongexponent 			20
	$phongboost 			10
	$phongtint 				"[ 1 1 1 ]"
	$phongfresnelranges 	"[0.1 0.5 1]"

}