unlitgeneric
{
	$baseTexture "models\FuzzyLeo\EdgeOfReality/60thvortex"
	$basetexturetransform "center .5 .5 scale -1 1 rotate 0 translate 0 0"

	"Proxies"
	{
		"AnimatedTexture"
		{
			"animatedTextureVar" 			"$basetexture" //What to animate. Can also be $detail and $bumpmap
			"animatedTextureFrameNumVar"	"$frame"
			"animatedTextureFrameRate" 		"30" //FPS HERE
		}
	}
}