VertexLitGeneric
{
	$baseTexture	"models/FuzzyLeo/newexteriorpack/10thbox/10windows3"
	$bumpmap	"models/FuzzyLeo/newexteriorpack/10thbox/10windows_n"

	$phong		1
	$phongalbedotint	1
	$phongexponent 	10
	$phongboost	1
	$phongfresnelranges	"[0.87 0.9 1]"


	$blendTintByBaseAlpha	1
}