VertexLitGeneric
{
	$baseTexture	"models\FuzzyLeo\EdgeOfReality/glassflat"
	$color2 "[ 0.7 0.7 0.7 ]"
	$translucent 1
	$nocull 1
	$EmissiveBlendEnabled 		1
	$EmissiveBlendStrength 		0.03
	$EmissiveBlendTexture 		"vgui/white"
	$EmissiveBlendBaseTexture 		"vgui/white"
	$EmissiveBlendFlowTexture 		"vgui/white"
	$EmissiveBlendTint 				" [ 0 0.5 0.85 ] "
	$EmissiveBlendScrollVector 		" [ 0 0 ] "

	Proxies {
		TARDIS_eotcoral_RotorColor {
			resultVar	$EmissiveBlendTint
		}
	}

}