VertexLitGeneric
{
	$baseTexture	"models\FuzzyLeo\EdgeOfReality/tardis"
	$EmissiveBlendEnabled 		1
	$EmissiveBlendStrength 	0.5
	$EmissiveBlendTexture 		"vgui/white"
	$EmissiveBlendBaseTexture 		"models\FuzzyLeo\EdgeOfReality/tardis_halfglow_e"
	$EmissiveBlendFlowTexture 		"vgui/white"
	$EmissiveBlendTint 				" [ 1 1 1 ] "
	$EmissiveBlendScrollVector 		" [ 0 0 ] "
	$bumpmap 		"models\FuzzyLeo\EdgeOfReality/tardis_n"

	$envmaptint "[.0125 .0125 .0125]"
	$diffuseexp 1
	$halflambert 1
	$nocull 0
	$phong 1
	$phongalbedotint 1
	$phongalbedoboost 255
	$phongexponenttexture "models\FuzzyLeo\EdgeOfReality/tardis_r"
	$phongboost .2
	$phongfresnelranges "[.175 .175 .175]"
	$rimlight               1
	$rimlightexponent       11
	$rimlightboost          .5


}