VertexLitGeneric
{
	$baseTexture	"models\FuzzyLeo\EdgeOfReality/glassflat"
	$color2 "[ 0.7 0.7 0.7 ]"
	$translucent 1
	$nocull 1
	$EmissiveBlendEnabled 		1
	$EmissiveBlendStrength 		0.001
	$EmissiveBlendTexture 		"vgui/white"
	$EmissiveBlendBaseTexture 		"vgui/white"
	$EmissiveBlendFlowTexture 		"vgui/white"
	$EmissiveBlendTint 				" [ 1 1 1 ] "
	$EmissiveBlendScrollVector 		" [ 0 0 ] "
}