VertexLitGeneric
{
	$baseTexture	"models\FuzzyLeo\EdgeOfReality/M_TardisWallSegment"
	$EmissiveBlendEnabled 		1
	$EmissiveBlendStrength 		0
	$EmissiveBlendTexture 		"vgui/white"
	$EmissiveBlendBaseTexture 		"models\FuzzyLeo\EdgeOfReality/M_TardisWallSegment_e"
	$EmissiveBlendFlowTexture 		"vgui/white"
	$EmissiveBlendTint 				" [ 1.2 0.60 0.196 ] "
	$EmissiveBlendScrollVector 		" [ 0 0 ] "
	$bumpmap 		"models\FuzzyLeo\EdgeOfReality/M_TardisWallSegment_n"

}