VertexLitGeneric
{
	$baseTexture	"models\FuzzyLeo\EdgeOfReality/TLVTardis_Structure"
	$bumpmap "models\FuzzyLeo\EdgeOfReality/TLVTardis_Structure_n"
	$selfillum 0

	$phong 					1
	$phongexponent 			15
	$phongboost 			5
	$phongtint 				"[ .5 .5 .5 ]"
	$phongfresnelranges 	"[0.05 0.5 1]"


}