VertexLitGeneric
{
	$baseTexture	"models\FuzzyLeo\EdgeOfReality/coraldoorlight"
	$EmissiveBlendEnabled 		1
	$EmissiveBlendStrength 		0.5
	$EmissiveBlendTexture 		"vgui/white"
	$EmissiveBlendBaseTexture 		"models\FuzzyLeo\EdgeOfReality/coraldoorlight_e"
	$EmissiveBlendFlowTexture 		"vgui/white"
	$EmissiveBlendTint 				" [ 1 0.8 0.3 ] "
	$EmissiveBlendScrollVector 		" [ 0 0 ] "

}
