VertexLitGeneric
{
	$baseTexture	"vgui/white"
	$EmissiveBlendEnabled 		1
	$EmissiveBlendStrength 		1
	$EmissiveBlendTexture 		"vgui/white"
	$EmissiveBlendBaseTexture 		"vgui/white"
	$EmissiveBlendFlowTexture 		"vgui/white"
	$EmissiveBlendTint 				" [ 0.043 0.855 1 ] "
	$EmissiveBlendScrollVector 		" [ 0 0 ] "

	Proxies {
		TARDIS_eotcoral_RotorColor {
			resultVar	$EmissiveBlendTint
		}
	}

}