VertexLitGeneric
{
	$baseTexture	"models\FuzzyLeo\EdgeOfReality/TLV_TardisPieces"

	$bumpmap "models\FuzzyLeo\EdgeOfReality/TLV_TardisPieces_n"

	$phong 					1
	$phongexponent 			15
	$phongboost 			5
	$phongtint 				"[ .5 .5 .5 ]"
	$phongfresnelranges 	"[0.05 0.5 1]"


}