VertexLitGeneric
{
	$baseTexture	"models\FuzzyLeo\EdgeOfReality/Greebles"
	$bumpmap "models\FuzzyLeo\EdgeOfReality/Greebles_n"
	$surfaceprop "metal"

	$phong 					1
	$phongexponent 			15
	$phongboost 			5
	$phongtint 				"[ .5 .5 .5 ]"
	$phongfresnelranges 	"[0.05 0.5 1]"

}