VertexLitGeneric
{
	$baseTexture	"models\FuzzyLeo\EdgeOfReality/Levers"
	$bumpmap "models\FuzzyLeo\EdgeOfReality/Levers_n"
	$surfaceprop "metal"

	$phong 					1
	$phongexponent 			15
	$phongboost 			5
	$phongtint 				"[ .5 .5 .5 ]"
	$phongfresnelranges 	"[0.05 0.5 1]"

	"$detail"				"detail/metal_detail_01"
	"$detailscale"			"6.4"
	"$detailblendfactor"	"0.2"
	"$detailblendmode"		"0"

	$rimlight 				"1"
	$rimlightexponent 		"25"
	$rimlightboost 			"0.005"

}