VertexLitGeneric
{
	$baseTexture	"models\FuzzyLeo\EdgeOfReality/TardisHangingLight"
	$EmissiveBlendEnabled 		1
	$EmissiveBlendStrength 		0.4
	$EmissiveBlendTexture 		"vgui/white"
	$EmissiveBlendBaseTexture 		"models\FuzzyLeo\EdgeOfReality/TardisHangingLight_e"
	$EmissiveBlendFlowTexture 		"vgui/white"
	$EmissiveBlendTint 				" [ 1 1 0.941 ] "
	$EmissiveBlendScrollVector 		" [ 0 0 ] "
	$bumpmap 		"models\FuzzyLeo\EdgeOfReality/TardisHangingLight_n"

}