VertexLitGeneric
{
	$baseTexture	"models\FuzzyLeo\EdgeOfRealityJodie/M_Tardis_Table_Atlas_09"

	$EmissiveBlendEnabled 		1
	$EmissiveBlendStrength 	0.3
	$EmissiveBlendTexture 		"vgui/white"
	$EmissiveBlendBaseTexture 		"models\FuzzyLeo\EdgeOfRealityJodie/M_Tardis_Table_Atlas_09_e"
	$EmissiveBlendFlowTexture 		"vgui/white"
	$EmissiveBlendTint 				" [ 1 1 1 ] "
	$EmissiveBlendScrollVector 		" [ 0 0 ] "

	$bumpmap "models\FuzzyLeo\EdgeOfRealityJodie/M_Tardis_Table_Atlas_09_n"
	$nocull 0
	$translucent 0

	$phong 					1
	$phongexponent 			15
	$phongboost 			5
	$phongtint 				"[ .5 .5 .5 ]"
	$phongfresnelranges 	"[0.05 0.5 1]"




}