VertexLitGeneric
{
	$baseTexture	"models\FuzzyLeo\EdgeOfRealityJodie/M_Tardis_Crystal_Shard_Bottom"

	$EmissiveBlendEnabled 		1
	$EmissiveBlendStrength 	0.7
	$EmissiveBlendTexture 		"vgui/white"
	$EmissiveBlendBaseTexture 		"models\FuzzyLeo\EdgeOfRealityJodie/M_Tardis_Crystal_Shard_Bottom_e"
	$EmissiveBlendFlowTexture 		"vgui/white"
	$EmissiveBlendTint 				" [ 1 0.1 0.1 ] "
	$EmissiveBlendScrollVector 		" [ 0 0 ] "

	$bumpmap "models\FuzzyLeo\EdgeOfRealityJodie/M_Tardis_Crystal_Shard_Bottom_n"

	$phong 					1
	$phongexponent 			15
	$phongboost 			5
	$phongtint 				"[ .5 .5 .5 ]"
	$phongfresnelranges 	"[0.05 0.5 1]"


}