VertexLitGeneric
{
	$baseTexture	"models\FuzzyLeo\EdgeOfRealityJodie/M_Tardis_Table_Atlas_02"
	$bumpmap "models\FuzzyLeo\EdgeOfRealityJodie/M_Tardis_Table_Atlas_02_n"
	$nocull 0
	$translucent 0

	$phong 					1
	$phongexponent 			15
	$phongboost 			5
	$phongtint 				"[ .5 .5 .5 ]"
	$phongfresnelranges 	"[0.05 0.5 1]"


}