"VertexLitGeneric"
{
	"$basetexture" "models/Timmy2985/Tardis/Interior/spinlightoff"
	"$surfaceprop" "metal"
	"$nodecal" "1"
	"$selfillum" 1
        "$selfillummask" "models\Timmy2985\Tardis\Interior\roundels"	
}
	
