"vertexlitgeneric"
{
	"$basetexture" "models/Timmy2985/Tardis/Interior/floorlightson"
	"$nodecal" "1"
	"$surfaceprop" "metal"
	"$nodecal" "1"
        "$selfillummask" "models/Timmy2985/Tardis/Interior/roundels"
		"Proxies"
		{
			"AnimatedTexture"
				{
					"animatedTextureVar" "$basetexture"
					"animatedTextureFrameNumVar" "$frame"
					"animatedTextureFrameRate" "4"
				}
		}
}