"VertexLitGeneric"
{
	"$basetexture" "models/karmal/75/glass"
	"$bumpmap" "models/karmal/75/glass_normal"
	"$surfaceprop" "glass"
	"$envmapfresnel" "0.75"
	"$nocull" "1"
	"$color2" "[3 3 3]"

	"$phong"     "1"
	"$phongexponent"  "63"
	"$phongboost"   "0.5"
	"$phongfresnelranges"   "[1 8 4]"
	"$phongtint"	"[ .5 .5 .5 ]"
	"$halflambert" "1"

	"$rimlight" "1"
	"$rimlightexponent" "12"	
	"$rimlightboost" "0.8"

}

