"VertexlitGeneric"
{
	"$basetexture" "models/cem111333/baker/windows2"
	"$envmapmask" "models/cem111333/baker/windows2_spec"
	"$envmap" "cubemaps/cubemap_specular002.hdr"
	"$envmaptint" "[ .2 .2 .2 ]"
	"$envmapfresnel" "0.75"
	"$detail"                "detail/metal_detail_01"
	"$detailscale"            "3"
	"$detailblendfactor"    "0.03"
	"$detailblendmode"        "3"

}