"VertexlitGeneric"
{
	"$basetexture" "models/karmal/75/joystick"
	"$bumpmap" "models/karmal/75/glass_normal"
	"$surfaceprop" "Metal"
	"$nodecal" "1"
	"$envmap" "cubemaps/cubemap_sheen001.hdr"
	"$envmaptint" "[ 0.1 0.1 0.1 ]"

	"$detail"				"detail/metal_detail_01"
	"$detailscale"			"4.283"
	"$detailblendfactor"	"0.2"
	"$detailblendmode"		"0"

	$phong 							1
	$phongexponent 						5
	$phongboost 						25
	$phongtint 						"[ .35 .35 .35 ]"
	$phongfresnelranges 					"[0.05 0.5 1]"

	$rimlight 							"1"
	$rimlightexponent 					"25" //Range
}
