"VertexlitGeneric"
{
	"$basetexture" "models/karmal/75/console_metal"
	"$bumpmap" "models/karmal/75/console_metal_normal"
	"$surfaceprop" "Metal"
	"$nodecal" "1"
	"$nocull" "1"
	"$color2" "[1.5 1.5 1.5]"

	"$detail"				"detail/metal_detail_01"
	"$detailscale"			"4.283"
	"$detailblendfactor"	"0.25"
	"$detailblendmode"		"0"

	$phong 							1
	$phongexponent 						35
	$phongboost 						50
//	$phongtint 						"[ 25 25 25 ]"
	$halflambert 						1
	$phongfresnelranges 					"[0.05 0.5 1]"

	$rimlight 							"1"
	$rimlightexponent 						"25"
	$rimlightboost 						"1"
}
