"VertexlitGeneric"
{
	"$basetexture" "models/karmal/75/console_screenoff"
	"$bumpmap" "models/karmal/75/glass_normal"
	"$nodecal" "1"
	"$surfaceprop" "Glass"

	$phong 1
	$phongexponent			20
	$phongboost			0.1
	$phongfresnelranges	"[1 1 1]"
}
