"VertexlitGeneric"
{
	"$basetexture" "models/karmal/75/console_lamps_flash"
	"$envmap" "cubemaps/cubemap_specular002.hdr"
	"$envmaptint" "[0.3 0.3 0.3]"
	"$nodecal" "1"
	"$selfillum" "1"
	"$selfillummask" "models/karmal/75/white"
	"$surfaceprop" "Plastic"

	Proxies
	{
		"AnimatedTexture"
			{
				"animatedTextureVar" "$basetexture"
				"animatedTextureFrameNumVar" "$frame"
				"animatedTextureFrameRate" "20"
			}
	}

}
