"VertexlitGeneric"
{
	"$basetexture" "models/cem111333/baker/roundel_backing"
	"$bumpmap" "models/karmal/75/generic_normal"
	"$nocull" "1"
	"$nodecal" "1"
	"$surfaceprop" "Plastic"
//	"$color2" "[0.5 0.5 0.55]"

	$phong 1
	$phongexponent			5
	$phongboost			0.01
	$phongfresnelranges	"[0.05 0.5 0.5]"
}
