"VertexLitGeneric"
{
	"$basetexture" "models/karmal/75/glass"
	"$bumpmap" "models/karmal/75/glass_normal"
	"$surfaceprop" "plastic"
//	"$envmap" "cubemaps/cubemap_sheen001.hdr"
	"$envmaptint" "[ 0.05 0.05 0.05 ]"
	"$envmapfresnel" "0.75"
	"$translucent" "1"
	"$nocull" "1"
//	"$additive" "1"
	"$color2" "[ 7.5 7.5 7.5 ]"

//	"$detail"				"detail/metal_detail_01"
	"$detailscale"			"4.283"
	"$detailblendfactor"	"0.35"
	"$detailblendmode"		"0"

	"$phong"     "1"
	"$phongexponent"  "63"
	"$phongboost"   "2"
	"$phongfresnelranges"   "[1 8 4]"
	"$phongtint"	"[ .5 .5 .5 ]"
	"$halflambert" "1"

	"$rimlight" "1"
	"$rimlightexponent" "12"	
	"$rimlightboost" "0.8"

}

