"VertexlitGeneric"
{
	"$basetexture" "models/cem111333/baker/roundel_backing"
	"$color2" "models/karmal/75/generic_normal"
	"$bumpmap" "models/karmal/75/generic_normal"
	"$nocull" "1"
	"$nodecal" "1"
	"$selfillum" "1"
	"$selfillummask" "models/cem111333/baker/white"
//	"$selfillumtint" "[0.8 1 1]"
	"$surfaceprop" "Plastic"
	"$color2" "[3.25 1.25 1.45]"

	$phong 1
	$phongexponent			5
	$phongboost			0.01
	$phongfresnelranges	"[0.05 0.5 0.5]"

	$detail "models/cem111333/baker/roundel_backing_glow"
	$detailscale 1
	$detailblendmode 3
	$detailblendfactor 0.5

	"Proxies"
	{
		"Sine"
		{
			"sinemax" "1"
			"sinemin" ".60"
			"sineperiod" "5"
			"resultvar" "$selfillumtint"
		}
	}
}

