"VertexlitGeneric"
{
	"$basetexture" "models/karmal/75/rotor_core_lamps"
	"$bumpmap" "models/karmal/75/generic_normal"
	"$surfaceprop" "Metal"
	"$nodecal" "1"

	$phong 1
	$phongexponent			20
	$phongboost			0.15
	$phongfresnelranges	"[1 1 1]"
}
