"VertexlitGeneric"
{
	"$basetexture" "models/karmal/75/controls_3"
	"$bumpmap" "models/karmal/75/generic_normal"
	"$surfaceprop" "Metal"
	"$nodecal" "1"

	$phong 1
	$phongexponent			20
	$phongboost			0.5
	$phongfresnelranges	"[1 1 1]"
}
