"VertexlitGeneric"
{
	"$basetexture" "models/doctorwho1200/baker/details"
	"$surfaceprop" "Metal"
	"$nodecal" "1"
	"$selfillum" 1
        "$selfillummask" "models/doctorwho1200/baker/white"
	"$envmap" "models/doctorwho1200/baker/environment"
	"$envmaptint" "[0.5 0.5 0.5]"
}
