"VertexlitGeneric"
{
	"$basetexture" "models/artixc/mcgann/windows"
	"$surfaceprop" "Glass"
	"$selfillummask" "models/artixc/mcgann/white"
	"$selfillum" 1
	"$envmap" "models/artixc/mcgann/environment"
	"$envmaptint" "[0.1 0.1 0.1]"
	"$nodecal" "1"
	"$reflectivity" "[1 1 1]"
}