"VertexlitGeneric"
{
	"$basetexture" "models/doctorwho1200/hellbent/controls"
	"$envmap" "models/doctorwho1200/hellbent/environment"
	"$envmaptint" "[0.45 0.45 0.45]"
	"$nodecal" "1"
	"$selfillum" 1
	"$selfillummask" "models/doctorwho1200/hellbent/white"
	"$surfaceprop" "Plastic"
}
