"VertexlitGeneric"
{
	"$basetexture" "models/doctorwho1200/hellbent/pulsingwhite"
	"$surfaceprop" "water"
	"$selfillum" 1
	"$selfillummask" "models/doctorwho1200/hellbent/white"
	"$selfillumtint" "[ 2.7 0.6 0.6 ]"
	"$nodecal" "1"
	"Proxies"
	{
		"AnimatedTexture"
			{
				"animatedTextureVar" "$basetexture"
				"animatedTextureFrameNumVar" "$frame"
				"animatedTextureFrameRate" "28"
			}
	}
}