"VertexlitGeneric"
{
	"$basetexture" "models/doctorwho1200/hellbent/bulbflashb"
	"$nodecal" "1"
	"$surfaceprop" "Metal"
	"$selfillum" "1"
	"$selfillummask" "models/doctorwho1200/hellbent/white"
	Proxies
	{
		"AnimatedTexture"
			{
				"animatedTextureVar" "$basetexture"
				"animatedTextureFrameNumVar" "$frame"
				"animatedTextureFrameRate" "1"
			}
	}
}