"VertexlitGeneric"
{
	"$basetexture" "models/doctorwho1200/hellbent/controls"
	"$envmap" "models/doctorwho1200/hellbent/environment"
	"$envmaptint" "[0.25 0.25 0.25]"
	"$nodecal" "1"
	"$surfaceprop" "Metal"
}
