"VertexlitGeneric"
{
	"$basetexture" "models/artixc/hellbent/hbfloor"
	"$envmap" "models/artixc/hellbent/environment"
	"$bump" "models/artixc/hellbent/hbfloor_n"
	"$envmaptint" "[0.2 0.2 0.2]"
	"$nodecal" "1"
	"$surfaceprop" "Wood"
}
