"VertexlitGeneric"
{
	"$basetexture" "models/doctorwho1200/hellbent/bulbflasha"
	"$nodecal" "1"
	"$surfaceprop" "Metal"
	Proxies
	{
		"AnimatedTexture"
			{
				"animatedTextureVar" "$basetexture"
				"animatedTextureFrameNumVar" "$frame"
				"animatedTextureFrameRate" "4"
			}
	}
}