"VertexlitGeneric"
{
	"$basetexture" "models/doctorwho1200/hellbent/roundel"
	"$nodecal" "1"
	"$selfillum" 1
	"$selfillummask" "models/doctorwho1200/hellbent/white"
	"$selfillumtint" "[ 1 0.2 0.2 ]"
	"$surfaceprop" "Plastic"
	"$color2" "[1 0.2 0.2]"
}
