# Blender v2.90.1 OBJ File: 'scene.blend'
# www.blender.org
mtllib scene.mtl
o palette_palette_EPAL
v -0.749999 0.305000 -0.181250
v -0.181250 0.305000 -0.181250
v -0.749999 0.305000 0.181250
v -0.181250 0.305000 0.181250
v -0.999999 0.055000 0.181250
v -0.999999 0.055000 1.137499
v -0.749999 0.055000 0.181250
v -0.749999 0.055000 1.137499
v 0.181250 0.055000 -0.181250
v 0.181250 0.055000 -1.137499
v -0.181250 0.055000 -0.181250
v -0.181250 0.055000 -1.137499
v 0.181250 0.305000 1.137499
v 0.749999 0.305000 1.137499
v 0.181250 0.305000 1.499999
v 0.749999 0.305000 1.499999
v -0.749999 0.055000 -0.181250
v -0.749999 0.055000 -1.137499
v -0.999999 0.055000 -0.181250
v -0.999999 0.055000 -1.137499
v 0.181250 0.305000 -1.499999
v 0.749999 0.305000 -1.499999
v 0.181250 0.305000 -1.137499
v 0.749999 0.305000 -1.137499
v -0.749999 0.305000 -1.499999
v -0.181250 0.305000 -1.499999
v -0.749999 0.305000 -1.137499
v -0.181250 0.305000 -1.137499
v -0.181250 0.360000 -1.137499
v -0.181250 0.360000 -1.499999
v -0.281250 0.360000 -1.137499
v -0.281250 0.360000 -1.499999
v 0.281250 0.360000 -1.137499
v 0.281250 0.360000 -1.499999
v 0.181250 0.360000 -1.137499
v 0.181250 0.360000 -1.499999
v 0.531250 0.360000 -1.499999
v 0.531250 0.360000 -1.137499
v 0.637499 0.360000 -1.499999
v 0.637499 0.360000 -1.137499
v -0.637499 0.360000 -1.499999
v -0.637499 0.360000 -1.137499
v -0.531250 0.360000 -1.499999
v -0.531250 0.360000 -1.137499
v -0.181250 0.305000 1.499999
v -0.749999 0.305000 1.499999
v -0.181250 0.305000 1.137499
v -0.749999 0.305000 1.137499
v 0.181250 0.055000 1.137499
v 0.181250 0.055000 0.181250
v -0.181250 0.055000 1.137499
v -0.181250 0.055000 0.181250
v 0.181250 0.000000 -1.499999
v 0.181250 -0.000000 1.499999
v 0.181250 0.305000 0.181250
v 0.181250 0.305000 -0.181250
v -0.181250 -0.000000 1.499999
v -0.181250 0.360000 1.499999
v 0.181250 0.360000 1.499999
v -0.181250 0.415000 1.499999
v 0.181250 0.415000 1.499999
v 0.531250 0.360000 1.499999
v 0.281250 0.360000 1.499999
v 0.749999 -0.000000 1.499999
v 0.964644 -0.000000 1.499999
v 0.964644 0.415000 1.499999
v 0.637499 0.360000 1.499999
v 0.637499 0.415000 1.499999
v 0.531250 0.415000 1.499999
v 0.281250 0.415000 1.499999
v -0.281250 0.360000 1.499999
v -0.531250 0.360000 1.499999
v -0.637499 0.360000 1.499999
v -0.967364 0.415000 1.499999
v -0.637499 0.415000 1.499999
v -0.281250 0.415000 1.499999
v -0.531250 0.415000 1.499999
v -0.967364 -0.000000 1.499999
v -0.749999 -0.000000 1.499999
v -0.181250 0.000000 -1.499999
v -0.999999 0.360000 -1.137499
v 0.999999 0.360000 -1.137499
v 0.999999 0.055000 -1.137499
v 0.749999 0.055000 -1.137499
v -0.964644 0.000000 -1.499999
v -0.999999 0.000000 -1.464643
v -0.964644 0.415000 -1.499999
v -0.999999 0.415000 -1.464643
v -0.999999 -0.000000 1.461105
v -0.749999 0.000000 -1.499999
v -0.637499 0.415000 -1.499999
v -0.531250 0.415000 -1.499999
v -0.281250 0.415000 -1.499999
v -0.181250 0.415000 -1.499999
v 0.181250 0.415000 -1.499999
v 0.964644 0.415000 -1.499999
v 0.637499 0.415000 -1.499999
v 0.281250 0.415000 -1.499999
v 0.531250 0.415000 -1.499999
v 0.964644 0.000000 -1.499999
v 0.749999 0.000000 -1.499999
v 0.749999 0.055000 0.181250
v 0.749999 0.055000 1.137499
v 0.999999 0.055000 0.181250
v 0.999999 0.055000 1.137499
v 0.281250 0.360000 -0.181250
v 0.531250 0.360000 -0.181250
v 0.531250 0.360000 1.137499
v 0.531250 0.360000 0.181250
v 0.281250 0.360000 0.181250
v 0.281250 0.360000 1.137499
v 0.637499 0.360000 1.137499
v 0.181250 0.360000 1.137499
v 0.181250 0.360000 0.181250
v 0.181250 0.360000 -0.181250
v 0.637499 0.360000 -0.181250
v 0.637499 0.360000 0.181250
v -0.281250 0.360000 1.137499
v -0.181250 0.360000 1.137499
v -0.637499 0.360000 1.137499
v -0.531250 0.360000 1.137499
v 0.999999 0.360000 1.137499
v -0.999999 0.360000 1.137499
v -0.637499 0.360000 0.181250
v -0.999999 0.360000 0.181250
v -0.281250 0.360000 0.181250
v -0.531250 0.360000 0.181250
v -0.181250 0.360000 0.181250
v 0.999999 0.360000 -0.181250
v -0.181250 0.360000 -0.181250
v -0.637499 0.360000 -0.181250
v -0.531250 0.360000 -0.181250
v -0.281250 0.360000 -0.181250
v 0.749999 0.305000 0.181250
v 0.999999 0.360000 0.181250
v 0.749999 0.305000 -0.181250
v 0.999999 0.415000 1.464643
v 0.999999 0.415000 -1.464643
v -0.999999 0.360000 -0.181250
v -0.999999 0.415000 1.461105
v 0.749999 0.055000 -0.181250
v 0.999999 0.055000 -0.181250
v 0.999999 -0.000000 1.464643
v 0.999999 0.000000 -1.464643
vn 0.0000 -1.0000 0.0000
vn 0.0000 1.0000 0.0000
vn 1.0000 0.0000 0.0000
vn 0.0000 0.0000 1.0000
vn -1.0000 0.0000 0.0000
vn -0.7071 0.0000 -0.7071
vn 0.0000 0.0000 -1.0000
vn -0.7660 0.0000 0.6428
vn 0.7071 0.0000 0.7071
vn 0.7071 0.0000 -0.7071
usemtl wood
s off
f 1//1 2//1 3//1
f 3//1 2//1 4//1
f 5//2 6//2 7//2
f 7//2 6//2 8//2
f 9//2 10//2 11//2
f 11//2 10//2 12//2
f 13//1 14//1 15//1
f 15//1 14//1 16//1
f 17//2 18//2 19//2
f 19//2 18//2 20//2
f 21//1 22//1 23//1
f 23//1 22//1 24//1
f 25//1 26//1 27//1
f 27//1 26//1 28//1
f 29//2 30//2 31//2
f 31//2 30//2 32//2
f 33//2 34//2 35//2
f 35//2 34//2 36//2
f 37//2 38//2 39//2
f 39//2 38//2 40//2
f 41//2 42//2 43//2
f 43//2 42//2 44//2
f 45//1 46//1 47//1
f 47//1 46//1 48//1
f 49//2 50//2 51//2
f 51//2 50//2 52//2
f 53//3 50//3 54//3
f 54//3 50//3 49//3
f 54//3 49//3 15//3
f 15//3 49//3 13//3
f 21//3 10//3 53//3
f 53//3 10//3 9//3
f 53//3 9//3 50//3
f 50//3 9//3 55//3
f 55//3 9//3 56//3
f 21//3 23//3 10//3
f 57//4 54//4 45//4
f 45//4 54//4 15//4
f 45//4 15//4 58//4
f 58//4 15//4 59//4
f 58//4 59//4 60//4
f 60//4 59//4 61//4
f 16//4 62//4 15//4
f 15//4 62//4 63//4
f 15//4 63//4 59//4
f 64//4 65//4 16//4
f 16//4 65//4 66//4
f 16//4 66//4 67//4
f 67//4 66//4 68//4
f 67//4 62//4 16//4
f 69//4 70//4 62//4
f 62//4 70//4 63//4
f 58//4 71//4 45//4
f 45//4 71//4 72//4
f 45//4 72//4 46//4
f 46//4 72//4 73//4
f 46//4 73//4 74//4
f 74//4 73//4 75//4
f 76//4 77//4 71//4
f 71//4 77//4 72//4
f 74//4 78//4 46//4
f 46//4 78//4 79//4
f 57//5 11//5 80//5
f 80//5 11//5 12//5
f 80//5 12//5 26//5
f 26//5 12//5 28//5
f 45//5 51//5 57//5
f 57//5 51//5 52//5
f 57//5 52//5 11//5
f 11//5 52//5 2//5
f 2//5 52//5 4//5
f 45//5 47//5 51//5
f 80//1 53//1 57//1
f 57//1 53//1 54//1
f 18//4 27//4 20//4
f 20//4 27//4 81//4
f 81//4 27//4 42//4
f 42//4 27//4 44//4
f 44//4 27//4 28//4
f 44//4 28//4 31//4
f 31//4 28//4 29//4
f 29//4 28//4 23//4
f 29//4 23//4 35//4
f 35//4 23//4 33//4
f 33//4 23//4 38//4
f 38//4 23//4 24//4
f 38//4 24//4 40//4
f 40//4 24//4 82//4
f 82//4 24//4 83//4
f 83//4 24//4 84//4
f 12//4 10//4 28//4
f 28//4 10//4 23//4
f 85//6 86//6 87//6
f 87//6 86//6 88//6
f 86//1 85//1 89//1
f 89//1 85//1 78//1
f 78//1 85//1 79//1
f 79//1 85//1 90//1
f 90//3 7//3 79//3
f 79//3 7//3 8//3
f 79//3 8//3 46//3
f 46//3 8//3 48//3
f 25//3 18//3 90//3
f 90//3 18//3 17//3
f 90//3 17//3 7//3
f 7//3 17//3 3//3
f 3//3 17//3 1//3
f 25//3 27//3 18//3
f 90//7 85//7 25//7
f 25//7 85//7 87//7
f 25//7 87//7 41//7
f 41//7 87//7 91//7
f 41//7 43//7 25//7
f 25//7 43//7 26//7
f 26//7 43//7 32//7
f 26//7 32//7 30//7
f 92//7 93//7 43//7
f 43//7 93//7 32//7
f 94//7 95//7 30//7
f 30//7 95//7 36//7
f 30//7 36//7 26//7
f 26//7 36//7 21//7
f 26//7 21//7 80//7
f 80//7 21//7 53//7
f 36//7 34//7 21//7
f 21//7 34//7 37//7
f 21//7 37//7 22//7
f 22//7 37//7 39//7
f 22//7 39//7 96//7
f 96//7 39//7 97//7
f 98//7 99//7 34//7
f 34//7 99//7 37//7
f 96//7 100//7 22//7
f 22//7 100//7 101//7
f 102//2 103//2 104//2
f 104//2 103//2 105//2
f 33//1 38//1 106//1
f 106//1 38//1 107//1
f 62//3 108//3 69//3
f 69//3 108//3 109//3
f 69//3 109//3 107//3
f 69//3 107//3 99//3
f 99//3 107//3 38//3
f 99//3 38//3 37//3
f 34//5 33//5 98//5
f 98//5 33//5 106//5
f 98//5 106//5 110//5
f 98//5 110//5 70//5
f 70//5 110//5 111//5
f 70//5 111//5 63//5
f 98//2 70//2 99//2
f 99//2 70//2 69//2
f 108//1 111//1 109//1
f 109//1 111//1 110//1
f 108//2 62//2 112//2
f 112//2 62//2 67//2
f 63//2 111//2 59//2
f 59//2 111//2 113//2
f 110//2 106//2 114//2
f 114//2 106//2 115//2
f 107//2 109//2 116//2
f 116//2 109//2 117//2
f 118//2 71//2 119//2
f 119//2 71//2 58//2
f 120//2 73//2 121//2
f 121//2 73//2 72//2
f 13//7 108//7 14//7
f 14//7 108//7 112//7
f 14//7 112//7 122//7
f 49//7 51//7 13//7
f 13//7 51//7 47//7
f 13//7 47//7 113//7
f 113//7 47//7 119//7
f 119//7 47//7 118//7
f 118//7 47//7 121//7
f 121//7 47//7 48//7
f 121//7 48//7 120//7
f 120//7 48//7 123//7
f 123//7 48//7 6//7
f 6//7 48//7 8//7
f 113//7 111//7 13//7
f 13//7 111//7 108//7
f 122//7 105//7 14//7
f 14//7 105//7 103//7
f 120//1 123//1 124//1
f 124//1 123//1 125//1
f 118//1 121//1 126//1
f 126//1 121//1 127//1
f 113//1 119//1 114//1
f 114//1 119//1 128//1
f 40//1 82//1 116//1
f 116//1 82//1 129//1
f 29//1 35//1 130//1
f 130//1 35//1 115//1
f 131//2 124//2 132//2
f 132//2 124//2 127//2
f 128//2 130//2 126//2
f 126//2 130//2 133//2
f 4//4 127//4 3//4
f 3//4 127//4 124//4
f 3//4 124//4 125//4
f 52//4 50//4 4//4
f 4//4 50//4 55//4
f 4//4 55//4 128//4
f 128//4 55//4 114//4
f 114//4 55//4 110//4
f 110//4 55//4 109//4
f 109//4 55//4 134//4
f 109//4 134//4 117//4
f 117//4 134//4 135//4
f 135//4 134//4 104//4
f 104//4 134//4 102//4
f 128//4 126//4 4//4
f 4//4 126//4 127//4
f 125//4 5//4 3//4
f 3//4 5//4 7//4
f 56//1 136//1 55//1
f 55//1 136//1 134//1
f 122//1 112//1 135//1
f 135//1 112//1 117//1
f 137//2 138//2 66//2
f 66//2 138//2 96//2
f 66//2 96//2 68//2
f 68//2 96//2 97//2
f 67//5 68//5 112//5
f 112//5 68//5 117//5
f 117//5 68//5 97//5
f 117//5 97//5 116//5
f 116//5 97//5 40//5
f 40//5 97//5 39//5
f 44//1 31//1 132//1
f 132//1 31//1 133//1
f 72//5 77//5 121//5
f 121//5 77//5 127//5
f 127//5 77//5 92//5
f 127//5 92//5 132//5
f 132//5 92//5 44//5
f 44//5 92//5 43//5
f 32//3 93//3 31//3
f 31//3 93//3 133//3
f 133//3 93//3 76//3
f 133//3 76//3 126//3
f 126//3 76//3 118//3
f 118//3 76//3 71//3
f 76//2 93//2 77//2
f 77//2 93//2 92//2
f 81//1 42//1 139//1
f 139//1 42//1 131//1
f 88//2 140//2 87//2
f 87//2 140//2 74//2
f 87//2 74//2 75//2
f 75//2 91//2 87//2
f 74//8 140//8 78//8
f 78//8 140//8 89//8
f 20//5 86//5 19//5
f 19//5 86//5 89//5
f 19//5 89//5 5//5
f 5//5 89//5 6//5
f 6//5 89//5 123//5
f 123//5 89//5 140//5
f 123//5 140//5 125//5
f 125//5 140//5 139//5
f 125//5 139//5 5//5
f 5//5 139//5 19//5
f 20//5 81//5 86//5
f 86//5 81//5 88//5
f 88//5 81//5 139//5
f 88//5 139//5 140//5
f 73//3 120//3 75//3
f 75//3 120//3 124//3
f 75//3 124//3 131//3
f 75//3 131//3 91//3
f 91//3 131//3 42//3
f 91//3 42//3 41//3
f 59//3 113//3 61//3
f 61//3 113//3 114//3
f 61//3 114//3 115//3
f 61//3 115//3 95//3
f 95//3 115//3 35//3
f 95//3 35//3 36//3
f 58//5 60//5 119//5
f 119//5 60//5 128//5
f 128//5 60//5 94//5
f 128//5 94//5 130//5
f 130//5 94//5 29//5
f 29//5 94//5 30//5
f 94//2 60//2 95//2
f 95//2 60//2 61//2
f 141//7 136//7 142//7
f 142//7 136//7 129//7
f 129//7 136//7 116//7
f 116//7 136//7 107//7
f 107//7 136//7 56//7
f 107//7 56//7 106//7
f 106//7 56//7 115//7
f 115//7 56//7 2//7
f 115//7 2//7 130//7
f 130//7 2//7 133//7
f 133//7 2//7 132//7
f 132//7 2//7 1//7
f 132//7 1//7 131//7
f 131//7 1//7 139//7
f 139//7 1//7 19//7
f 19//7 1//7 17//7
f 9//7 11//7 56//7
f 56//7 11//7 2//7
f 84//2 141//2 83//2
f 83//2 141//2 142//2
f 137//9 66//9 143//9
f 143//9 66//9 65//9
f 96//10 138//10 100//10
f 100//10 138//10 144//10
f 83//3 144//3 82//3
f 82//3 144//3 138//3
f 82//3 138//3 129//3
f 129//3 138//3 137//3
f 129//3 137//3 135//3
f 135//3 137//3 122//3
f 122//3 137//3 143//3
f 122//3 143//3 105//3
f 105//3 143//3 104//3
f 104//3 143//3 144//3
f 104//3 144//3 142//3
f 142//3 144//3 83//3
f 104//3 142//3 135//3
f 135//3 142//3 129//3
f 64//5 141//5 101//5
f 101//5 141//5 84//5
f 101//5 84//5 22//5
f 22//5 84//5 24//5
f 16//5 103//5 64//5
f 64//5 103//5 102//5
f 64//5 102//5 141//5
f 141//5 102//5 136//5
f 136//5 102//5 134//5
f 16//5 14//5 103//5
f 144//1 143//1 100//1
f 100//1 143//1 65//1
f 100//1 65//1 64//1
f 64//1 101//1 100//1
