[
    {
        "id": "a07fcfc8547c1b12",
        "type": "mqtt in",
        "z": "a98969e29c03b420",
        "name": "",
        "topic": "room2/temperature",
        "qos": "2",
        "datatype": "utf8",
        "broker": "4b1cf2b1a1ec6f4d",
        "nl": false,
        "rap": true,
        "rh": 0,
        "inputs": 0,
        "x": 330,
        "y": 460,
        "wires": [
            [
                "e482f29b526abbe1"
            ]
        ]
    },
    {
        "id": "d4588c024edb1674",
        "type": "ui_chart",
        "z": "a98969e29c03b420",
        "name": "",
        "group": "2d409e5a629e3627",
        "order": 2,
        "width": "6",
        "height": "6",
        "label": "Temperature - last 10min",
        "chartType": "line",
        "legend": "false",
        "xformat": "HH:mm:ss",
        "interpolate": "linear",
        "nodata": "",
        "dot": false,
        "ymin": "20",
        "ymax": "35",
        "removeOlder": "5",
        "removeOlderPoints": "",
        "removeOlderUnit": "60",
        "cutout": 0,
        "useOneColor": false,
        "useUTC": false,
        "colors": [
            "#1f77b4",
            "#ff0000",
            "#ff7f0e",
            "#2ca02c",
            "#98df8a",
            "#d62728",
            "#ff9896",
            "#9467bd",
            "#c5b0d5"
        ],
        "outputs": 1,
        "useDifferentColor": false,
        "className": "",
        "x": 1170,
        "y": 480,
        "wires": [
            []
        ]
    },
    {
        "id": "4885dd231ff64b20",
        "type": "inject",
        "z": "a98969e29c03b420",
        "name": "Clear chart",
        "props": [
            {
                "p": "payload"
            },
            {
                "p": "topic",
                "vt": "str"
            }
        ],
        "repeat": "",
        "crontab": "",
        "once": false,
        "onceDelay": 0.1,
        "topic": "",
        "payload": "[]",
        "payloadType": "json",
        "x": 920,
        "y": 520,
        "wires": [
            [
                "d4588c024edb1674"
            ]
        ]
    },
    {
        "id": "398e172a3c7d8dc3",
        "type": "function",
        "z": "a98969e29c03b420",
        "name": "temperature threshold (red/blue)",
        "func": "var last = context.get('last') || 'under'\nvar threshold = 25\nvar undermessage = {topic:'under',payload:null}\nvar overmessage = {topic:'over',payload:null}\nvar unsentmessage = null\n\nif(msg.payload < threshold){\n    if(last == 'under'){\n        undermessage.payload = threshold\n        overmessage.payload = threshold\n        unsentmessage = msg\n    }\n    else{\n        overmessage.payload = msg.payload\n    }\n    last = 'over'\n}\nelse{\n    if(last == 'over'){\n        overmessage.payload = threshold\n        undermessage.payload = threshold\n        unsentmessage = msg\n    }\n    else{\n        undermessage.payload = msg.payload\n    }\n    last = 'under'\n}\ncontext.set('last',last)\n\nreturn [[overmessage,undermessage],unsentmessage]",
        "outputs": 2,
        "noerr": 0,
        "initialize": "",
        "finalize": "",
        "libs": [],
        "x": 850,
        "y": 460,
        "wires": [
            [
                "d4588c024edb1674"
            ],
            []
        ]
    },
    {
        "id": "e482f29b526abbe1",
        "type": "function",
        "z": "a98969e29c03b420",
        "name": "convert to number",
        "func": "msg.payload = Number(msg.payload);\nreturn msg;",
        "outputs": 1,
        "noerr": 0,
        "initialize": "",
        "finalize": "",
        "libs": [],
        "x": 570,
        "y": 460,
        "wires": [
            [
                "398e172a3c7d8dc3"
            ]
        ]
    },
    {
        "id": "4b1cf2b1a1ec6f4d",
        "type": "mqtt-broker",
        "name": "local mqtt broker on gateway",
        "broker": "iotgateway",
        "port": "1883",
        "clientid": "",
        "autoConnect": true,
        "usetls": false,
        "protocolVersion": "4",
        "keepalive": "60",
        "cleansession": true,
        "birthTopic": "",
        "birthQos": "0",
        "birthPayload": "",
        "birthMsg": {},
        "closeTopic": "",
        "closeQos": "0",
        "closePayload": "",
        "closeMsg": {},
        "willTopic": "",
        "willQos": "0",
        "willPayload": "",
        "willMsg": {},
        "sessionExpiry": ""
    },
    {
        "id": "2d409e5a629e3627",
        "type": "ui_group",
        "name": "Room2",
        "tab": "48eda0fa9ee46e86",
        "order": 1,
        "disp": true,
        "width": "6",
        "collapse": false,
        "className": ""
    },
    {
        "id": "48eda0fa9ee46e86",
        "type": "ui_tab",
        "name": "Room2",
        "icon": "dashboard",
        "disabled": false,
        "hidden": false
    }
]