[
    {
        "id": "72d4777e19872fe1",
        "type": "mqtt in",
        "z": "10ed4ab6f48665ab",
        "name": "",
        "topic": "analog_node/water",
        "qos": "2",
        "datatype": "auto-detect",
        "broker": "4d6296f2db4785e3",
        "nl": false,
        "rap": true,
        "rh": 0,
        "inputs": 0,
        "x": 270,
        "y": 620,
        "wires": [
            [
                "af3ae93265283b78"
            ]
        ]
    },
    {
        "id": "af3ae93265283b78",
        "type": "rbe",
        "z": "10ed4ab6f48665ab",
        "name": "",
        "func": "rbe",
        "gap": "",
        "start": "",
        "inout": "out",
        "septopics": true,
        "property": "payload",
        "topi": "topic",
        "x": 510,
        "y": 620,
        "wires": [
            [
                "212928a0ea6f2eb7"
            ]
        ]
    },
    {
        "id": "635913283dcd7632",
        "type": "ui_gauge",
        "z": "10ed4ab6f48665ab",
        "name": "",
        "group": "2e7b447f8a602f27",
        "order": 4,
        "width": 0,
        "height": 0,
        "gtype": "wave",
        "title": "Moisture",
        "label": "",
        "format": "{{value}}",
        "min": "0",
        "max": "1024",
        "colors": [
            "#00b500",
            "#e6e600",
            "#ca3838"
        ],
        "seg1": "",
        "seg2": "",
        "className": "",
        "x": 980,
        "y": 540,
        "wires": []
    },
    {
        "id": "401f5b17083b6919",
        "type": "ui_text",
        "z": "10ed4ab6f48665ab",
        "group": "2e7b447f8a602f27",
        "order": 6,
        "width": 0,
        "height": 0,
        "name": "",
        "label": "{{msg.label}}",
        "format": "{{msg.payload}}",
        "layout": "row-spread",
        "className": "",
        "x": 1170,
        "y": 620,
        "wires": []
    },
    {
        "id": "212928a0ea6f2eb7",
        "type": "function",
        "z": "10ed4ab6f48665ab",
        "name": "function 4",
        "func": "return { payload: 1024 - parseInt(msg[\"payload\"])}",
        "outputs": 1,
        "noerr": 0,
        "initialize": "",
        "finalize": "",
        "libs": [],
        "x": 740,
        "y": 620,
        "wires": [
            [
                "635913283dcd7632",
                "a7533e1dd89a2585"
            ]
        ]
    },
    {
        "id": "a7533e1dd89a2585",
        "type": "switch",
        "z": "10ed4ab6f48665ab",
        "name": "",
        "property": "payload",
        "propertyType": "msg",
        "rules": [
            {
                "t": "gt",
                "v": "399",
                "vt": "str"
            },
            {
                "t": "else"
            }
        ],
        "checkall": "true",
        "repair": false,
        "outputs": 2,
        "x": 930,
        "y": 620,
        "wires": [
            [
                "6b0c67b447264eb9"
            ],
            [
                "93b2f832b618b946"
            ]
        ]
    },
    {
        "id": "6b0c67b447264eb9",
        "type": "change",
        "z": "10ed4ab6f48665ab",
        "name": "",
        "rules": [
            {
                "t": "set",
                "p": "label",
                "pt": "msg",
                "to": "Wet",
                "tot": "str"
            }
        ],
        "action": "",
        "property": "",
        "from": "",
        "to": "",
        "reg": false,
        "x": 1030,
        "y": 580,
        "wires": [
            [
                "401f5b17083b6919"
            ]
        ]
    },
    {
        "id": "93b2f832b618b946",
        "type": "change",
        "z": "10ed4ab6f48665ab",
        "name": "",
        "rules": [
            {
                "t": "set",
                "p": "label",
                "pt": "msg",
                "to": "Dry",
                "tot": "str"
            }
        ],
        "action": "",
        "property": "",
        "from": "",
        "to": "",
        "reg": false,
        "x": 1030,
        "y": 660,
        "wires": [
            [
                "401f5b17083b6919"
            ]
        ]
    },
    {
        "id": "4d6296f2db4785e3",
        "type": "mqtt-broker",
        "name": "local mqtt broker on gateway",
        "broker": "192.168.12.1",
        "port": "1883",
        "clientid": "",
        "autoConnect": true,
        "usetls": false,
        "protocolVersion": "4",
        "keepalive": "60",
        "cleansession": true,
        "birthTopic": "",
        "birthQos": "0",
        "birthPayload": "",
        "birthMsg": {},
        "closeTopic": "",
        "closeQos": "0",
        "closePayload": "",
        "closeMsg": {},
        "willTopic": "",
        "willQos": "0",
        "willPayload": "",
        "willMsg": {},
        "userProps": "",
        "sessionExpiry": ""
    },
    {
        "id": "2e7b447f8a602f27",
        "type": "ui_group",
        "name": "Default",
        "tab": "f084747d9b4f2415",
        "order": 1,
        "disp": true,
        "width": "6",
        "collapse": false,
        "className": ""
    },
    {
        "id": "f084747d9b4f2415",
        "type": "ui_tab",
        "name": "Home",
        "icon": "dashboard",
        "disabled": false,
        "hidden": false
    }
]