Variant: profileUnitTest
Config: debug
Store: C:\Users\kaspa\.android\debug.keystore
Alias: AndroidDebugKey
MD5: F7:ED:19:7F:FC:B3:CD:03:F8:B1:52:17:E9:2B:63:F1
SHA1: 84:EE:10:E1:67:7D:C9:5B:82:D8:3E:59:E8:86:8F:E5:1A:32:9F:DD
SHA-256: 83:E3:4C:5D:D9:F1:1C:9B:B3:30:40:59:7D:0F:CF:9D:1E:09:18:CC:56:3E:57:1C:F0:ED:A2:64:E4:F1:20:53
Valid until: Saturday, 6 August 2050
----------
Variant: debugUnitTest
Config: debug
Store: C:\Users\kaspa\.android\debug.keystore
Alias: AndroidDebugKey
MD5: F7:ED:19:7F:FC:B3:CD:03:F8:B1:52:17:E9:2B:63:F1
SHA1: 84:EE:10:E1:67:7D:C9:5B:82:D8:3E:59:E8:86:8F:E5:1A:32:9F:DD
SHA-256: 83:E3:4C:5D:D9:F1:1C:9B:B3:30:40:59:7D:0F:CF:9D:1E:09:18:CC:56:3E:57:1C:F0:ED:A2:64:E4:F1:20:53
Valid until: Saturday, 6 August 2050
----------
Variant: debugAndroidTest
Config: debug
Store: C:\Users\kaspa\.android\debug.keystore
Alias: AndroidDebugKey
MD5: F7:ED:19:7F:FC:B3:CD:03:F8:B1:52:17:E9:2B:63:F1
SHA1: 84:EE:10:E1:67:7D:C9:5B:82:D8:3E:59:E8:86:8F:E5:1A:32:9F:DD
SHA-256: 83:E3:4C:5D:D9:F1:1C:9B:B3:30:40:59:7D:0F:CF:9D:1E:09:18:CC:56:3E:57:1C:F0:ED:A2:64:E4:F1:20:53
Valid until: Saturday, 6 August 2050
----------
Variant: profile
Config: debug
Store: C:\Users\kaspa\.android\debug.keystore
Alias: AndroidDebugKey
MD5: F7:ED:19:7F:FC:B3:CD:03:F8:B1:52:17:E9:2B:63:F1
SHA1: 84:EE:10:E1:67:7D:C9:5B:82:D8:3E:59:E8:86:8F:E5:1A:32:9F:DD
SHA-256: 83:E3:4C:5D:D9:F1:1C:9B:B3:30:40:59:7D:0F:CF:9D:1E:09:18:CC:56:3E:57:1C:F0:ED:A2:64:E4:F1:20:53
Valid until: Saturday, 6 August 2050
----------
Variant: debug
Config: debug
Store: C:\Users\kaspa\.android\debug.keystore
Alias: AndroidDebugKey
MD5: F7:ED:19:7F:FC:B3:CD:03:F8:B1:52:17:E9:2B:63:F1
SHA1: 84:EE:10:E1:67:7D:C9:5B:82:D8:3E:59:E8:86:8F:E5:1A:32:9F:DD
SHA-256: 83:E3:4C:5D:D9:F1:1C:9B:B3:30:40:59:7D:0F:CF:9D:1E:09:18:CC:56:3E:57:1C:F0:ED:A2:64:E4:F1:20:53
Valid until: Saturday, 6 August 2050
----------
Variant: release
Config: debug
Store: C:\Users\kaspa\.android\debug.keystore
Alias: AndroidDebugKey
MD5: F7:ED:19:7F:FC:B3:CD:03:F8:B1:52:17:E9:2B:63:F1
SHA1: 84:EE:10:E1:67:7D:C9:5B:82:D8:3E:59:E8:86:8F:E5:1A:32:9F:DD
SHA-256: 83:E3:4C:5D:D9:F1:1C:9B:B3:30:40:59:7D:0F:CF:9D:1E:09:18:CC:56:3E:57:1C:F0:ED:A2:64:E4:F1:20:53
Valid until: Saturday, 6 August 2050
----------
Variant: releaseUnitTest
Config: debug
Store: C:\Users\kaspa\.android\debug.keystore
Alias: AndroidDebugKey
MD5: F7:ED:19:7F:FC:B3:CD:03:F8:B1:52:17:E9:2B:63:F1
SHA1: 84:EE:10:E1:67:7D:C9:5B:82:D8:3E:59:E8:86:8F:E5:1A:32:9F:DD
SHA-256: 83:E3:4C:5D:D9:F1:1C:9B:B3:30:40:59:7D:0F:CF:9D:1E:09:18:CC:56:3E:57:1C:F0:ED:A2:64:E4:F1:20:53
Valid until: Saturday, 6 August 2050
----------
