<?xml version="1.0" encoding="UTF-8" standalone="no"?>
<!-- Created with Inkscape (http://www.inkscape.org/) -->

<svg
   version="1.1"
   id="svg2937"
   xml:space="preserve"
   width="242.90933"
   height="168.21082"
   viewBox="0 0 242.90933 168.21081"
   sodipodi:docname="cylin_c.svg"
   inkscape:version="1.1 (c68e22c387, 2021-05-23)"
   xmlns:inkscape="http://www.inkscape.org/namespaces/inkscape"
   xmlns:sodipodi="http://sodipodi.sourceforge.net/DTD/sodipodi-0.dtd"
   xmlns="http://www.w3.org/2000/svg"
   xmlns:svg="http://www.w3.org/2000/svg"><defs
     id="defs2941"><marker
       style="overflow:visible"
       id="Arrow1Mstart"
       refX="0.0"
       refY="0.0"
       orient="auto"
       inkscape:stockid="Arrow1Mstart"
       inkscape:isstock="true"><path
         transform="scale(0.4) translate(10,0)"
         style="fill-rule:evenodd;fill:context-stroke;stroke:context-stroke;stroke-width:1.0pt"
         d="M 0.0,0.0 L 5.0,-5.0 L -12.5,0.0 L 5.0,5.0 L 0.0,0.0 z "
         id="path4450" /></marker><marker
       style=""
       id="marker6152"
       refX="0.0"
       refY="0.0"
       orient="auto"
       inkscape:stockid="Arrow2Mstart"
       inkscape:isstock="true"><path
         transform="scale(0.6) translate(0,0)"
         d="M 8.7185878,4.0337352 L -2.2072895,0.016013256 L 8.7185884,-4.0017078 C 6.9730900,-1.6296469 6.9831476,1.6157441 8.7185878,4.0337352 z "
         style="fill-rule:evenodd;fill:context-stroke;stroke-width:0.62500000;stroke-linejoin:round"
         id="path6150" /></marker><marker
       style="overflow:visible"
       id="marker5923"
       refX="0.0"
       refY="0.0"
       orient="auto"
       inkscape:stockid="Arrow2Mstart"
       inkscape:isstock="true"><path
         transform="scale(0.6) translate(0,0)"
         d="M 8.7185878,4.0337352 L -2.2072895,0.016013256 L 8.7185884,-4.0017078 C 6.9730900,-1.6296469 6.9831476,1.6157441 8.7185878,4.0337352 z "
         style="fill-rule:evenodd;fill:context-stroke;stroke-width:0.62500000;stroke-linejoin:round"
         id="path5921" /></marker><marker
       style="overflow:visible"
       id="Arrow2Mstart"
       refX="0.0"
       refY="0.0"
       orient="auto"
       inkscape:stockid="Arrow2Mstart"
       inkscape:isstock="true"><path
         transform="scale(0.6) translate(0,0)"
         d="M 8.7185878,4.0337352 L -2.2072895,0.016013256 L 8.7185884,-4.0017078 C 6.9730900,-1.6296469 6.9831476,1.6157441 8.7185878,4.0337352 z "
         style="fill-rule:evenodd;fill:context-stroke;stroke-width:0.62500000;stroke-linejoin:round"
         id="path4468" /></marker><marker
       style="overflow:visible;"
       id="Arrow2Lend"
       refX="0.0"
       refY="0.0"
       orient="auto"
       inkscape:stockid="Arrow2Lend"
       inkscape:isstock="true"><path
         transform="scale(1.1) rotate(180) translate(1,0)"
         d="M 8.7185878,4.0337352 L -2.2072895,0.016013256 L 8.7185884,-4.0017078 C 6.9730900,-1.6296469 6.9831476,1.6157441 8.7185878,4.0337352 z "
         style="fill-rule:evenodd;fill:context-stroke;stroke-width:0.62500000;stroke-linejoin:round;"
         id="path4465" /></marker><marker
       style="overflow:visible"
       id="Arrow1Lstart"
       refX="0.0"
       refY="0.0"
       orient="auto"
       inkscape:stockid="Arrow1Lstart"
       inkscape:isstock="true"><path
         transform="scale(0.8) translate(12.5,0)"
         style="fill-rule:evenodd;fill:context-stroke;stroke:context-stroke;stroke-width:1.0pt"
         d="M 0.0,0.0 L 5.0,-5.0 L -12.5,0.0 L 5.0,5.0 L 0.0,0.0 z "
         id="path4444" /></marker><marker
       style="overflow:visible;"
       id="marker4714"
       refX="0.0"
       refY="0.0"
       orient="auto"
       inkscape:stockid="Arrow1Lend"
       inkscape:isstock="true"><path
         transform="scale(0.8) rotate(180) translate(12.5,0)"
         style="fill-rule:evenodd;fill:context-stroke;stroke:context-stroke;stroke-width:1.0pt;"
         d="M 0.0,0.0 L 5.0,-5.0 L -12.5,0.0 L 5.0,5.0 L 0.0,0.0 z "
         id="path4712" /></marker><marker
       style="overflow:visible;"
       id="Arrow1Lend"
       refX="0.0"
       refY="0.0"
       orient="auto"
       inkscape:stockid="Arrow1Lend"
       inkscape:isstock="true"><path
         transform="scale(0.8) rotate(180) translate(12.5,0)"
         style="fill-rule:evenodd;fill:context-stroke;stroke:context-stroke;stroke-width:1.0pt;"
         d="M 0.0,0.0 L 5.0,-5.0 L -12.5,0.0 L 5.0,5.0 L 0.0,0.0 z "
         id="path4447" /></marker><clipPath
       clipPathUnits="userSpaceOnUse"
       id="clipPath2957"><path
         d="m 1385.09,2771.2 0.69,-687.38 C 1277.11,1931.2 1107.15,1786.61 838.676,1712.37 651.895,1660.73 456.176,1651.43 306.688,1676.8 v 686.02 c 149.488,-25.39 340.519,-11.33 527.25,40.29 268.472,74.22 439.732,215.45 551.152,368.09"
         clip-rule="evenodd"
         id="path2955" /></clipPath><clipPath
       clipPathUnits="userSpaceOnUse"
       id="clipPath2963"><path
         d="m 306.688,1651.43 h 1079.09 V 2771.2 H 306.688 Z"
         id="path2961" /></clipPath><linearGradient
       x1="0"
       y1="0"
       x2="1"
       y2="0"
       gradientUnits="userSpaceOnUse"
       gradientTransform="matrix(1079.09,0,0,-1159.77,306.689,2791.2)"
       spreadMethod="pad"
       id="linearGradient2969"><stop
         style="stop-opacity:1;stop-color:#b2e6fa"
         offset="0"
         id="stop2965" /><stop
         style="stop-opacity:1;stop-color:#f5fcfe"
         offset="1"
         id="stop2967" /></linearGradient><clipPath
       clipPathUnits="userSpaceOnUse"
       id="clipPath2979"><path
         d="m 866.168,2764.02 391.962,-210.48 c 86.18,65.03 156,137.44 205.72,212.72 l -597.682,-2.24"
         clip-rule="evenodd"
         id="path2977" /></clipPath><clipPath
       clipPathUnits="userSpaceOnUse"
       id="clipPath2985"><path
         d="m 866.168,2553.54 h 597.684 v 212.723 H 866.168 Z"
         id="path2983" /></clipPath><radialGradient
       fx="0"
       fy="0"
       cx="0"
       cy="0"
       r="1"
       gradientUnits="userSpaceOnUse"
       gradientTransform="matrix(765,0,0,-765,711.411,2758.13)"
       spreadMethod="pad"
       id="radialGradient2991"><stop
         style="stop-opacity:1;stop-color:#b2e6fa"
         offset="0"
         id="stop2987" /><stop
         style="stop-opacity:1;stop-color:#e5f7fd"
         offset="1"
         id="stop2989" /></radialGradient><clipPath
       clipPathUnits="userSpaceOnUse"
       id="clipPath3001"><path
         d="m 1085.78,2519.33 -0.99,119.77 c 128.21,72.15 232.33,160.7 295.75,252.52 l 0.65,-120.68 c -61.85,-91.81 -166.51,-179.86 -295.41,-251.61"
         clip-rule="evenodd"
         id="path2999" /></clipPath><clipPath
       clipPathUnits="userSpaceOnUse"
       id="clipPath3007"><path
         d="m 1084.79,2519.33 h 296.402 v 372.289 H 1084.79 Z"
         id="path3005" /></clipPath><linearGradient
       x1="0"
       y1="0"
       x2="1"
       y2="0"
       gradientUnits="userSpaceOnUse"
       gradientTransform="matrix(296.401,0,0,-412.29,1084.79,2911.62)"
       spreadMethod="pad"
       id="linearGradient3013"><stop
         style="stop-opacity:1;stop-color:#b2e6fa"
         offset="0"
         id="stop3009" /><stop
         style="stop-opacity:1;stop-color:#d9f3fd"
         offset="1"
         id="stop3011" /></linearGradient><clipPath
       clipPathUnits="userSpaceOnUse"
       id="clipPath3023"><path
         d="m 713.125,2877.68 583.225,-317.43 v -833.52 l -177.26,110.99 -2.35,685.95 -404.006,238.55 0.391,115.46"
         clip-rule="evenodd"
         id="path3021" /></clipPath><clipPath
       clipPathUnits="userSpaceOnUse"
       id="clipPath3029"><path
         d="m 712.734,1726.73 h 583.617 V 2877.68 H 712.734 Z"
         id="path3027" /></clipPath><linearGradient
       x1="0"
       y1="0"
       x2="1"
       y2="0"
       gradientUnits="userSpaceOnUse"
       gradientTransform="matrix(-578.301,0,0,1190.95,1297.62,1706.73)"
       spreadMethod="pad"
       id="linearGradient3035"><stop
         style="stop-opacity:1;stop-color:#66cef5"
         offset="0"
         id="stop3031" /><stop
         style="stop-opacity:1;stop-color:#f2fbfe"
         offset="1"
         id="stop3033" /></linearGradient><clipPath
       clipPathUnits="userSpaceOnUse"
       id="clipPath3047"><path
         d="m 1177.32,2497.2 c -102.61,-64.72 -222.824,-119.4 -355.965,-158.42 -204.41,-59.9 -414.46,-71.17 -578.3,-40.13 l 470.992,464.79 463.273,-266.24"
         clip-rule="evenodd"
         id="path3045" /></clipPath><clipPath
       clipPathUnits="userSpaceOnUse"
       id="clipPath3053"><path
         d="m 243.055,2267.61 h 934.266 v 495.832 H 243.055 Z"
         id="path3051" /></clipPath><radialGradient
       fx="0"
       fy="0"
       cx="0"
       cy="0"
       r="1"
       gradientUnits="userSpaceOnUse"
       gradientTransform="matrix(1239.63,0,0,-1239.63,1.16211,2745.1)"
       spreadMethod="pad"
       id="radialGradient3059"><stop
         style="stop-opacity:1;stop-color:#b2e6fa"
         offset="0"
         id="stop3055" /><stop
         style="stop-opacity:1;stop-color:#e5f7fd"
         offset="1"
         id="stop3057" /></radialGradient><clipPath
       clipPathUnits="userSpaceOnUse"
       id="clipPath3069"><path
         d="m 1115.45,2656.34 1.25,-119.63 c -85.43,-47.58 -212.184,-103.34 -313.493,-132.94 -176.723,-51.64 -357.441,-65.68 -498.883,-40.3 v 119.31 c 141.442,-25.39 322.184,-11.34 498.883,40.29 101.188,29.56 227.343,85.49 312.243,133.27"
         clip-rule="evenodd"
         id="path3067" /></clipPath><clipPath
       clipPathUnits="userSpaceOnUse"
       id="clipPath3075"><path
         d="m 304.324,2338.09 h 812.375 v 318.25 H 304.324 Z"
         id="path3073" /></clipPath><linearGradient
       x1="0"
       y1="0"
       x2="1"
       y2="0"
       gradientUnits="userSpaceOnUse"
       gradientTransform="matrix(812.368,0,0,-358.247,304.33,2676.34)"
       spreadMethod="pad"
       id="linearGradient3081"><stop
         style="stop-opacity:1;stop-color:#b2e6fa"
         offset="0"
         id="stop3077" /><stop
         style="stop-opacity:1;stop-color:#d9f3fd"
         offset="1"
         id="stop3079" /></linearGradient><clipPath
       clipPathUnits="userSpaceOnUse"
       id="clipPath3091"><path
         d="m 3314.23,2772.61 0.69,-687.37 c -108.67,-152.63 -342.38,-294.84 -610.86,-369.08 -186.77,-51.64 -377.78,-65.68 -527.25,-40.3 v 686.01 c 149.47,-25.39 340.5,-11.34 527.25,40.29 268.46,74.22 498.75,217.83 610.17,370.45"
         clip-rule="evenodd"
         id="path3089" /></clipPath><clipPath
       clipPathUnits="userSpaceOnUse"
       id="clipPath3097"><path
         d="M 2176.81,1650.48 H 3314.92 V 2772.61 H 2176.81 Z"
         id="path3095" /></clipPath><linearGradient
       x1="0"
       y1="0"
       x2="1"
       y2="0"
       gradientUnits="userSpaceOnUse"
       gradientTransform="matrix(1138.11,0,0,-1162.13,2176.8,2792.61)"
       spreadMethod="pad"
       id="linearGradient3103"><stop
         style="stop-opacity:1;stop-color:#b2e6fa"
         offset="0"
         id="stop3099" /><stop
         style="stop-opacity:1;stop-color:#f5fcfe"
         offset="1"
         id="stop3101" /></linearGradient><clipPath
       clipPathUnits="userSpaceOnUse"
       id="clipPath3113"><path
         d="m 3316.69,2774.58 -729.56,-1.97 -410.32,-410.74 c 152.68,-27.29 337.43,-15.32 527.92,37.35 273.84,75.73 502.14,218.46 611.96,375.36"
         clip-rule="evenodd"
         id="path3111" /></clipPath><clipPath
       clipPathUnits="userSpaceOnUse"
       id="clipPath3119"><path
         d="m 3536.69,2554.58 -789.94,-789.94 -789.94,789.94 789.94,789.94 z"
         id="path3117" /></clipPath><radialGradient
       fx="0"
       fy="0"
       cx="0"
       cy="0"
       r="1"
       gradientUnits="userSpaceOnUse"
       gradientTransform="matrix(-414.863,-414.863,-414.863,414.863,2581.24,2777.26)"
       spreadMethod="pad"
       id="radialGradient3125"><stop
         style="stop-opacity:1;stop-color:#b2e6fa"
         offset="0"
         id="stop3121" /><stop
         style="stop-opacity:1;stop-color:#f2fbfe"
         offset="1"
         id="stop3123" /></radialGradient><clipPath
       clipPathUnits="userSpaceOnUse"
       id="clipPath3489"><path
         d="m 2096.01,777.719 88.15,-47.68 86.78,45.633 -84.41,38.828 -90.52,-36.781"
         clip-rule="evenodd"
         id="path3487" /></clipPath><clipPath
       clipPathUnits="userSpaceOnUse"
       id="clipPath3495"><path
         d="m 2096.01,730.039 h 174.93 v 84.4609 h -174.93 z"
         id="path3493" /></clipPath><linearGradient
       x1="0"
       y1="0"
       x2="1"
       y2="0"
       gradientUnits="userSpaceOnUse"
       gradientTransform="matrix(174.922,0,0,-124.453,2096.01,834.5)"
       spreadMethod="pad"
       id="linearGradient3501"><stop
         style="stop-opacity:1;stop-color:#edf9fe"
         offset="0"
         id="stop3497" /><stop
         style="stop-opacity:1;stop-color:#19b5f1"
         offset="1"
         id="stop3499" /></linearGradient><clipPath
       clipPathUnits="userSpaceOnUse"
       id="clipPath3511"><path
         d="m 2184.16,733.879 87.35,42.5 V 667.762 l -87.35,-46.043 v 112.16"
         clip-rule="evenodd"
         id="path3509" /></clipPath><clipPath
       clipPathUnits="userSpaceOnUse"
       id="clipPath3517"><path
         d="M 2216,818.422 2345.94,720 2239.67,579.68 2109.72,678.102 Z"
         id="path3515" /></clipPath><linearGradient
       x1="0"
       y1="0"
       x2="1"
       y2="0"
       gradientUnits="userSpaceOnUse"
       gradientTransform="matrix(76.6701,-58.067,-130.428,-172.215,2248.13,819.17)"
       spreadMethod="pad"
       id="linearGradient3523"><stop
         style="stop-opacity:1;stop-color:#00adef"
         offset="0"
         id="stop3519" /><stop
         style="stop-opacity:1;stop-color:#f2fbfe"
         offset="1"
         id="stop3521" /></linearGradient><clipPath
       clipPathUnits="userSpaceOnUse"
       id="clipPath3533"><path
         d="m 2184.16,734.871 -88.15,42.871 v -109.57 l 88.15,-46.453 v 113.152"
         clip-rule="evenodd"
         id="path3531" /></clipPath><clipPath
       clipPathUnits="userSpaceOnUse"
       id="clipPath3539"><path
         d="m 2020.77,720.34 130.96,99.91 107.66,-141.129 -130.95,-99.91 z"
         id="path3537" /></clipPath><linearGradient
       x1="0"
       y1="0"
       x2="1"
       y2="0"
       gradientUnits="userSpaceOnUse"
       gradientTransform="matrix(87.878,67.043,131.924,-172.922,2030.4,752.84)"
       spreadMethod="pad"
       id="linearGradient3545"><stop
         style="stop-opacity:1;stop-color:#00adef"
         offset="0"
         id="stop3541" /><stop
         style="stop-opacity:1;stop-color:#e5f7fd"
         offset="1"
         id="stop3543" /></linearGradient><marker
       style="overflow:visible"
       id="Arrow2Mstart-3"
       refX="0"
       refY="0"
       orient="auto"
       inkscape:stockid="Arrow2Mstart"
       inkscape:isstock="true"><path
         transform="scale(0.6)"
         d="M 8.7185878,4.0337352 -2.2072895,0.01601326 8.7185884,-4.0017078 c -1.7454984,2.3720609 -1.7354408,5.6174519 -6e-7,8.035443 z"
         style="fill:context-stroke;fill-rule:evenodd;stroke-width:0.625;stroke-linejoin:round"
         id="path4468-6" /></marker><marker
       style=""
       refX="0.0"
       refY="0.0"
       orient="auto"
       inkscape:stockid="marker61529317"
       inkscape:isstock="true"
       id="marker61529317"><path
         transform="scale(0.6) translate(0,0)"
         d="M 8.7185878,4.0337352 L -2.2072895,0.016013256 L 8.7185884,-4.0017078 C 6.9730900,-1.6296469 6.9831476,1.6157441 8.7185878,4.0337352 z "
         style="fill-rule:evenodd;fill:#ff0000;stroke-width:0.62500000;stroke-linejoin:round"
         id="path11449" /></marker><marker
       style="overflow:visible"
       refX="0.0"
       refY="0.0"
       orient="auto"
       inkscape:stockid="Arrow2Mstart9368"
       inkscape:isstock="true"
       id="Arrow2Mstart9368"><path
         transform="scale(0.6) translate(0,0)"
         d="M 8.7185878,4.0337352 L -2.2072895,0.016013256 L 8.7185884,-4.0017078 C 6.9730900,-1.6296469 6.9831476,1.6157441 8.7185878,4.0337352 z "
         style="fill-rule:evenodd;fill:#ff0000;stroke-width:0.62500000;stroke-linejoin:round"
         id="path13266" /></marker><marker
       style="overflow:visible"
       refX="0.0"
       refY="0.0"
       orient="auto"
       inkscape:stockid="marker59238312"
       inkscape:isstock="true"
       id="marker59238312"><path
         transform="scale(0.6) translate(0,0)"
         d="M 8.7185878,4.0337352 L -2.2072895,0.016013256 L 8.7185884,-4.0017078 C 6.9730900,-1.6296469 6.9831476,1.6157441 8.7185878,4.0337352 z "
         style="fill-rule:evenodd;fill:#ff0000;stroke-width:0.62500000;stroke-linejoin:round"
         id="path13269" /></marker><linearGradient
       x1="0"
       y1="0"
       x2="1"
       y2="0"
       gradientUnits="userSpaceOnUse"
       gradientTransform="matrix(113.811,0,0,-116.213,272.81815,92.174606)"
       spreadMethod="pad"
       id="linearGradient37"><stop
         style="stop-opacity:1;stop-color:#bfeafb"
         offset="0"
         id="stop33" /><stop
         style="stop-opacity:1;stop-color:#f2fbfe"
         offset="1"
         id="stop35" /></linearGradient></defs><sodipodi:namedview
     id="namedview2939"
     pagecolor="#ffffff"
     bordercolor="#666666"
     borderopacity="1.0"
     inkscape:pageshadow="2"
     inkscape:pageopacity="0.0"
     inkscape:pagecheckerboard="0"
     showgrid="false"
     fit-margin-top="0"
     fit-margin-left="0"
     fit-margin-right="0"
     fit-margin-bottom="0"
     inkscape:zoom="3.5005835"
     inkscape:cx="178.6845"
     inkscape:cy="108.69617"
     inkscape:window-width="1360"
     inkscape:window-height="739"
     inkscape:window-x="-9"
     inkscape:window-y="247"
     inkscape:window-maximized="1"
     inkscape:current-layer="g2943" /><g
     id="g2943"
     inkscape:groupmode="layer"
     inkscape:label="ink_ext_XXXXXX"
     transform="matrix(1.3333333,0,0,-1.3333333,-146.33866,174.84)"><g
       id="g1338"><path
         style="color:#000000;fill:#f3f3f3;fill-rule:evenodd;stroke-width:0.106926;-inkscape-stroke:none"
         d="M 169.45741,59.0859 H 280.68384 L 248.82956,21.7781 h -115.5473 l 36.17515,37.3078"
         id="path304" /><path
         d="M 172.95,120.826 V 59.0859 h 108.129"
         style="fill:none;stroke:#bdbbbc;stroke-width:0.567;stroke-linecap:butt;stroke-linejoin:miter;stroke-miterlimit:2.613;stroke-dasharray:none;stroke-opacity:1"
         id="path3365" /><path
         d="m 172.95,125.228 1.697,-5.641 c -1.132,0.806 -2.263,0.806 -3.396,0 l 1.699,5.641"
         style="fill:#bdbbbc;fill-opacity:1;fill-rule:evenodd;stroke:none;stroke-width:0.1"
         id="path3367" /><path
         d="m 285.481,59.0859 -5.64,1.6981 c 0.804,-1.132 0.804,-2.2641 0,-3.3961 l 5.64,1.698"
         style="fill:#bdbbbc;fill-opacity:1;fill-rule:evenodd;stroke:none;stroke-width:0.1"
         id="path3369" /><path
         d="M 170.155,59.0469 H 126.94 m 43.215,39.9062 H 126.94 m 3.073,-36.4351 v 33.2199"
         style="fill:none;stroke:#231f20;stroke-width:0.283;stroke-linecap:butt;stroke-linejoin:miter;stroke-miterlimit:2.613;stroke-dasharray:none;stroke-opacity:1"
         id="path3371" /><path
         d="m 130.013,58.875 -1.242,4.123 c 0.827,-0.589 1.656,-0.589 2.482,0 l -1.24,-4.123"
         style="fill:#231f20;fill-opacity:1;fill-rule:evenodd;stroke:none;stroke-width:0.1"
         id="path3373" /><path
         d="m 130.013,99.3809 -1.242,-4.1227 c 0.827,0.5887 1.656,0.5887 2.482,0 l -1.24,4.1227"
         style="fill:#231f20;fill-opacity:1;fill-rule:evenodd;stroke:none;stroke-width:0.1"
         id="path3375" /><path
         d="M 170.155,87.382 H 147.723 M 154.57,62.518 V 83.9121"
         style="fill:none;stroke:#231f20;stroke-width:0.283;stroke-linecap:butt;stroke-linejoin:miter;stroke-miterlimit:2.613;stroke-dasharray:none;stroke-opacity:1"
         id="path3377" /><path
         d="m 154.57,58.875 -1.242,4.123 c 0.828,-0.589 1.655,-0.589 2.483,0 l -1.241,-4.123"
         style="fill:#231f20;fill-opacity:1;fill-rule:evenodd;stroke:none;stroke-width:0.1"
         id="path3379" /><path
         d="m 154.57,87.5551 -1.242,-4.1231 c 0.828,0.5891 1.655,0.5891 2.483,0 l -1.241,4.1231"
         style="fill:#231f20;fill-opacity:1;fill-rule:evenodd;stroke:none;stroke-width:0.1"
         id="path3381" /><path
         d="m 218.914,81.125 -45.926,17.8281 36.6,-21.016 m 0.129,-4.491 -36.729,13.9359 36.834,-20.5429"
         style="fill:none;stroke:#231f20;stroke-width:0.283;stroke-linecap:butt;stroke-linejoin:miter;stroke-miterlimit:2.613;stroke-dasharray:2.835, 0.85;stroke-dashoffset:0;stroke-opacity:1"
         id="path3383" /><path
         d="M 172.988,59.0469 133.847,19.9059"
         style="fill:none;stroke:#bdbbbc;stroke-width:0.567;stroke-linecap:butt;stroke-linejoin:miter;stroke-miterlimit:2.613;stroke-dasharray:none;stroke-opacity:1"
         id="path3385" /><path
         d="m 130.733,16.7941 5.191,2.7868 c -1.371,0.2312 -2.172,1.032 -2.403,2.4023 l -2.788,-5.1891"
         style="fill:#bdbbbc;fill-opacity:1;fill-rule:evenodd;stroke:none;stroke-width:0.1"
         id="path3387" /><path
         d="m 227.212,38.0871 -54.224,20.7238 45.61,-26.098"
         style="fill:none;stroke:#231f20;stroke-width:0.283;stroke-linecap:butt;stroke-linejoin:miter;stroke-miterlimit:2.613;stroke-dasharray:2.835, 0.85;stroke-dashoffset:0;stroke-opacity:1"
         id="path3389" /><path
         d="M 209.854,66.6301 V 37.357 m 8.845,23.8489 V 32.9051 m 8.489,33.8429 V 37.975"
         style="fill:none;stroke:#231f20;stroke-width:0.283;stroke-linecap:butt;stroke-linejoin:miter;stroke-miterlimit:2.613;stroke-dasharray:2.835, 1.417;stroke-dashoffset:0;stroke-opacity:1"
         id="path3391" /><path
         d="m 218.519,41.2531 c -6.171,-3.3242 -15.17,-6.2441 -24.59,-7.673 m 33.265,4.607 C 218.784,31.193 204.92,25.7531 189.522,23.5941 M 193.79,37 173.181,58.7301 190.227,27.5711"
         style="fill:none;stroke:#231f20;stroke-width:0.283;stroke-linecap:butt;stroke-linejoin:miter;stroke-miterlimit:2.613;stroke-dasharray:none;stroke-opacity:1"
         id="path3393" /><path
         d="m 196.298,34.357 -3.739,2.1379 c 1.005,0.1422 1.607,0.711 1.801,1.7082 l 1.938,-3.8461"
         style="fill:#231f20;fill-opacity:1;fill-rule:evenodd;stroke:none;stroke-width:0.1"
         id="path3395" /><path
         d="m 191.976,24.375 -0.889,4.2129 c -0.444,-0.9141 -1.169,-1.3109 -2.179,-1.1918 l 3.068,-3.0211"
         style="fill:#231f20;fill-opacity:1;fill-rule:evenodd;stroke:none;stroke-width:0.1"
         id="path3397" /><path
         d="m 181.025,51.277 c -2.345,-0.8 -5.184,-1.2731 -7.963,-1.2731 -2.653,0 -5.369,0.4359 -7.652,1.1652"
         style="fill:none;stroke:#231f20;stroke-width:0.283;stroke-linecap:butt;stroke-linejoin:miter;stroke-miterlimit:2.613;stroke-dasharray:none;stroke-opacity:1"
         id="path3399" /><path
         d="m 184.473,52.4539 -3.5,-2.507 c 0.29,0.9742 0.022,1.757 -0.803,2.35 l 4.303,0.157"
         style="fill:#231f20;fill-opacity:1;fill-rule:evenodd;stroke:none;stroke-width:0.1"
         id="path3401" /><path
         d="m 192.769,48.327 c -5.173,-2.7329 -12.44,-4.3372 -19.707,-4.3372 -4.512,0 -9.027,0.6532 -12.989,1.7231"
         style="fill:none;stroke:#231f20;stroke-width:0.283;stroke-linecap:butt;stroke-linejoin:miter;stroke-miterlimit:2.613;stroke-dasharray:none;stroke-opacity:1"
         id="path3403" /><path
         d="m 195.99,50.0289 -3.065,-3.023 c 0.133,1.0062 -0.252,1.7382 -1.16,2.1941 l 4.225,0.8289"
         style="fill:#231f20;fill-opacity:1;fill-rule:evenodd;stroke:none;stroke-width:0.1"
         id="path3405" /><path
         d="m 289.706,60.5859 c 0.088,-0.15 0.149,-0.2918 0.183,-0.423 0.035,-0.1309 0.068,-0.3899 0.102,-0.775 l 0.173,-1.9219 c 0.155,0.1871 0.382,0.484 0.68,0.891 0.141,0.1969 0.32,0.4668 0.53,0.8078 0.128,0.2082 0.205,0.3543 0.234,0.4372 0.016,0.0421 0.024,0.0851 0.024,0.1289 0,0.0281 -0.008,0.0531 -0.028,0.0711 -0.018,0.0179 -0.064,0.039 -0.142,0.064 -0.077,0.0238 -0.142,0.0711 -0.193,0.1371 -0.049,0.066 -0.076,0.1418 -0.076,0.2278 0,0.107 0.032,0.1929 0.096,0.2582 0.06,0.0648 0.14,0.0968 0.232,0.0968 0.116,0 0.212,-0.0461 0.294,-0.1429 0.081,-0.0942 0.121,-0.225 0.121,-0.3918 0,-0.2051 -0.071,-0.441 -0.211,-0.7051 -0.14,-0.2641 -0.412,-0.6691 -0.812,-1.216 -0.4,-0.5481 -0.888,-1.1442 -1.456,-1.7891 -0.394,-0.4449 -0.686,-0.7269 -0.876,-0.843 -0.19,-0.114 -0.353,-0.173 -0.488,-0.173 -0.08,0 -0.153,0.0309 -0.213,0.0922 -0.063,0.0609 -0.091,0.1316 -0.091,0.2129 0,0.1019 0.04,0.1937 0.127,0.2781 0.084,0.0816 0.176,0.1238 0.273,0.1238 0.052,0 0.096,-0.0109 0.13,-0.0351 0.022,-0.0129 0.044,-0.0508 0.069,-0.1117 0.025,-0.0602 0.047,-0.1012 0.069,-0.1231 0.012,-0.0129 0.027,-0.018 0.047,-0.018 0.013,0 0.042,0.0118 0.081,0.0379 0.143,0.0879 0.31,0.2301 0.5,0.4211 0.251,0.2578 0.434,0.4641 0.554,0.6258 l -0.218,2.4762 c -0.036,0.409 -0.092,0.659 -0.164,0.7461 -0.074,0.0886 -0.196,0.134 -0.368,0.134 -0.053,0 -0.153,-0.0082 -0.292,-0.0243 l -0.036,0.1442 1.145,0.2808"
         style="fill:#bdbbbc;fill-opacity:1;fill-rule:evenodd;stroke:none;stroke-width:0.1"
         id="path3407" /><path
         d="m 172.618,131.13 h 2.48 v -0.097 l -2.704,-2.813 h 1.144 c 0.271,0 0.443,0.01 0.517,0.033 0.073,0.02 0.14,0.064 0.202,0.131 0.06,0.068 0.129,0.19 0.204,0.369 h 0.144 l -0.34,-1.064 h -2.542 v 0.113 l 2.703,2.812 h -1.124 c -0.238,0 -0.382,-0.006 -0.432,-0.018 -0.071,-0.016 -0.145,-0.058 -0.215,-0.124 -0.073,-0.066 -0.145,-0.176 -0.222,-0.33 h -0.148 l 0.333,0.988"
         style="fill:#bdbbbc;fill-opacity:1;fill-rule:evenodd;stroke:none;stroke-width:0.1"
         id="path3409" /><path
         d="m 127.455,16.777 c 0.128,-0.1348 0.225,-0.2711 0.289,-0.4051 0.047,-0.0949 0.125,-0.3399 0.231,-0.7387 l 0.345,0.516 c 0.09,0.1238 0.2,0.2438 0.331,0.3567 0.13,0.114 0.244,0.191 0.343,0.232 0.062,0.0269 0.131,0.0391 0.208,0.0391 0.111,0 0.199,-0.029 0.267,-0.0891 0.066,-0.0598 0.099,-0.134 0.099,-0.2188 0,-0.0992 -0.019,-0.1671 -0.058,-0.2031 -0.074,-0.0648 -0.157,-0.0969 -0.249,-0.0969 -0.056,0 -0.114,0.011 -0.177,0.0348 -0.123,0.041 -0.205,0.0621 -0.247,0.0621 -0.063,0 -0.135,-0.0371 -0.221,-0.109 -0.163,-0.1359 -0.354,-0.3968 -0.579,-0.7851 l 0.32,-1.3438 c 0.051,-0.2062 0.092,-0.3293 0.126,-0.3691 0.033,-0.041 0.067,-0.061 0.101,-0.061 0.055,0 0.118,0.0301 0.19,0.0899 0.144,0.1203 0.266,0.2762 0.369,0.4691 l 0.136,-0.0711 c -0.163,-0.3078 -0.371,-0.5617 -0.625,-0.7648 -0.142,-0.1152 -0.265,-0.1719 -0.363,-0.1719 -0.146,0 -0.261,0.0817 -0.348,0.2449 -0.054,0.102 -0.168,0.5399 -0.34,1.3141 -0.405,-0.7062 -0.731,-1.1602 -0.976,-1.3641 -0.158,-0.13 -0.312,-0.1949 -0.462,-0.1949 -0.104,0 -0.197,0.0367 -0.285,0.1137 -0.06,0.057 -0.093,0.1332 -0.093,0.2301 0,0.0851 0.029,0.157 0.086,0.2152 0.057,0.0566 0.127,0.0859 0.211,0.0859 0.083,0 0.173,-0.041 0.265,-0.125 0.068,-0.0609 0.121,-0.091 0.156,-0.091 0.032,0 0.072,0.0219 0.122,0.0629 0.122,0.0988 0.289,0.3121 0.5,0.6399 0.21,0.3281 0.349,0.566 0.414,0.7121 -0.162,0.632 -0.249,0.9679 -0.261,1.0031 -0.06,0.1687 -0.139,0.2891 -0.236,0.3598 -0.095,0.0703 -0.237,0.105 -0.425,0.105 -0.06,0 -0.129,-0.0027 -0.207,-0.0078 v 0.141 l 1.043,0.1829"
         style="fill:#bdbbbc;fill-opacity:1;fill-rule:evenodd;stroke:none;stroke-width:0.1"
         id="path3411" /><g
         id="g4944"><path
           d="m 235.114,91.6582 -1.344,-4.6094 c -0.072,-0.2508 -0.109,-0.4148 -0.109,-0.4918 0,-0.0269 0.013,-0.0511 0.033,-0.075 0.024,-0.0211 0.045,-0.034 0.069,-0.034 0.035,0 0.075,0.0168 0.121,0.05 0.089,0.0629 0.238,0.2192 0.446,0.468 l 0.133,-0.0808 c -0.189,-0.2602 -0.377,-0.4723 -0.569,-0.6321 -0.192,-0.1633 -0.371,-0.2429 -0.537,-0.2429 -0.09,0 -0.162,0.0308 -0.218,0.0937 -0.057,0.0621 -0.087,0.15 -0.087,0.2652 0,0.1489 0.04,0.3481 0.118,0.5969 l 0.151,0.4852 c -0.378,-0.5832 -0.722,-0.9864 -1.03,-1.2102 -0.214,-0.1551 -0.419,-0.2308 -0.613,-0.2308 -0.199,0 -0.372,0.0878 -0.519,0.2628 -0.147,0.1758 -0.221,0.4149 -0.221,0.7168 0,0.3883 0.124,0.8043 0.372,1.2434 0.247,0.4398 0.574,0.7969 0.981,1.0727 0.319,0.2222 0.614,0.332 0.883,0.332 0.14,0 0.26,-0.0277 0.364,-0.0848 0.101,-0.0582 0.2,-0.1519 0.3,-0.2851 l 0.382,1.3601 c 0.029,0.0949 0.051,0.1707 0.071,0.2289 0.03,0.1051 0.047,0.1899 0.047,0.2578 0,0.0551 -0.021,0.1012 -0.06,0.1383 -0.055,0.0438 -0.125,0.0649 -0.211,0.0649 -0.059,0 -0.158,-0.009 -0.297,-0.027 v 0.1442 z m -1.448,-2.773 c 0,0.1668 -0.049,0.3007 -0.145,0.4019 -0.095,0.102 -0.218,0.1527 -0.368,0.1527 -0.328,0 -0.67,-0.2707 -1.025,-0.8117 -0.355,-0.5422 -0.533,-1.0601 -0.533,-1.5551 0,-0.1949 0.044,-0.3449 0.128,-0.448 0.087,-0.1031 0.191,-0.1551 0.31,-0.1551 0.271,0 0.61,0.2942 1.019,0.8801 0.41,0.5859 0.614,1.098 0.614,1.5352"
           style="fill:#231f20;fill-opacity:1;fill-rule:evenodd;stroke:none;stroke-width:0.1"
           id="path3413" /><path
           d="m 234.681,84.2801 h -0.703 l 1.083,3.639 c 0.195,0.652 0.46,1.1418 0.794,1.47 0.335,0.3281 0.737,0.4918 1.204,0.4918 0.459,0 0.826,-0.1411 1.1,-0.425 0.275,-0.2848 0.412,-0.6618 0.412,-1.1379 0,-0.302 -0.06,-0.6008 -0.184,-0.8981 -0.124,-0.2969 -0.297,-0.5629 -0.522,-0.7969 -0.198,-0.2109 -0.415,-0.3699 -0.65,-0.4781 -0.237,-0.1078 -0.484,-0.1629 -0.741,-0.1629 -0.197,0 -0.401,0.0262 -0.609,0.0762 -0.209,0.0508 -0.41,0.1258 -0.605,0.2219 z m 1.152,3.9531 -0.459,-1.5711 c 0.173,-0.15 0.34,-0.2601 0.499,-0.3269 0.158,-0.0692 0.325,-0.102 0.5,-0.102 0.419,0 0.774,0.241 1.066,0.7227 0.292,0.4812 0.439,1.0652 0.439,1.7492 0,0.2937 -0.071,0.525 -0.21,0.6918 -0.14,0.1672 -0.328,0.2492 -0.569,0.2492 -0.269,0 -0.515,-0.1211 -0.733,-0.3652 -0.217,-0.243 -0.394,-0.593 -0.533,-1.0477"
           style="fill:#231f20;fill-opacity:1;fill-rule:evenodd;stroke:none;stroke-width:0.1"
           id="path3415" /></g><g
         id="g5974"><path
           d="m 241.934,76.766 -1.343,-4.609 c -0.073,-0.2511 -0.11,-0.4148 -0.11,-0.4929 0,-0.0262 0.011,-0.05 0.033,-0.0743 0.024,-0.0226 0.045,-0.0347 0.069,-0.0347 0.034,0 0.074,0.0179 0.12,0.0508 0.091,0.0632 0.238,0.2191 0.446,0.4679 l 0.133,-0.0816 c -0.187,-0.259 -0.377,-0.4723 -0.567,-0.6332 -0.193,-0.161 -0.371,-0.241 -0.537,-0.241 -0.09,0 -0.163,0.0312 -0.219,0.0929 -0.058,0.0633 -0.087,0.1512 -0.087,0.2661 0,0.15 0.039,0.348 0.116,0.5968 l 0.153,0.4852 c -0.377,-0.584 -0.721,-0.986 -1.031,-1.211 -0.213,-0.1539 -0.419,-0.23 -0.612,-0.23 -0.198,0 -0.371,0.0879 -0.519,0.2621 -0.147,0.1758 -0.22,0.4148 -0.22,0.7179 0,0.3879 0.124,0.8032 0.372,1.243 0.247,0.4399 0.572,0.7969 0.979,1.0731 0.321,0.2211 0.615,0.332 0.883,0.332 0.142,0 0.262,-0.0281 0.364,-0.0859 0.102,-0.0571 0.201,-0.152 0.3,-0.2852 l 0.383,1.3602 c 0.028,0.0957 0.052,0.1718 0.07,0.2296 0.03,0.1051 0.047,0.1903 0.047,0.2582 0,0.0551 -0.02,0.1 -0.059,0.136 -0.054,0.0461 -0.125,0.0672 -0.21,0.0672 -0.061,0 -0.159,-0.0102 -0.297,-0.027 v 0.1449 z m -1.45,-2.773 c 0,0.166 -0.047,0.3011 -0.143,0.4019 -0.096,0.102 -0.218,0.152 -0.368,0.152 -0.328,0 -0.669,-0.2699 -1.026,-0.8117 -0.353,-0.5422 -0.532,-1.0602 -0.532,-1.5543 0,-0.1957 0.044,-0.345 0.129,-0.4477 0.087,-0.1031 0.189,-0.1551 0.309,-0.1551 0.271,0 0.611,0.293 1.019,0.8801 0.409,0.5859 0.612,1.0969 0.612,1.5348"
           style="fill:#231f20;fill-opacity:1;fill-rule:evenodd;stroke:none;stroke-width:0.1"
           id="path3417" /><path
           d="m 242.278,74.652 h 2.481 v -0.0969 l -2.703,-2.8129 h 1.143 c 0.272,0 0.443,0.0109 0.517,0.032 0.073,0.0207 0.139,0.0649 0.201,0.1317 0.061,0.0683 0.13,0.1902 0.206,0.3683 h 0.143 l -0.339,-1.0633 h -2.543 v 0.1141 l 2.703,2.8121 h -1.124 c -0.239,0 -0.382,-0.007 -0.432,-0.0191 -0.071,-0.016 -0.144,-0.0571 -0.216,-0.1239 -0.072,-0.066 -0.144,-0.1761 -0.22,-0.3293 h -0.149 l 0.332,0.9872"
           style="fill:#231f20;fill-opacity:1;fill-rule:evenodd;stroke:none;stroke-width:0.1"
           id="path3419" /></g><g
         id="g4981"
         transform="translate(-3,-1.5)"><path
           d="m 233.465,47.9531 h -0.702 l 1.082,3.6399 c 0.195,0.6519 0.46,1.1422 0.794,1.4699 0.335,0.3281 0.737,0.491 1.205,0.491 0.459,0 0.825,-0.141 1.099,-0.425 0.276,-0.284 0.412,-0.6617 0.412,-1.1367 0,-0.3031 -0.061,-0.6024 -0.184,-0.8992 -0.125,-0.2961 -0.298,-0.5621 -0.523,-0.7961 -0.198,-0.211 -0.414,-0.3699 -0.649,-0.4778 -0.236,-0.1082 -0.484,-0.1632 -0.74,-0.1632 -0.199,0 -0.403,0.025 -0.611,0.0761 -0.208,0.0512 -0.41,0.125 -0.604,0.2211 z m 1.151,3.9539 -0.46,-1.5711 c 0.175,-0.1507 0.341,-0.2597 0.5,-0.3277 0.159,-0.0684 0.326,-0.1012 0.5,-0.1012 0.419,0 0.775,0.241 1.067,0.7219 0.292,0.482 0.437,1.066 0.437,1.75 0,0.2941 -0.068,0.525 -0.209,0.6922 -0.139,0.166 -0.327,0.2488 -0.567,0.2488 -0.272,0 -0.517,-0.1211 -0.734,-0.3648 -0.218,-0.243 -0.394,-0.5942 -0.534,-1.0481"
           style="fill:#231f20;fill-opacity:1;fill-rule:evenodd;stroke:none;stroke-width:0.1"
           id="path3421" /><path
           d="m 245.139,49.9449 c 0.452,0.1301 0.84,0.4199 1.169,0.868 0.33,0.45 0.496,0.891 0.496,1.323 0,0.3172 -0.073,0.568 -0.215,0.752 -0.145,0.184 -0.363,0.3043 -0.657,0.3613 z m 0.382,3.3 c -0.208,-0.0211 -0.398,-0.0801 -0.576,-0.1758 -0.176,-0.0961 -0.342,-0.2332 -0.502,-0.4132 -0.214,-0.245 -0.383,-0.5239 -0.507,-0.8387 -0.125,-0.3133 -0.187,-0.6141 -0.187,-0.9043 0,-0.2809 0.065,-0.5039 0.196,-0.668 0.133,-0.164 0.331,-0.2719 0.602,-0.3238 z m -0.445,-3.5808 -0.41,-1.6559 h -0.671 l 0.488,1.6719 c -0.456,0.075 -0.811,0.2531 -1.066,0.5328 -0.254,0.2801 -0.383,0.634 -0.383,1.0601 0,0.5879 0.249,1.1059 0.748,1.5508 0.498,0.4453 1.108,0.6864 1.829,0.7223 l 0.457,1.5828 h 0.311 l -0.384,-1.598 c 0.487,-0.0469 0.871,-0.2028 1.153,-0.4668 0.283,-0.2641 0.424,-0.6 0.424,-1.0051 0,-0.566 -0.24,-1.084 -0.724,-1.5551 -0.484,-0.4719 -1.075,-0.7508 -1.772,-0.8398"
           style="fill:#231f20;fill-opacity:1;fill-rule:evenodd;stroke:none;stroke-width:0.1"
           id="path3423" /><path
           d="m 242.515,55.332 -1.343,-4.609 c -0.073,-0.2511 -0.11,-0.4148 -0.11,-0.4921 0,-0.027 0.011,-0.0508 0.034,-0.075 0.022,-0.0227 0.044,-0.0348 0.068,-0.0348 0.034,0 0.074,0.018 0.12,0.0508 0.091,0.0633 0.238,0.2191 0.446,0.4679 l 0.133,-0.0808 c -0.187,-0.2602 -0.377,-0.4719 -0.567,-0.634 -0.193,-0.1609 -0.371,-0.241 -0.537,-0.241 -0.09,0 -0.162,0.0308 -0.219,0.093 -0.058,0.0628 -0.088,0.1511 -0.088,0.2671 0,0.1481 0.04,0.3469 0.117,0.5957 l 0.154,0.4852 c -0.378,-0.584 -0.722,-0.9859 -1.032,-1.2102 -0.213,-0.1546 -0.419,-0.2308 -0.613,-0.2308 -0.197,0 -0.37,0.0879 -0.518,0.2629 -0.147,0.1761 -0.22,0.414 -0.22,0.7172 0,0.3879 0.124,0.8031 0.372,1.2429 0.247,0.4399 0.572,0.7969 0.979,1.0731 0.321,0.2211 0.615,0.332 0.883,0.332 0.142,0 0.262,-0.0281 0.364,-0.0859 0.102,-0.0571 0.201,-0.1512 0.3,-0.2852 l 0.382,1.3602 c 0.029,0.0957 0.053,0.1718 0.071,0.2297 0.031,0.105 0.047,0.1902 0.047,0.2582 0,0.055 -0.02,0.1 -0.058,0.1359 -0.055,0.0461 -0.125,0.0672 -0.211,0.0672 -0.061,0 -0.159,-0.009 -0.297,-0.0274 v 0.1442 z m -1.45,-2.773 c 0,0.166 -0.047,0.3012 -0.143,0.4019 -0.096,0.102 -0.219,0.152 -0.367,0.152 -0.329,0 -0.67,-0.2699 -1.027,-0.8117 -0.353,-0.5422 -0.533,-1.0602 -0.533,-1.5543 0,-0.1957 0.045,-0.3457 0.13,-0.4481 0.087,-0.1027 0.189,-0.1547 0.309,-0.1547 0.271,0 0.611,0.293 1.018,0.8801 0.41,0.5848 0.613,1.0969 0.613,1.5348"
           style="fill:#231f20;fill-opacity:1;fill-rule:evenodd;stroke:none;stroke-width:0.1"
           id="path3425" /></g><g
         id="g6015"
         style="fill:#ff0000"
         transform="translate(2.590283,29.972975)"><g
           id="g5974-8"
           transform="translate(22.734569,-52.208267)"
           style="fill:#ff0000"><path
             d="m 241.934,76.766 -1.343,-4.609 c -0.073,-0.2511 -0.11,-0.4148 -0.11,-0.4929 0,-0.0262 0.011,-0.05 0.033,-0.0743 0.024,-0.0226 0.045,-0.0347 0.069,-0.0347 0.034,0 0.074,0.0179 0.12,0.0508 0.091,0.0632 0.238,0.2191 0.446,0.4679 l 0.133,-0.0816 c -0.187,-0.259 -0.377,-0.4723 -0.567,-0.6332 -0.193,-0.161 -0.371,-0.241 -0.537,-0.241 -0.09,0 -0.163,0.0312 -0.219,0.0929 -0.058,0.0633 -0.087,0.1512 -0.087,0.2661 0,0.15 0.039,0.348 0.116,0.5968 l 0.153,0.4852 c -0.377,-0.584 -0.721,-0.986 -1.031,-1.211 -0.213,-0.1539 -0.419,-0.23 -0.612,-0.23 -0.198,0 -0.371,0.0879 -0.519,0.2621 -0.147,0.1758 -0.22,0.4148 -0.22,0.7179 0,0.3879 0.124,0.8032 0.372,1.243 0.247,0.4399 0.572,0.7969 0.979,1.0731 0.321,0.2211 0.615,0.332 0.883,0.332 0.142,0 0.262,-0.0281 0.364,-0.0859 0.102,-0.0571 0.201,-0.152 0.3,-0.2852 l 0.383,1.3602 c 0.028,0.0957 0.052,0.1718 0.07,0.2296 0.03,0.1051 0.047,0.1903 0.047,0.2582 0,0.0551 -0.02,0.1 -0.059,0.136 -0.054,0.0461 -0.125,0.0672 -0.21,0.0672 -0.061,0 -0.159,-0.0102 -0.297,-0.027 v 0.1449 z m -1.45,-2.773 c 0,0.166 -0.047,0.3011 -0.143,0.4019 -0.096,0.102 -0.218,0.152 -0.368,0.152 -0.328,0 -0.669,-0.2699 -1.026,-0.8117 -0.353,-0.5422 -0.532,-1.0602 -0.532,-1.5543 0,-0.1957 0.044,-0.345 0.129,-0.4477 0.087,-0.1031 0.189,-0.1551 0.309,-0.1551 0.271,0 0.611,0.293 1.019,0.8801 0.409,0.5859 0.612,1.0969 0.612,1.5348"
             style="fill:#ff0000;fill-opacity:1;fill-rule:evenodd;stroke:none;stroke-width:0.1"
             id="path3417-6" /><path
             d="m 242.278,74.652 h 2.481 v -0.0969 l -2.703,-2.8129 h 1.143 c 0.272,0 0.443,0.0109 0.517,0.032 0.073,0.0207 0.139,0.0649 0.201,0.1317 0.061,0.0683 0.13,0.1902 0.206,0.3683 h 0.143 l -0.339,-1.0633 h -2.543 v 0.1141 l 2.703,2.8121 h -1.124 c -0.239,0 -0.382,-0.007 -0.432,-0.0191 -0.071,-0.016 -0.144,-0.0571 -0.216,-0.1239 -0.072,-0.066 -0.144,-0.1761 -0.22,-0.3293 h -0.149 l 0.332,0.9872"
             style="fill:#ff0000;fill-opacity:1;fill-rule:evenodd;stroke:none;stroke-width:0.1"
             id="path3419-9" /></g><g
           id="g4981-6"
           transform="translate(11.994277,-31.105822)"
           style="fill:#ff0000"><path
             d="m 233.465,47.9531 h -0.702 l 1.082,3.6399 c 0.195,0.6519 0.46,1.1422 0.794,1.4699 0.335,0.3281 0.737,0.491 1.205,0.491 0.459,0 0.825,-0.141 1.099,-0.425 0.276,-0.284 0.412,-0.6617 0.412,-1.1367 0,-0.3031 -0.061,-0.6024 -0.184,-0.8992 -0.125,-0.2961 -0.298,-0.5621 -0.523,-0.7961 -0.198,-0.211 -0.414,-0.3699 -0.649,-0.4778 -0.236,-0.1082 -0.484,-0.1632 -0.74,-0.1632 -0.199,0 -0.403,0.025 -0.611,0.0761 -0.208,0.0512 -0.41,0.125 -0.604,0.2211 z m 1.151,3.9539 -0.46,-1.5711 c 0.175,-0.1507 0.341,-0.2597 0.5,-0.3277 0.159,-0.0684 0.326,-0.1012 0.5,-0.1012 0.419,0 0.775,0.241 1.067,0.7219 0.292,0.482 0.437,1.066 0.437,1.75 0,0.2941 -0.068,0.525 -0.209,0.6922 -0.139,0.166 -0.327,0.2488 -0.567,0.2488 -0.272,0 -0.517,-0.1211 -0.734,-0.3648 -0.218,-0.243 -0.394,-0.5942 -0.534,-1.0481"
             style="fill:#ff0000;fill-opacity:1;fill-rule:evenodd;stroke:none;stroke-width:0.1"
             id="path3421-7" /><path
             d="m 245.139,49.9449 c 0.452,0.1301 0.84,0.4199 1.169,0.868 0.33,0.45 0.496,0.891 0.496,1.323 0,0.3172 -0.073,0.568 -0.215,0.752 -0.145,0.184 -0.363,0.3043 -0.657,0.3613 z m 0.382,3.3 c -0.208,-0.0211 -0.398,-0.0801 -0.576,-0.1758 -0.176,-0.0961 -0.342,-0.2332 -0.502,-0.4132 -0.214,-0.245 -0.383,-0.5239 -0.507,-0.8387 -0.125,-0.3133 -0.187,-0.6141 -0.187,-0.9043 0,-0.2809 0.065,-0.5039 0.196,-0.668 0.133,-0.164 0.331,-0.2719 0.602,-0.3238 z m -0.445,-3.5808 -0.41,-1.6559 h -0.671 l 0.488,1.6719 c -0.456,0.075 -0.811,0.2531 -1.066,0.5328 -0.254,0.2801 -0.383,0.634 -0.383,1.0601 0,0.5879 0.249,1.1059 0.748,1.5508 0.498,0.4453 1.108,0.6864 1.829,0.7223 l 0.457,1.5828 h 0.311 l -0.384,-1.598 c 0.487,-0.0469 0.871,-0.2028 1.153,-0.4668 0.283,-0.2641 0.424,-0.6 0.424,-1.0051 0,-0.566 -0.24,-1.084 -0.724,-1.5551 -0.484,-0.4719 -1.075,-0.7508 -1.772,-0.8398"
             style="fill:#ff0000;fill-opacity:1;fill-rule:evenodd;stroke:none;stroke-width:0.1"
             id="path3423-4" /><path
             d="m 242.515,55.332 -1.343,-4.609 c -0.073,-0.2511 -0.11,-0.4148 -0.11,-0.4921 0,-0.027 0.011,-0.0508 0.034,-0.075 0.022,-0.0227 0.044,-0.0348 0.068,-0.0348 0.034,0 0.074,0.018 0.12,0.0508 0.091,0.0633 0.238,0.2191 0.446,0.4679 l 0.133,-0.0808 c -0.187,-0.2602 -0.377,-0.4719 -0.567,-0.634 -0.193,-0.1609 -0.371,-0.241 -0.537,-0.241 -0.09,0 -0.162,0.0308 -0.219,0.093 -0.058,0.0628 -0.088,0.1511 -0.088,0.2671 0,0.1481 0.04,0.3469 0.117,0.5957 l 0.154,0.4852 c -0.378,-0.584 -0.722,-0.9859 -1.032,-1.2102 -0.213,-0.1546 -0.419,-0.2308 -0.613,-0.2308 -0.197,0 -0.37,0.0879 -0.518,0.2629 -0.147,0.1761 -0.22,0.414 -0.22,0.7172 0,0.3879 0.124,0.8031 0.372,1.2429 0.247,0.4399 0.572,0.7969 0.979,1.0731 0.321,0.2211 0.615,0.332 0.883,0.332 0.142,0 0.262,-0.0281 0.364,-0.0859 0.102,-0.0571 0.201,-0.1512 0.3,-0.2852 l 0.382,1.3602 c 0.029,0.0957 0.053,0.1718 0.071,0.2297 0.031,0.105 0.047,0.1902 0.047,0.2582 0,0.055 -0.02,0.1 -0.058,0.1359 -0.055,0.0461 -0.125,0.0672 -0.211,0.0672 -0.061,0 -0.159,-0.009 -0.297,-0.0274 v 0.1442 z m -1.45,-2.773 c 0,0.166 -0.047,0.3012 -0.143,0.4019 -0.096,0.102 -0.219,0.152 -0.367,0.152 -0.329,0 -0.67,-0.2699 -1.027,-0.8117 -0.353,-0.5422 -0.533,-1.0602 -0.533,-1.5543 0,-0.1957 0.045,-0.3457 0.13,-0.4481 0.087,-0.1027 0.189,-0.1547 0.309,-0.1547 0.271,0 0.611,0.293 1.018,0.8801 0.41,0.5848 0.613,1.0969 0.613,1.5348"
             style="fill:#ff0000;fill-opacity:1;fill-rule:evenodd;stroke:none;stroke-width:0.1"
             id="path3425-6" /></g></g><g
         id="g5034"
         style="fill:#ff0000"
         transform="translate(3,-3)"><g
           id="g4944-6"
           transform="translate(-27.436024,22.557175)"
           style="fill:#ff0000"><path
             d="m 235.114,91.6582 -1.344,-4.6094 c -0.072,-0.2508 -0.109,-0.4148 -0.109,-0.4918 0,-0.0269 0.013,-0.0511 0.033,-0.075 0.024,-0.0211 0.045,-0.034 0.069,-0.034 0.035,0 0.075,0.0168 0.121,0.05 0.089,0.0629 0.238,0.2192 0.446,0.468 l 0.133,-0.0808 c -0.189,-0.2602 -0.377,-0.4723 -0.569,-0.6321 -0.192,-0.1633 -0.371,-0.2429 -0.537,-0.2429 -0.09,0 -0.162,0.0308 -0.218,0.0937 -0.057,0.0621 -0.087,0.15 -0.087,0.2652 0,0.1489 0.04,0.3481 0.118,0.5969 l 0.151,0.4852 c -0.378,-0.5832 -0.722,-0.9864 -1.03,-1.2102 -0.214,-0.1551 -0.419,-0.2308 -0.613,-0.2308 -0.199,0 -0.372,0.0878 -0.519,0.2628 -0.147,0.1758 -0.221,0.4149 -0.221,0.7168 0,0.3883 0.124,0.8043 0.372,1.2434 0.247,0.4398 0.574,0.7969 0.981,1.0727 0.319,0.2222 0.614,0.332 0.883,0.332 0.14,0 0.26,-0.0277 0.364,-0.0848 0.101,-0.0582 0.2,-0.1519 0.3,-0.2851 l 0.382,1.3601 c 0.029,0.0949 0.051,0.1707 0.071,0.2289 0.03,0.1051 0.047,0.1899 0.047,0.2578 0,0.0551 -0.021,0.1012 -0.06,0.1383 -0.055,0.0438 -0.125,0.0649 -0.211,0.0649 -0.059,0 -0.158,-0.009 -0.297,-0.027 v 0.1442 z m -1.448,-2.773 c 0,0.1668 -0.049,0.3007 -0.145,0.4019 -0.095,0.102 -0.218,0.1527 -0.368,0.1527 -0.328,0 -0.67,-0.2707 -1.025,-0.8117 -0.355,-0.5422 -0.533,-1.0601 -0.533,-1.5551 0,-0.1949 0.044,-0.3449 0.128,-0.448 0.087,-0.1031 0.191,-0.1551 0.31,-0.1551 0.271,0 0.61,0.2942 1.019,0.8801 0.41,0.5859 0.614,1.098 0.614,1.5352"
             style="fill:#ff0000;fill-opacity:1;fill-rule:evenodd;stroke:none;stroke-width:0.1"
             id="path3413-4" /><path
             d="m 234.681,84.2801 h -0.703 l 1.083,3.639 c 0.195,0.652 0.46,1.1418 0.794,1.47 0.335,0.3281 0.737,0.4918 1.204,0.4918 0.459,0 0.826,-0.1411 1.1,-0.425 0.275,-0.2848 0.412,-0.6618 0.412,-1.1379 0,-0.302 -0.06,-0.6008 -0.184,-0.8981 -0.124,-0.2969 -0.297,-0.5629 -0.522,-0.7969 -0.198,-0.2109 -0.415,-0.3699 -0.65,-0.4781 -0.237,-0.1078 -0.484,-0.1629 -0.741,-0.1629 -0.197,0 -0.401,0.0262 -0.609,0.0762 -0.209,0.0508 -0.41,0.1258 -0.605,0.2219 z m 1.152,3.9531 -0.459,-1.5711 c 0.173,-0.15 0.34,-0.2601 0.499,-0.3269 0.158,-0.0692 0.325,-0.102 0.5,-0.102 0.419,0 0.774,0.241 1.066,0.7227 0.292,0.4812 0.439,1.0652 0.439,1.7492 0,0.2937 -0.071,0.525 -0.21,0.6918 -0.14,0.1672 -0.328,0.2492 -0.569,0.2492 -0.269,0 -0.515,-0.1211 -0.733,-0.3652 -0.217,-0.243 -0.394,-0.593 -0.533,-1.0477"
             style="fill:#ff0000;fill-opacity:1;fill-rule:evenodd;stroke:none;stroke-width:0.1"
             id="path3415-9" /></g><path
           d="m 197.48438,107.1167 h -0.702 l 1.082,3.6399 c 0.195,0.6519 0.46,1.1422 0.794,1.4699 0.335,0.3281 0.737,0.491 1.205,0.491 0.459,0 0.825,-0.141 1.099,-0.425 0.276,-0.284 0.412,-0.6617 0.412,-1.1367 0,-0.3031 -0.061,-0.6024 -0.184,-0.8992 -0.125,-0.2961 -0.298,-0.5621 -0.523,-0.7961 -0.198,-0.211 -0.414,-0.3699 -0.649,-0.4778 -0.236,-0.1082 -0.484,-0.1632 -0.74,-0.1632 -0.199,0 -0.403,0.025 -0.611,0.0761 -0.208,0.0512 -0.41,0.125 -0.604,0.2211 z m 1.151,3.9539 -0.46,-1.5711 c 0.175,-0.1507 0.341,-0.2597 0.5,-0.3277 0.159,-0.0684 0.326,-0.1012 0.5,-0.1012 0.419,0 0.775,0.241 1.067,0.7219 0.292,0.482 0.437,1.066 0.437,1.75 0,0.2941 -0.068,0.525 -0.209,0.6922 -0.139,0.166 -0.327,0.2488 -0.567,0.2488 -0.272,0 -0.517,-0.1211 -0.734,-0.3648 -0.218,-0.243 -0.394,-0.5942 -0.534,-1.0481"
           style="fill:#ff0000;fill-opacity:1;fill-rule:evenodd;stroke:none;stroke-width:0.1"
           id="path3421-2" /><g
           id="g5025"
           transform="translate(-4.5,-0.01274715)"
           style="fill:#ff0000"><path
             d="m 224.15838,108.69315 c 0.452,0.1301 0.84,0.4199 1.169,0.868 0.33,0.45 0.496,0.891 0.496,1.323 0,0.3172 -0.073,0.568 -0.215,0.752 -0.145,0.184 -0.363,0.3043 -0.657,0.3613 z m 0.382,3.3 c -0.208,-0.0211 -0.398,-0.0801 -0.576,-0.1758 -0.176,-0.0961 -0.342,-0.2332 -0.502,-0.4132 -0.214,-0.245 -0.383,-0.5239 -0.507,-0.8387 -0.125,-0.3133 -0.187,-0.6141 -0.187,-0.9043 0,-0.2809 0.065,-0.5039 0.196,-0.668 0.133,-0.164 0.331,-0.2719 0.602,-0.3238 z m -0.445,-3.5808 -0.41,-1.6559 h -0.671 l 0.488,1.6719 c -0.456,0.075 -0.811,0.2531 -1.066,0.5328 -0.254,0.2801 -0.383,0.634 -0.383,1.0601 0,0.5879 0.249,1.1059 0.748,1.5508 0.498,0.4453 1.108,0.6864 1.829,0.7223 l 0.457,1.5828 h 0.311 l -0.384,-1.598 c 0.487,-0.0469 0.871,-0.2028 1.153,-0.4668 0.283,-0.2641 0.424,-0.6 0.424,-1.0051 0,-0.566 -0.24,-1.084 -0.724,-1.5551 -0.484,-0.4719 -1.075,-0.7508 -1.772,-0.8398"
             style="fill:#ff0000;fill-opacity:1;fill-rule:evenodd;stroke:none;stroke-width:0.1"
             id="path3423-3" /><path
             d="m 221.53438,114.08025 -1.343,-4.609 c -0.073,-0.2511 -0.11,-0.4148 -0.11,-0.4921 0,-0.027 0.011,-0.0508 0.034,-0.075 0.022,-0.0227 0.044,-0.0348 0.068,-0.0348 0.034,0 0.074,0.018 0.12,0.0508 0.091,0.0633 0.238,0.2191 0.446,0.4679 l 0.133,-0.0808 c -0.187,-0.2602 -0.377,-0.4719 -0.567,-0.634 -0.193,-0.1609 -0.371,-0.241 -0.537,-0.241 -0.09,0 -0.162,0.0308 -0.219,0.093 -0.058,0.0628 -0.088,0.1511 -0.088,0.2671 0,0.1481 0.04,0.3469 0.117,0.5957 l 0.154,0.4852 c -0.378,-0.584 -0.722,-0.9859 -1.032,-1.2102 -0.213,-0.1546 -0.419,-0.2308 -0.613,-0.2308 -0.197,0 -0.37,0.0879 -0.518,0.2629 -0.147,0.1761 -0.22,0.414 -0.22,0.7172 0,0.3879 0.124,0.8031 0.372,1.2429 0.247,0.4399 0.572,0.7969 0.979,1.0731 0.321,0.2211 0.615,0.332 0.883,0.332 0.142,0 0.262,-0.0281 0.364,-0.0859 0.102,-0.0571 0.201,-0.1512 0.3,-0.2852 l 0.382,1.3602 c 0.029,0.0957 0.053,0.1718 0.071,0.2297 0.031,0.105 0.047,0.1902 0.047,0.2582 0,0.055 -0.02,0.1 -0.058,0.1359 -0.055,0.0461 -0.125,0.0672 -0.211,0.0672 -0.061,0 -0.159,-0.009 -0.297,-0.0274 v 0.1442 z m -1.45,-2.773 c 0,0.166 -0.047,0.3012 -0.143,0.4019 -0.096,0.102 -0.219,0.152 -0.367,0.152 -0.329,0 -0.67,-0.2699 -1.027,-0.8117 -0.353,-0.5422 -0.533,-1.0602 -0.533,-1.5543 0,-0.1957 0.045,-0.3457 0.13,-0.4481 0.087,-0.1027 0.189,-0.1547 0.309,-0.1547 0.271,0 0.611,0.293 1.018,0.8801 0.41,0.5848 0.613,1.0969 0.613,1.5348"
             style="fill:#ff0000;fill-opacity:1;fill-rule:evenodd;stroke:none;stroke-width:0.1"
             id="path3425-0" /></g></g><g
         id="g6570"
         transform="translate(-20.70788,51.001891)"><g
           id="g5974-8-5"
           transform="translate(-24.23943,-57.221969)"
           style="fill:#ff0000"><path
             d="m 241.934,76.766 -1.343,-4.609 c -0.073,-0.2511 -0.11,-0.4148 -0.11,-0.4929 0,-0.0262 0.011,-0.05 0.033,-0.0743 0.024,-0.0226 0.045,-0.0347 0.069,-0.0347 0.034,0 0.074,0.0179 0.12,0.0508 0.091,0.0632 0.238,0.2191 0.446,0.4679 l 0.133,-0.0816 c -0.187,-0.259 -0.377,-0.4723 -0.567,-0.6332 -0.193,-0.161 -0.371,-0.241 -0.537,-0.241 -0.09,0 -0.163,0.0312 -0.219,0.0929 -0.058,0.0633 -0.087,0.1512 -0.087,0.2661 0,0.15 0.039,0.348 0.116,0.5968 l 0.153,0.4852 c -0.377,-0.584 -0.721,-0.986 -1.031,-1.211 -0.213,-0.1539 -0.419,-0.23 -0.612,-0.23 -0.198,0 -0.371,0.0879 -0.519,0.2621 -0.147,0.1758 -0.22,0.4148 -0.22,0.7179 0,0.3879 0.124,0.8032 0.372,1.243 0.247,0.4399 0.572,0.7969 0.979,1.0731 0.321,0.2211 0.615,0.332 0.883,0.332 0.142,0 0.262,-0.0281 0.364,-0.0859 0.102,-0.0571 0.201,-0.152 0.3,-0.2852 l 0.383,1.3602 c 0.028,0.0957 0.052,0.1718 0.07,0.2296 0.03,0.1051 0.047,0.1903 0.047,0.2582 0,0.0551 -0.02,0.1 -0.059,0.136 -0.054,0.0461 -0.125,0.0672 -0.21,0.0672 -0.061,0 -0.159,-0.0102 -0.297,-0.027 v 0.1449 z m -1.45,-2.773 c 0,0.166 -0.047,0.3011 -0.143,0.4019 -0.096,0.102 -0.218,0.152 -0.368,0.152 -0.328,0 -0.669,-0.2699 -1.026,-0.8117 -0.353,-0.5422 -0.532,-1.0602 -0.532,-1.5543 0,-0.1957 0.044,-0.345 0.129,-0.4477 0.087,-0.1031 0.189,-0.1551 0.309,-0.1551 0.271,0 0.611,0.293 1.019,0.8801 0.409,0.5859 0.612,1.0969 0.612,1.5348"
             style="fill:#ff0000;fill-opacity:1;fill-rule:evenodd;stroke:none;stroke-width:0.1"
             id="path3417-6-4" /><path
             d="m 242.278,74.652 h 2.481 v -0.0969 l -2.703,-2.8129 h 1.143 c 0.272,0 0.443,0.0109 0.517,0.032 0.073,0.0207 0.139,0.0649 0.201,0.1317 0.061,0.0683 0.13,0.1902 0.206,0.3683 h 0.143 l -0.339,-1.0633 h -2.543 v 0.1141 l 2.703,2.8121 h -1.124 c -0.239,0 -0.382,-0.007 -0.432,-0.0191 -0.071,-0.016 -0.144,-0.0571 -0.216,-0.1239 -0.072,-0.066 -0.144,-0.1761 -0.22,-0.3293 h -0.149 l 0.332,0.9872"
             style="fill:#ff0000;fill-opacity:1;fill-rule:evenodd;stroke:none;stroke-width:0.1"
             id="path3419-9-2" /></g><g
           id="g4944-6-1"
           transform="translate(-26.625734,-71.945608)"
           style="fill:#ff0000"><path
             d="m 235.114,91.6582 -1.344,-4.6094 c -0.072,-0.2508 -0.109,-0.4148 -0.109,-0.4918 0,-0.0269 0.013,-0.0511 0.033,-0.075 0.024,-0.0211 0.045,-0.034 0.069,-0.034 0.035,0 0.075,0.0168 0.121,0.05 0.089,0.0629 0.238,0.2192 0.446,0.468 l 0.133,-0.0808 c -0.189,-0.2602 -0.377,-0.4723 -0.569,-0.6321 -0.192,-0.1633 -0.371,-0.2429 -0.537,-0.2429 -0.09,0 -0.162,0.0308 -0.218,0.0937 -0.057,0.0621 -0.087,0.15 -0.087,0.2652 0,0.1489 0.04,0.3481 0.118,0.5969 l 0.151,0.4852 c -0.378,-0.5832 -0.722,-0.9864 -1.03,-1.2102 -0.214,-0.1551 -0.419,-0.2308 -0.613,-0.2308 -0.199,0 -0.372,0.0878 -0.519,0.2628 -0.147,0.1758 -0.221,0.4149 -0.221,0.7168 0,0.3883 0.124,0.8043 0.372,1.2434 0.247,0.4398 0.574,0.7969 0.981,1.0727 0.319,0.2222 0.614,0.332 0.883,0.332 0.14,0 0.26,-0.0277 0.364,-0.0848 0.101,-0.0582 0.2,-0.1519 0.3,-0.2851 l 0.382,1.3601 c 0.029,0.0949 0.051,0.1707 0.071,0.2289 0.03,0.1051 0.047,0.1899 0.047,0.2578 0,0.0551 -0.021,0.1012 -0.06,0.1383 -0.055,0.0438 -0.125,0.0649 -0.211,0.0649 -0.059,0 -0.158,-0.009 -0.297,-0.027 v 0.1442 z m -1.448,-2.773 c 0,0.1668 -0.049,0.3007 -0.145,0.4019 -0.095,0.102 -0.218,0.1527 -0.368,0.1527 -0.328,0 -0.67,-0.2707 -1.025,-0.8117 -0.355,-0.5422 -0.533,-1.0601 -0.533,-1.5551 0,-0.1949 0.044,-0.3449 0.128,-0.448 0.087,-0.1031 0.191,-0.1551 0.31,-0.1551 0.271,0 0.61,0.2942 1.019,0.8801 0.41,0.5859 0.614,1.098 0.614,1.5352"
             style="fill:#ff0000;fill-opacity:1;fill-rule:evenodd;stroke:none;stroke-width:0.1"
             id="path3413-4-1" /><path
             d="m 234.681,84.2801 h -0.703 l 1.083,3.639 c 0.195,0.652 0.46,1.1418 0.794,1.47 0.335,0.3281 0.737,0.4918 1.204,0.4918 0.459,0 0.826,-0.1411 1.1,-0.425 0.275,-0.2848 0.412,-0.6618 0.412,-1.1379 0,-0.302 -0.06,-0.6008 -0.184,-0.8981 -0.124,-0.2969 -0.297,-0.5629 -0.522,-0.7969 -0.198,-0.2109 -0.415,-0.3699 -0.65,-0.4781 -0.237,-0.1078 -0.484,-0.1629 -0.741,-0.1629 -0.197,0 -0.401,0.0262 -0.609,0.0762 -0.209,0.0508 -0.41,0.1258 -0.605,0.2219 z m 1.152,3.9531 -0.459,-1.5711 c 0.173,-0.15 0.34,-0.2601 0.499,-0.3269 0.158,-0.0692 0.325,-0.102 0.5,-0.102 0.419,0 0.774,0.241 1.066,0.7227 0.292,0.4812 0.439,1.0652 0.439,1.7492 0,0.2937 -0.071,0.525 -0.21,0.6918 -0.14,0.1672 -0.328,0.2492 -0.569,0.2492 -0.269,0 -0.515,-0.1211 -0.733,-0.3652 -0.217,-0.243 -0.394,-0.593 -0.533,-1.0477"
             style="fill:#ff0000;fill-opacity:1;fill-rule:evenodd;stroke:none;stroke-width:0.1"
             id="path3415-9-0" /></g></g><path
         d="m 187.64,36.67888 h 4.87109 v 7.5 H 187.64 Z"
         style="fill:#f3f3f3;fill-opacity:1;fill-rule:evenodd;stroke:none;stroke-width:0.146803"
         id="path3443" /><path
         d="m 168.294,46.53006 h 5.8457 v 7.5 h -5.8457 z"
         style="fill:#f3f3f3;fill-opacity:1;fill-rule:evenodd;stroke:none;stroke-width:0.221341"
         id="path3449" /><path
         d="m 229.533,85.05 -3.935,-2.9988"
         style="fill:none;stroke:#231f20;stroke-width:0.75;stroke-linecap:butt;stroke-linejoin:miter;stroke-miterlimit:2.613;stroke-dasharray:none;stroke-opacity:1"
         id="path3465" /><path
         d="m 222.7,79.8441 4.032,1.511 c -0.969,0.3008 -1.47,0.9597 -1.504,1.975 l -2.528,-3.486"
         style="fill:#231f20;fill-opacity:1;fill-rule:evenodd;stroke:none;stroke-width:0.1"
         id="path3467" /><path
         d="M 236.353,73.2988 230.14,73.077"
         style="fill:none;stroke:#231f20;stroke-width:0.75;stroke-linecap:butt;stroke-linejoin:miter;stroke-miterlimit:2.613;stroke-dasharray:none;stroke-opacity:1"
         id="path3469" /><path
         d="m 226.5,72.9469 4.165,-1.093 c -0.618,0.8063 -0.649,1.6332 -0.09,2.4813 L 226.5,72.9469"
         style="fill:#231f20;fill-opacity:1;fill-rule:evenodd;stroke:none;stroke-width:0.1"
         id="path3471" /><path
         d="M 233.152,53.6738 224.955,61.75"
         style="fill:none;stroke:#231f20;stroke-width:0.75;stroke-linecap:butt;stroke-linejoin:miter;stroke-miterlimit:2.613;stroke-dasharray:none;stroke-opacity:1"
         id="path3473" /><path
         d="m 222.358,64.307 2.068,-3.7781 c 0.161,1.0031 0.741,1.593 1.742,1.7691 l -3.81,2.009"
         style="fill:#231f20;fill-opacity:1;fill-rule:evenodd;stroke:none;stroke-width:0.1"
         id="path3475" /><path
         d="M 168.42,5.11602 V 4.97188 c -0.394,0.19726 -0.721,0.43007 -0.984,0.69531 -0.375,0.37695 -0.664,0.82187 -0.866,1.33594 -0.204,0.51289 -0.306,1.04492 -0.306,1.59687 0,0.8082 0.201,1.5441 0.598,2.209 0.399,0.666 0.919,1.1422 1.558,1.4281 V 12.073 c -0.32,-0.1769 -0.583,-0.4179 -0.79,-0.7261 -0.204,-0.3071 -0.358,-0.6957 -0.46,-1.168 -0.1,-0.4707 -0.152,-0.96406 -0.152,-1.47577 0,-0.55821 0.043,-1.06407 0.128,-1.51993 0.069,-0.36015 0.152,-0.64804 0.247,-0.86601 0.097,-0.21719 0.226,-0.42617 0.389,-0.62617 0.163,-0.20196 0.376,-0.39219 0.638,-0.575"
         style="fill:#231f20;fill-opacity:1;fill-rule:evenodd;stroke:none;stroke-width:0.1"
         id="path3477" /><path
         d="m 172.33,12.073 v 0.1641 c 0.396,-0.193 0.726,-0.425 0.988,-0.6922 0.372,-0.3801 0.66,-0.825 0.863,-1.3367 0.205,-0.51211 0.306,-1.04531 0.306,-1.6 0,-0.80703 -0.2,-1.54336 -0.597,-2.2082 -0.396,-0.66484 -0.917,-1.14102 -1.56,-1.42812 v 0.14414 c 0.32,0.18007 0.584,0.42304 0.791,0.7289 0.206,0.30625 0.361,0.69492 0.461,1.16914 0.1,0.47188 0.151,0.96485 0.151,1.47696 0,0.5539 -0.044,1.06093 -0.13,1.51988 -0.065,0.3602 -0.146,0.6461 -0.244,0.8641 -0.097,0.216 -0.226,0.4238 -0.388,0.6242 -0.162,0.2008 -0.375,0.3918 -0.641,0.5738"
         style="fill:#231f20;fill-opacity:1;fill-rule:evenodd;stroke:none;stroke-width:0.1"
         id="path3479" /><path
         d="m 171.689,7.53516 c -0.271,-0.325 -0.544,-0.56602 -0.82,-0.71797 -0.275,-0.15117 -0.567,-0.22735 -0.875,-0.22735 -0.369,0 -0.659,0.1043 -0.865,0.31133 -0.206,0.20781 -0.311,0.48789 -0.311,0.84102 0,0.39765 0.113,0.78984 0.336,1.175 0.222,0.38594 0.521,0.69883 0.897,0.93867 0.378,0.24104 0.745,0.36134 1.108,0.36134 0.283,0 0.496,-0.0582 0.635,-0.1774 0.142,-0.11871 0.213,-0.26363 0.213,-0.43589 0,-0.16094 -0.05,-0.29883 -0.15,-0.41289 -0.072,-0.08985 -0.162,-0.13399 -0.269,-0.13399 -0.079,0 -0.148,0.02813 -0.201,0.07891 -0.054,0.05195 -0.081,0.11719 -0.081,0.19492 0,0.04922 0.011,0.09609 0.03,0.13711 0.019,0.04101 0.06,0.09219 0.121,0.15117 0.061,0.05781 0.099,0.1 0.113,0.12578 0.011,0.02617 0.018,0.05391 0.018,0.08203 0,0.05391 -0.025,0.10118 -0.074,0.13711 -0.076,0.05194 -0.182,0.08004 -0.321,0.08004 -0.255,0 -0.508,-0.09215 -0.757,-0.27222 -0.251,-0.17891 -0.463,-0.43477 -0.642,-0.76485 -0.213,-0.40195 -0.32,-0.80117 -0.32,-1.20312 0,-0.26485 0.077,-0.47578 0.228,-0.63086 0.15,-0.15508 0.356,-0.23321 0.616,-0.23321 0.2,0 0.4,0.05118 0.596,0.15118 0.196,0.1 0.418,0.28203 0.663,0.54492 l 0.112,-0.10078"
         style="fill:#231f20;fill-opacity:1;fill-rule:evenodd;stroke:none;stroke-width:0.1"
         id="path3481" /><g
         id="g3483"
         transform="scale(0.1)"><g
           id="g3485"
           clip-path="url(#clipPath3489)"><g
             id="g3491"
             clip-path="url(#clipPath3495)"><path
               d="m 2182,730 v 1 h -2 v 1 h -2 v 1 h -2 v 1 h -2 v 1 h -1 v 1 h -2 v 1 h -2 v 1 h -2 v 1 h -2 v 1 h -2 v 1 h -1 v 1 h -2 v 1 h -2 v 1 h -2 v 1 h -2 v 1 h -2 v 1 h -2 v 1 h -1 v 1 h -2 v 1 h -2 v 1 h -2 v 1 h -2 v 1 h -2 v 1 h -1 v 1 h -2 v 1 h -2 v 1 h -2 v 1 h -2 v 1 h -2 v 1 h -2 v 1 h -1 v 1 h -2 v 1 h -2 v 1 h -2 v 1 h -2 v 1 h -2 v 1 h -2 v 1 h -1 v 1 h -2 v 1 h -2 v 1 h -2 v 1 h -2 v 1 h -2 v 1 h -1 v 1 h -2 v 1 h -2 v 1 h -1 v 2 h 3 v 1 h 2 v 1 h 3 v 1 h 2 v 1 h 3 v 1 h 2 v 1 h 2 v 1 h 3 v 1 h 2 v 1 h 3 v 1 h 2 v 1 h 3 v 1 h 2 v 1 h 3 v 1 h 2 v 1 h 3 v 1 h 2 v 1 h 3 v 1 h 2 v 1 h 2 v 1 h 3 v 1 h 2 v 1 h 3 v 1 h 2 v 1 h 3 v 1 h 2 v 1 h 3 v 1 h 2 v 1 h 3 v 1 h 2 v 1 h 2 v 1 h 3 v 1 h 2 v 1 h 3 v 1 h 2 v 1 h 3 v 1 h 3 v -1 h 2 v -1 h 2 v -1 h 3 v -1 h 2 v -1 h 2 v -1 h 2 v -1 h 2 v -1 h 3 v -1 h 2 v -1 h 2 v -1 h 2 v -1 h 2 v -1 h 2 v -1 h 3 v -1 h 2 v -1 h 2 v -1 h 2 v -1 h 2 v -1 h 2 v -1 h 3 v -1 h 2 v -1 h 2 v -1 h 2 v -1 h 2 v -1 h 2 v -1 h 3 v -1 h 2 v -1 h 2 v -1 h 2 v -1 h 2 v -1 h 3 v -1 h 2 v -1 h 2 v -1 h 2 v -1 h 2 v -1 h 2 v -1 h 3 v -1 h 2 v -2 h -1 v -1 h -2 v -1 h -2 v -1 h -2 v -1 h -1 v -1 h -2 v -1 h -2 v -1 h -2 v -1 h -2 v -1 h -2 v -1 h -2 v -1 h -2 v -1 h -2 v -1 h -2 v -1 h -1 v -1 h -2 v -1 h -2 v -1 h -2 v -1 h -2 v -1 h -2 v -1 h -2 v -1 h -2 v -1 h -2 v -1 h -2 v -1 h -1 v -1 h -2 v -1 h -2 v -1 h -2 v -1 h -2 v -1 h -2 v -1 h -2 v -1 h -2 v -1 h -2 v -1 h -2 v -1 h -2 v -1 h -1 v -1 h -2 v -1 h -2 v -1 h -2 v -1 h -2 v -1 h -2 v -1 h -2 v -1 h -2 v -1 h -2 v -1 h -2 v -1"
               style="fill:url(#linearGradient3501);fill-opacity:1;fill-rule:nonzero;stroke:none"
               id="path3503" /></g></g></g><g
         id="g3505"
         transform="scale(0.1)"><g
           id="g3507"
           clip-path="url(#clipPath3511)"><g
             id="g3513"
             clip-path="url(#clipPath3517)"><path
               d="m 2184,621 v 114 h 2 v 1 h 2 v 1 h 2 v 1 h 2 v 1 h 2 v 1 h 2 v 1 h 2 v 1 h 2 v 1 h 2 v 1 h 2 v 1 h 3 v 1 h 2 v 1 h 2 v 1 h 2 v 1 h 2 v 1 h 2 v 1 h 2 v 1 h 2 v 1 h 2 v 1 h 2 v 1 h 2 v 1 h 2 v 1 h 2 v 1 h 2 v 1 h 2 v 1 h 2 v 1 h 2 v 1 h 2 v 1 h 3 v 1 h 2 v 1 h 2 v 1 h 2 v 1 h 2 v 1 h 2 v 1 h 2 v 1 h 2 v 1 h 2 v 1 h 2 v 1 h 2 v 1 h 2 v 1 h 2 v 1 h 2 v 1 h 2 V 667 h -1 v -1 h -2 v -1 h -2 v -1 h -2 v -1 h -2 v -1 h -2 v -1 h -2 v -1 h -2 v -1 h -2 v -1 h -2 v -1 h -1 v -1 h -2 v -1 h -2 v -1 h -2 v -1 h -2 v -1 h -2 v -1 h -2 v -1 h -2 v -1 h -2 v -1 h -1 v -1 h -2 v -1 h -2 v -1 h -2 v -1 h -2 v -1 h -2 v -1 h -2 v -1 h -2 v -1 h -2 v -1 h -2 v -1 h -1 v -1 h -2 v -1 h -2 v -1 h -2 v -1 h -2 v -1 h -2 v -1 h -2 v -1 h -2 v -1 h -2 v -1 h -2 v -1 h -1 v -1 h -2 v -1 h -2 v -1 h -2 v -1 h -2 v -1 h -2 v -1 h -2 v -1"
               style="fill:url(#linearGradient3523);fill-opacity:1;fill-rule:nonzero;stroke:none"
               id="path3525" /></g></g></g><g
         id="g3527"
         transform="scale(0.1)"><g
           id="g3529"
           clip-path="url(#clipPath3533)"><g
             id="g3535"
             clip-path="url(#clipPath3539)"><path
               d="m 2183,621 v 1 h -2 v 1 h -2 v 1 h -2 v 1 h -1 v 1 h -2 v 1 h -2 v 1 h -2 v 1 h -2 v 1 h -2 v 1 h -2 v 1 h -2 v 1 h -2 v 1 h -2 v 1 h -1 v 1 h -2 v 1 h -2 v 1 h -2 v 1 h -2 v 1 h -2 v 1 h -2 v 1 h -2 v 1 h -2 v 1 h -2 v 1 h -1 v 1 h -2 v 1 h -2 v 1 h -2 v 1 h -2 v 1 h -2 v 1 h -2 v 1 h -2 v 1 h -2 v 1 h -1 v 1 h -2 v 1 h -2 v 1 h -2 v 1 h -2 v 1 h -2 v 1 h -2 v 1 h -2 v 1 h -2 v 1 h -2 v 1 h -1 v 1 h -2 v 1 h -2 v 1 h -2 v 111 h 2 v -1 h 2 v -1 h 2 v -1 h 2 v -1 h 2 v -1 h 2 v -1 h 2 v -1 h 2 v -1 h 2 v -1 h 3 v -1 h 2 v -1 h 2 v -1 h 2 v -1 h 2 v -1 h 2 v -1 h 2 v -1 h 2 v -1 h 2 v -1 h 2 v -1 h 2 v -1 h 2 v -1 h 2 v -1 h 2 v -1 h 2 v -1 h 2 v -1 h 2 v -1 h 2 v -1 h 3 v -1 h 2 v -1 h 2 v -1 h 2 v -1 h 2 v -1 h 2 v -1 h 2 v -1 h 2 v -1 h 2 v -1 h 2 v -1 h 2 v -1 h 2 v -1 h 2 v -1 h 2 v -1 h 2 v -1 h 2 v -1 h 1 V 621"
               style="fill:url(#linearGradient3545);fill-opacity:1;fill-rule:nonzero;stroke:none"
               id="path3547" /></g></g></g><path
         style="fill:none;stroke:#ff0000;stroke-width:0.75px;stroke-linecap:butt;stroke-linejoin:miter;stroke-opacity:1;marker-start:url(#Arrow2Mstart9368)"
         d="m 218.6,77.799997 -4.61562,25.151443"
         id="path4305" /><path
         style="fill:none;stroke:#ff0000;stroke-width:0.75px;stroke-linecap:butt;stroke-linejoin:miter;stroke-opacity:1;marker-start:url(#marker59238312)"
         d="m 222,69.946897 c 0,0 20.20787,2.431972 30.20671,-6.657885 9.99884,-9.089859 9.39285,-9.089859 9.39285,-9.089859"
         id="path5803" /><path
         d="m 245.79415,82.68971 v -0.144 c -0.392,0.197 -0.72,0.429 -0.983,0.695 -0.375,0.377 -0.664,0.822 -0.867,1.336 -0.203,0.513 -0.306,1.045 -0.306,1.597 0,0.808 0.2,1.544 0.598,2.209 0.398,0.665 0.919,1.141 1.558,1.428 v -0.164 c -0.32,-0.177 -0.583,-0.419 -0.789,-0.727 -0.206,-0.306 -0.358,-0.696 -0.46,-1.168 -0.101,-0.47 -0.152,-0.964 -0.152,-1.476 0,-0.557 0.043,-1.063 0.129,-1.519 0.067,-0.36 0.149,-0.648 0.245,-0.866 0.097,-0.217 0.227,-0.426 0.389,-0.627 0.163,-0.201 0.376,-0.391 0.638,-0.574"
         style="fill:#000080;fill-opacity:1;fill-rule:evenodd;stroke:none;stroke-width:0.1"
         id="path281" /><path
         d="m 265.46115,82.92471 v 0.172 c 0.268,0.087 0.476,0.225 0.623,0.411 0.148,0.187 0.22,0.384 0.22,0.593 0,0.049 -0.012,0.09 -0.033,0.125 -0.02,0.023 -0.038,0.034 -0.056,0.034 -0.028,0 -0.092,-0.026 -0.187,-0.078 -0.047,-0.023 -0.097,-0.035 -0.149,-0.035 -0.128,0 -0.228,0.037 -0.304,0.113 -0.076,0.076 -0.114,0.18 -0.114,0.313 0,0.127 0.049,0.237 0.147,0.327 0.096,0.092 0.218,0.138 0.357,0.138 0.171,0 0.325,-0.075 0.458,-0.226 0.135,-0.149 0.201,-0.347 0.201,-0.594 0,-0.268 -0.092,-0.517 -0.278,-0.748 -0.186,-0.231 -0.481,-0.412 -0.885,-0.545"
         style="fill:#000080;fill-opacity:1;fill-rule:evenodd;stroke:none;stroke-width:0.1"
         id="path285" /><path
         d="m 274.28515,89.64671 v 0.164 c 0.395,-0.195 0.724,-0.425 0.988,-0.692 0.372,-0.38 0.659,-0.825 0.862,-1.337 0.204,-0.512 0.306,-1.046 0.306,-1.6 0,-0.807 -0.199,-1.543 -0.597,-2.208 -0.396,-0.665 -0.917,-1.142 -1.559,-1.428 v 0.144 c 0.32,0.18 0.584,0.422 0.791,0.729 0.206,0.305 0.361,0.695 0.461,1.168 0.099,0.472 0.151,0.965 0.151,1.477 0,0.555 -0.045,1.062 -0.131,1.52 -0.064,0.36 -0.145,0.647 -0.243,0.864 -0.099,0.216 -0.229,0.424 -0.39,0.624 -0.161,0.202 -0.375,0.393 -0.639,0.575"
         style="fill:#000080;fill-opacity:1;fill-rule:evenodd;stroke:none;stroke-width:0.1"
         id="path287" /><path
         d="m 254.98215,82.92471 v 0.172 c 0.267,0.087 0.475,0.225 0.624,0.411 0.145,0.187 0.22,0.384 0.22,0.593 0,0.049 -0.012,0.09 -0.036,0.125 -0.018,0.023 -0.037,0.034 -0.054,0.034 -0.03,0 -0.093,-0.026 -0.189,-0.078 -0.046,-0.023 -0.095,-0.035 -0.147,-0.035 -0.128,0 -0.23,0.037 -0.306,0.113 -0.074,0.076 -0.112,0.18 -0.112,0.313 0,0.127 0.049,0.237 0.145,0.327 0.098,0.092 0.218,0.138 0.359,0.138 0.171,0 0.325,-0.075 0.458,-0.226 0.135,-0.149 0.202,-0.347 0.202,-0.594 0,-0.268 -0.095,-0.517 -0.279,-0.748 -0.188,-0.231 -0.482,-0.412 -0.885,-0.545"
         style="fill:#000080;fill-opacity:1;fill-rule:evenodd;stroke:none;stroke-width:0.1"
         id="path283" /><g
         id="g7273"
         style="fill:#000080"><path
           d="m 247.15015,82.43171 h -0.703 l 1.083,3.64 c 0.194,0.652 0.46,1.142 0.794,1.47 0.335,0.328 0.737,0.492 1.205,0.492 0.458,0 0.825,-0.142 1.098,-0.426 0.276,-0.284 0.413,-0.662 0.413,-1.137 0,-0.303 -0.061,-0.601 -0.185,-0.898 -0.124,-0.297 -0.298,-0.563 -0.522,-0.797 -0.199,-0.211 -0.415,-0.37 -0.651,-0.478 -0.235,-0.108 -0.481,-0.163 -0.739,-0.163 -0.197,0 -0.402,0.025 -0.61,0.076 -0.208,0.051 -0.411,0.125 -0.604,0.222 z m 1.151,3.954 -0.46,-1.571 c 0.173,-0.151 0.34,-0.26 0.5,-0.328 0.158,-0.068 0.325,-0.101 0.5,-0.101 0.418,0 0.775,0.241 1.067,0.723 0.292,0.481 0.437,1.065 0.437,1.749 0,0.294 -0.068,0.525 -0.209,0.692 -0.139,0.166 -0.328,0.249 -0.567,0.249 -0.272,0 -0.517,-0.121 -0.735,-0.365 -0.216,-0.243 -0.393,-0.594 -0.533,-1.048"
           style="fill:#000080;fill-opacity:1;fill-rule:evenodd;stroke:none;stroke-width:0.1"
           id="path289" /><path
           d="m 252.25415,85.73971 0.967,0.472 h 0.099 v -3.356 c 0,-0.221 0.008,-0.36 0.025,-0.415 0.02,-0.054 0.06,-0.096 0.116,-0.127 0.06,-0.028 0.178,-0.045 0.359,-0.049 v -0.108 h -1.495 v 0.108 c 0.187,0.004 0.308,0.02 0.364,0.049 0.055,0.028 0.093,0.066 0.113,0.114 0.022,0.047 0.032,0.191 0.032,0.428 v 2.146 c 0,0.289 -0.009,0.474 -0.029,0.556 -0.013,0.062 -0.039,0.109 -0.074,0.138 -0.036,0.029 -0.078,0.044 -0.129,0.044 -0.072,0 -0.175,-0.03 -0.304,-0.091 l -0.044,0.091"
           style="fill:#000080;fill-opacity:1;fill-rule:evenodd;stroke:none;stroke-width:0.1"
           id="path293" /></g><g
         id="g7273-9"
         transform="translate(-58.69315,-43.528709)"
         style="fill:#000080"><path
           d="m 247.15015,82.43171 h -0.703 l 1.083,3.64 c 0.194,0.652 0.46,1.142 0.794,1.47 0.335,0.328 0.737,0.492 1.205,0.492 0.458,0 0.825,-0.142 1.098,-0.426 0.276,-0.284 0.413,-0.662 0.413,-1.137 0,-0.303 -0.061,-0.601 -0.185,-0.898 -0.124,-0.297 -0.298,-0.563 -0.522,-0.797 -0.199,-0.211 -0.415,-0.37 -0.651,-0.478 -0.235,-0.108 -0.481,-0.163 -0.739,-0.163 -0.197,0 -0.402,0.025 -0.61,0.076 -0.208,0.051 -0.411,0.125 -0.604,0.222 z m 1.151,3.954 -0.46,-1.571 c 0.173,-0.151 0.34,-0.26 0.5,-0.328 0.158,-0.068 0.325,-0.101 0.5,-0.101 0.418,0 0.775,0.241 1.067,0.723 0.292,0.481 0.437,1.065 0.437,1.749 0,0.294 -0.068,0.525 -0.209,0.692 -0.139,0.166 -0.328,0.249 -0.567,0.249 -0.272,0 -0.517,-0.121 -0.735,-0.365 -0.216,-0.243 -0.393,-0.594 -0.533,-1.048"
           style="fill:#000080;fill-opacity:1;fill-rule:evenodd;stroke:none;stroke-width:0.1"
           id="path289-9" /><path
           d="m 252.25415,85.73971 0.967,0.472 h 0.099 v -3.356 c 0,-0.221 0.008,-0.36 0.025,-0.415 0.02,-0.054 0.06,-0.096 0.116,-0.127 0.06,-0.028 0.178,-0.045 0.359,-0.049 v -0.108 h -1.495 v 0.108 c 0.187,0.004 0.308,0.02 0.364,0.049 0.055,0.028 0.093,0.066 0.113,0.114 0.022,0.047 0.032,0.191 0.032,0.428 v 2.146 c 0,0.289 -0.009,0.474 -0.029,0.556 -0.013,0.062 -0.039,0.109 -0.074,0.138 -0.036,0.029 -0.078,0.044 -0.129,0.044 -0.072,0 -0.175,-0.03 -0.304,-0.091 l -0.044,0.091"
           style="fill:#000080;fill-opacity:1;fill-rule:evenodd;stroke:none;stroke-width:0.1"
           id="path293-4" /></g><g
         id="g7623"
         style="fill:#000080"><path
           d="m 183.885,23.0398 h -0.703 l 1.082,3.6403 c 0.196,0.6519 0.46,1.141 0.795,1.4691 0.334,0.3278 0.737,0.4918 1.205,0.4918 0.458,0 0.825,-0.141 1.099,-0.425 0.275,-0.284 0.412,-0.6629 0.412,-1.1371 0,-0.3027 -0.061,-0.6019 -0.185,-0.8988 -0.124,-0.2961 -0.297,-0.5629 -0.522,-0.7961 -0.199,-0.2121 -0.415,-0.3711 -0.65,-0.4789 -0.237,-0.1082 -0.483,-0.1621 -0.74,-0.1621 -0.198,0 -0.402,0.025 -0.61,0.0761 -0.208,0.05 -0.41,0.125 -0.604,0.2207 z m 1.151,3.9532 -0.46,-1.57 c 0.174,-0.1511 0.341,-0.2601 0.5,-0.3281 0.159,-0.0679 0.325,-0.1019 0.5,-0.1019 0.419,0 0.775,0.2422 1.067,0.723 0.292,0.4809 0.438,1.0649 0.438,1.7488 0,0.2954 -0.069,0.525 -0.209,0.6922 -0.14,0.1668 -0.328,0.25 -0.568,0.25 -0.272,0 -0.516,-0.1218 -0.735,-0.366 -0.217,-0.2422 -0.393,-0.593 -0.533,-1.048"
           style="fill:#000080;fill-opacity:1;fill-rule:evenodd;stroke:none;stroke-width:0.1"
           id="path3437" /><path
           d="m 175.567,25.4148 v 1.9493 h -1.945 v 0.3199 h 1.945 v 1.941 h 0.313 v -1.941 h 1.954 v -0.3199 h -1.954 v -1.9493 h -0.313"
           style="fill:#000080;fill-opacity:1;fill-rule:evenodd;stroke:none;stroke-width:0.1"
           id="path3439" /><path
           d="m 183.998,30.4191 -1.343,-4.6101 c -0.073,-0.25 -0.111,-0.4141 -0.111,-0.4918 0,-0.0262 0.012,-0.05 0.034,-0.0742 0.022,-0.0231 0.045,-0.0348 0.068,-0.0348 0.035,0 0.075,0.0168 0.121,0.05 0.089,0.0629 0.237,0.2188 0.445,0.468 l 0.134,-0.0813 c -0.187,-0.2597 -0.377,-0.4719 -0.568,-0.6328 -0.192,-0.1609 -0.37,-0.241 -0.537,-0.241 -0.09,0 -0.162,0.0301 -0.22,0.093 -0.056,0.0629 -0.086,0.1507 -0.086,0.2648 0,0.15 0.04,0.3481 0.118,0.5973 l 0.151,0.4859 c -0.377,-0.584 -0.721,-0.9871 -1.029,-1.2101 -0.215,-0.1551 -0.42,-0.2309 -0.615,-0.2309 -0.196,0 -0.371,0.0879 -0.517,0.2621 -0.148,0.177 -0.221,0.4148 -0.221,0.7188 0,0.3871 0.125,0.8011 0.373,1.241 0.245,0.4402 0.572,0.798 0.98,1.073 0.319,0.2219 0.613,0.332 0.881,0.332 0.142,0 0.261,-0.0269 0.364,-0.0851 0.101,-0.057 0.201,-0.152 0.301,-0.2848 l 0.382,1.3598 c 0.03,0.0961 0.053,0.1723 0.071,0.2293 0.03,0.1047 0.047,0.191 0.047,0.2598 0,0.0531 -0.02,0.0992 -0.06,0.1351 -0.054,0.0449 -0.125,0.066 -0.209,0.066 -0.061,0 -0.16,-0.009 -0.297,-0.0261 v 0.1441 z m -1.449,-2.7742 c 0,0.1672 -0.049,0.302 -0.144,0.4031 -0.097,0.1012 -0.219,0.152 -0.369,0.152 -0.328,0 -0.668,-0.2711 -1.024,-0.8121 -0.355,-0.543 -0.535,-1.0598 -0.535,-1.5547 0,-0.1961 0.045,-0.3453 0.13,-0.448 0.086,-0.102 0.189,-0.1543 0.309,-0.1543 0.271,0 0.612,0.2933 1.019,0.88 0.41,0.5852 0.614,1.0973 0.614,1.534"
           style="fill:#000080;fill-opacity:1;fill-rule:evenodd;stroke:none;stroke-width:0.1"
           id="path3441" /><g
           id="g7273-9-7"
           transform="translate(-81.868151,-59.053709)"
           style="fill:#000080"><path
             d="m 247.15015,82.43171 h -0.703 l 1.083,3.64 c 0.194,0.652 0.46,1.142 0.794,1.47 0.335,0.328 0.737,0.492 1.205,0.492 0.458,0 0.825,-0.142 1.098,-0.426 0.276,-0.284 0.413,-0.662 0.413,-1.137 0,-0.303 -0.061,-0.601 -0.185,-0.898 -0.124,-0.297 -0.298,-0.563 -0.522,-0.797 -0.199,-0.211 -0.415,-0.37 -0.651,-0.478 -0.235,-0.108 -0.481,-0.163 -0.739,-0.163 -0.197,0 -0.402,0.025 -0.61,0.076 -0.208,0.051 -0.411,0.125 -0.604,0.222 z m 1.151,3.954 -0.46,-1.571 c 0.173,-0.151 0.34,-0.26 0.5,-0.328 0.158,-0.068 0.325,-0.101 0.5,-0.101 0.418,0 0.775,0.241 1.067,0.723 0.292,0.481 0.437,1.065 0.437,1.749 0,0.294 -0.068,0.525 -0.209,0.692 -0.139,0.166 -0.328,0.249 -0.567,0.249 -0.272,0 -0.517,-0.121 -0.735,-0.365 -0.216,-0.243 -0.393,-0.594 -0.533,-1.048"
             style="fill:#000080;fill-opacity:1;fill-rule:evenodd;stroke:none;stroke-width:0.1"
             id="path289-9-0" /><path
             d="m 252.25415,85.73971 0.967,0.472 h 0.099 v -3.356 c 0,-0.221 0.008,-0.36 0.025,-0.415 0.02,-0.054 0.06,-0.096 0.116,-0.127 0.06,-0.028 0.178,-0.045 0.359,-0.049 v -0.108 h -1.495 v 0.108 c 0.187,0.004 0.308,0.02 0.364,0.049 0.055,0.028 0.093,0.066 0.113,0.114 0.022,0.047 0.032,0.191 0.032,0.428 v 2.146 c 0,0.289 -0.009,0.474 -0.029,0.556 -0.013,0.062 -0.039,0.109 -0.074,0.138 -0.036,0.029 -0.078,0.044 -0.129,0.044 -0.072,0 -0.175,-0.03 -0.304,-0.091 l -0.044,0.091"
             style="fill:#000080;fill-opacity:1;fill-rule:evenodd;stroke:none;stroke-width:0.1"
             id="path293-4-0" /></g></g><g
         id="g7277"
         style="fill:#000080"><path
           d="m 259.18315,84.42471 c 0.451,0.129 0.841,0.419 1.171,0.868 0.328,0.449 0.493,0.89 0.493,1.322 0,0.317 -0.071,0.568 -0.214,0.752 -0.143,0.184 -0.362,0.304 -0.656,0.361 z m 0.384,3.299 c -0.208,-0.021 -0.401,-0.08 -0.576,-0.176 -0.176,-0.096 -0.343,-0.234 -0.503,-0.413 -0.213,-0.245 -0.382,-0.524 -0.506,-0.838 -0.126,-0.314 -0.189,-0.615 -0.189,-0.904 0,-0.282 0.066,-0.504 0.198,-0.669 0.131,-0.164 0.331,-0.272 0.599,-0.324 z m -0.446,-3.581 -0.411,-1.656 h -0.67 l 0.488,1.672 c -0.456,0.075 -0.812,0.253 -1.067,0.533 -0.255,0.281 -0.382,0.634 -0.382,1.061 0,0.587 0.25,1.105 0.748,1.55 0.499,0.445 1.107,0.687 1.829,0.723 l 0.458,1.582 h 0.308 l -0.383,-1.598 c 0.488,-0.047 0.872,-0.203 1.155,-0.467 0.281,-0.264 0.424,-0.6 0.424,-1.005 0,-0.565 -0.243,-1.084 -0.725,-1.555 -0.483,-0.472 -1.074,-0.752 -1.772,-0.84"
           style="fill:#000080;fill-opacity:1;fill-rule:evenodd;stroke:none;stroke-width:0.1"
           id="path291" /><path
           d="m 262.69515,85.73971 0.967,0.472 h 0.096 v -3.356 c 0,-0.221 0.009,-0.36 0.028,-0.415 0.018,-0.054 0.057,-0.096 0.116,-0.127 0.058,-0.028 0.177,-0.045 0.357,-0.049 v -0.108 h -1.495 v 0.108 c 0.189,0.004 0.31,0.02 0.364,0.049 0.054,0.028 0.092,0.066 0.115,0.114 0.02,0.047 0.032,0.191 0.032,0.428 v 2.146 c 0,0.289 -0.011,0.474 -0.029,0.556 -0.014,0.062 -0.04,0.109 -0.076,0.138 -0.036,0.029 -0.079,0.044 -0.13,0.044 -0.072,0 -0.172,-0.03 -0.301,-0.091 l -0.044,0.091"
           style="fill:#000080;fill-opacity:1;fill-rule:evenodd;stroke:none;stroke-width:0.1"
           id="path295" /></g><g
         id="g7561"
         style="fill:#000080"><path
           d="m 178.174,37.8371 c 0.45,0.1289 0.84,0.4188 1.169,0.868 0.33,0.4488 0.494,0.8898 0.494,1.3219 0,0.3171 -0.072,0.5679 -0.215,0.7519 -0.144,0.184 -0.361,0.3043 -0.655,0.3609 z m 0.382,3.2988 c -0.208,-0.0211 -0.399,-0.08 -0.576,-0.175 -0.175,-0.0961 -0.342,-0.2347 -0.503,-0.414 -0.213,-0.2449 -0.382,-0.5239 -0.505,-0.8367 -0.126,-0.3153 -0.189,-0.6161 -0.189,-0.9051 0,-0.2821 0.065,-0.5039 0.197,-0.668 0.133,-0.1652 0.33,-0.273 0.6,-0.3242 z m -0.446,-3.5808 -0.409,-1.6559 h -0.671 l 0.487,1.6719 c -0.456,0.075 -0.812,0.2527 -1.066,0.534 -0.254,0.2801 -0.383,0.6328 -0.383,1.0597 0,0.5883 0.249,1.1051 0.748,1.55 0.498,0.4461 1.109,0.6872 1.829,0.7231 l 0.457,1.5832 h 0.31 l -0.382,-1.5992 c 0.486,-0.0469 0.87,-0.2028 1.152,-0.4668 0.284,-0.2641 0.424,-0.6 0.424,-1.0051 0,-0.5648 -0.24,-1.084 -0.723,-1.5551 -0.485,-0.4719 -1.075,-0.7519 -1.773,-0.8398"
           style="fill:#000080;fill-opacity:1;fill-rule:evenodd;stroke:none;stroke-width:0.1"
           id="path3429" /><path
           d="m 167.76,38.2191 v 1.95 h -1.947 v 0.3188 h 1.947 v 1.9422 h 0.313 v -1.9422 h 1.952 v -0.3188 h -1.952 v -1.95 h -0.313"
           style="fill:#000080;fill-opacity:1;fill-rule:evenodd;stroke:none;stroke-width:0.1"
           id="path3431" /><path
           d="m 176.189,43.223 -1.343,-4.6089 c -0.073,-0.2512 -0.109,-0.4153 -0.109,-0.4922 0,-0.027 0.011,-0.0508 0.032,-0.075 0.023,-0.0219 0.046,-0.034 0.068,-0.034 0.035,0 0.075,0.0172 0.122,0.05 0.09,0.0641 0.238,0.2191 0.446,0.468 l 0.132,-0.0809 c -0.188,-0.2602 -0.377,-0.4719 -0.567,-0.6328 -0.192,-0.1621 -0.371,-0.2422 -0.538,-0.2422 -0.088,0 -0.161,0.0309 -0.219,0.0941 -0.056,0.0618 -0.086,0.15 -0.086,0.2649 0,0.1492 0.04,0.348 0.117,0.5969 l 0.152,0.4851 c -0.377,-0.584 -0.72,-0.9859 -1.03,-1.2101 -0.213,-0.1547 -0.418,-0.2309 -0.614,-0.2309 -0.196,0 -0.37,0.0879 -0.517,0.2629 -0.148,0.1762 -0.221,0.4152 -0.221,0.7172 0,0.3879 0.124,0.8031 0.372,1.2429 0.247,0.4399 0.572,0.7969 0.98,1.0731 0.319,0.2211 0.614,0.332 0.882,0.332 0.141,0 0.262,-0.0281 0.365,-0.0851 0.1,-0.0578 0.2,-0.152 0.299,-0.2848 l 0.382,1.3598 c 0.031,0.0949 0.053,0.1711 0.072,0.2289 0.03,0.1051 0.046,0.1902 0.046,0.2582 0,0.0551 -0.02,0.1 -0.059,0.1359 -0.054,0.0461 -0.125,0.0672 -0.21,0.0672 -0.061,0 -0.159,-0.009 -0.297,-0.0273 V 43 Z m -1.448,-2.773 c 0,0.1672 -0.049,0.302 -0.144,0.402 -0.097,0.1019 -0.22,0.1531 -0.369,0.1531 -0.328,0 -0.669,-0.2711 -1.025,-0.8121 -0.355,-0.543 -0.534,-1.0598 -0.534,-1.5551 0,-0.1957 0.044,-0.3457 0.131,-0.4481 0.086,-0.1027 0.189,-0.1546 0.308,-0.1546 0.271,0 0.611,0.2929 1.019,0.8796 0.409,0.5872 0.614,1.0981 0.614,1.5352"
           style="fill:#000080;fill-opacity:1;fill-rule:evenodd;stroke:none;stroke-width:0.1"
           id="path3433" /><g
           id="g7277-2"
           transform="translate(-100.37515,-46.340209)"
           style="fill:#000080"><path
             d="m 259.18315,84.42471 c 0.451,0.129 0.841,0.419 1.171,0.868 0.328,0.449 0.493,0.89 0.493,1.322 0,0.317 -0.071,0.568 -0.214,0.752 -0.143,0.184 -0.362,0.304 -0.656,0.361 z m 0.384,3.299 c -0.208,-0.021 -0.401,-0.08 -0.576,-0.176 -0.176,-0.096 -0.343,-0.234 -0.503,-0.413 -0.213,-0.245 -0.382,-0.524 -0.506,-0.838 -0.126,-0.314 -0.189,-0.615 -0.189,-0.904 0,-0.282 0.066,-0.504 0.198,-0.669 0.131,-0.164 0.331,-0.272 0.599,-0.324 z m -0.446,-3.581 -0.411,-1.656 h -0.67 l 0.488,1.672 c -0.456,0.075 -0.812,0.253 -1.067,0.533 -0.255,0.281 -0.382,0.634 -0.382,1.061 0,0.587 0.25,1.105 0.748,1.55 0.499,0.445 1.107,0.687 1.829,0.723 l 0.458,1.582 h 0.308 l -0.383,-1.598 c 0.488,-0.047 0.872,-0.203 1.155,-0.467 0.281,-0.264 0.424,-0.6 0.424,-1.005 0,-0.565 -0.243,-1.084 -0.725,-1.555 -0.483,-0.472 -1.074,-0.752 -1.772,-0.84"
             style="fill:#000080;fill-opacity:1;fill-rule:evenodd;stroke:none;stroke-width:0.1"
             id="path291-9" /><path
             d="m 262.69515,85.73971 0.967,0.472 h 0.096 v -3.356 c 0,-0.221 0.009,-0.36 0.028,-0.415 0.018,-0.054 0.057,-0.096 0.116,-0.127 0.058,-0.028 0.177,-0.045 0.357,-0.049 v -0.108 h -1.495 v 0.108 c 0.189,0.004 0.31,0.02 0.364,0.049 0.054,0.028 0.092,0.066 0.115,0.114 0.02,0.047 0.032,0.191 0.032,0.428 v 2.146 c 0,0.289 -0.011,0.474 -0.029,0.556 -0.014,0.062 -0.04,0.109 -0.076,0.138 -0.036,0.029 -0.079,0.044 -0.13,0.044 -0.072,0 -0.172,-0.03 -0.301,-0.091 l -0.044,0.091"
             style="fill:#000080;fill-opacity:1;fill-rule:evenodd;stroke:none;stroke-width:0.1"
             id="path295-0" /></g></g><g
         id="g7277-2-7"
         transform="translate(-88.480151,-36.434959)"
         style="fill:#000080"><path
           d="m 259.18315,84.42471 c 0.451,0.129 0.841,0.419 1.171,0.868 0.328,0.449 0.493,0.89 0.493,1.322 0,0.317 -0.071,0.568 -0.214,0.752 -0.143,0.184 -0.362,0.304 -0.656,0.361 z m 0.384,3.299 c -0.208,-0.021 -0.401,-0.08 -0.576,-0.176 -0.176,-0.096 -0.343,-0.234 -0.503,-0.413 -0.213,-0.245 -0.382,-0.524 -0.506,-0.838 -0.126,-0.314 -0.189,-0.615 -0.189,-0.904 0,-0.282 0.066,-0.504 0.198,-0.669 0.131,-0.164 0.331,-0.272 0.599,-0.324 z m -0.446,-3.581 -0.411,-1.656 h -0.67 l 0.488,1.672 c -0.456,0.075 -0.812,0.253 -1.067,0.533 -0.255,0.281 -0.382,0.634 -0.382,1.061 0,0.587 0.25,1.105 0.748,1.55 0.499,0.445 1.107,0.687 1.829,0.723 l 0.458,1.582 h 0.308 l -0.383,-1.598 c 0.488,-0.047 0.872,-0.203 1.155,-0.467 0.281,-0.264 0.424,-0.6 0.424,-1.005 0,-0.565 -0.243,-1.084 -0.725,-1.555 -0.483,-0.472 -1.074,-0.752 -1.772,-0.84"
           style="fill:#000080;fill-opacity:1;fill-rule:evenodd;stroke:none;stroke-width:0.1"
           id="path291-9-2" /><path
           d="m 262.69515,85.73971 0.967,0.472 h 0.096 v -3.356 c 0,-0.221 0.009,-0.36 0.028,-0.415 0.018,-0.054 0.057,-0.096 0.116,-0.127 0.058,-0.028 0.177,-0.045 0.357,-0.049 v -0.108 h -1.495 v 0.108 c 0.189,0.004 0.31,0.02 0.364,0.049 0.054,0.028 0.092,0.066 0.115,0.114 0.02,0.047 0.032,0.191 0.032,0.428 v 2.146 c 0,0.289 -0.011,0.474 -0.029,0.556 -0.014,0.062 -0.04,0.109 -0.076,0.138 -0.036,0.029 -0.079,0.044 -0.13,0.044 -0.072,0 -0.172,-0.03 -0.301,-0.091 l -0.044,0.091"
           style="fill:#000080;fill-opacity:1;fill-rule:evenodd;stroke:none;stroke-width:0.1"
           id="path295-0-3" /></g><g
         id="g7313"
         style="fill:#000080"><path
           d="m 271.70715,85.73971 0.967,0.472 h 0.099 v -3.356 c 0,-0.221 0.008,-0.36 0.025,-0.415 0.02,-0.054 0.06,-0.096 0.116,-0.127 0.059,-0.028 0.178,-0.045 0.359,-0.049 v -0.108 h -1.495 v 0.108 c 0.187,0.004 0.308,0.02 0.363,0.049 0.056,0.028 0.094,0.066 0.114,0.114 0.022,0.047 0.032,0.191 0.032,0.428 v 2.146 c 0,0.289 -0.009,0.474 -0.029,0.556 -0.012,0.062 -0.039,0.109 -0.075,0.138 -0.035,0.029 -0.077,0.044 -0.129,0.044 -0.071,0 -0.174,-0.03 -0.303,-0.091 l -0.044,0.091"
           style="fill:#000080;fill-opacity:1;fill-rule:evenodd;stroke:none;stroke-width:0.1"
           id="path297" /><path
           d="m 268.66315,87.69771 h 2.48 v -0.098 l -2.702,-2.813 h 1.143 c 0.272,0 0.444,0.011 0.516,0.032 0.074,0.021 0.141,0.065 0.201,0.132 0.063,0.068 0.13,0.191 0.206,0.368 h 0.145 l -0.34,-1.062 h -2.544 v 0.113 l 2.703,2.812 h -1.124 c -0.236,0 -0.381,-0.007 -0.431,-0.019 -0.072,-0.016 -0.144,-0.057 -0.215,-0.124 -0.073,-0.065 -0.146,-0.176 -0.221,-0.329 h -0.149 l 0.332,0.988"
           style="fill:#000080;fill-opacity:1;fill-rule:evenodd;stroke:none;stroke-width:0.1"
           id="path299" /></g><g
         id="g7313-6"
         transform="translate(-120.46828,-11.366308)"
         style="fill:#000080"><path
           d="m 271.70715,85.73971 0.967,0.472 h 0.099 v -3.356 c 0,-0.221 0.008,-0.36 0.025,-0.415 0.02,-0.054 0.06,-0.096 0.116,-0.127 0.059,-0.028 0.178,-0.045 0.359,-0.049 v -0.108 h -1.495 v 0.108 c 0.187,0.004 0.308,0.02 0.363,0.049 0.056,0.028 0.094,0.066 0.114,0.114 0.022,0.047 0.032,0.191 0.032,0.428 v 2.146 c 0,0.289 -0.009,0.474 -0.029,0.556 -0.012,0.062 -0.039,0.109 -0.075,0.138 -0.035,0.029 -0.077,0.044 -0.129,0.044 -0.071,0 -0.174,-0.03 -0.303,-0.091 l -0.044,0.091"
           style="fill:#000080;fill-opacity:1;fill-rule:evenodd;stroke:none;stroke-width:0.1"
           id="path297-1" /><path
           d="m 268.66315,87.69771 h 2.48 v -0.098 l -2.702,-2.813 h 1.143 c 0.272,0 0.444,0.011 0.516,0.032 0.074,0.021 0.141,0.065 0.201,0.132 0.063,0.068 0.13,0.191 0.206,0.368 h 0.145 l -0.34,-1.062 h -2.544 v 0.113 l 2.703,2.812 h -1.124 c -0.236,0 -0.381,-0.007 -0.431,-0.019 -0.072,-0.016 -0.144,-0.057 -0.215,-0.124 -0.073,-0.065 -0.146,-0.176 -0.221,-0.329 h -0.149 l 0.332,0.988"
           style="fill:#000080;fill-opacity:1;fill-rule:evenodd;stroke:none;stroke-width:0.1"
           id="path299-4" /></g><g
         id="g7481"
         style="fill:#000080"><path
           d="m 125.931,82.6109 -1.345,-4.6078 c -0.072,-0.25 -0.109,-0.416 -0.109,-0.4929 0,-0.027 0.013,-0.0493 0.034,-0.0743 0.023,-0.023 0.045,-0.0347 0.067,-0.0347 0.036,0 0.076,0.0179 0.122,0.05 0.089,0.0629 0.237,0.2187 0.445,0.4679 l 0.134,-0.0812 c -0.188,-0.2598 -0.378,-0.4719 -0.569,-0.6328 -0.192,-0.161 -0.37,-0.241 -0.536,-0.241 -0.09,0 -0.161,0.03 -0.22,0.0929 -0.057,0.0621 -0.085,0.1512 -0.085,0.2649 0,0.15 0.039,0.348 0.116,0.5972 l 0.153,0.486 c -0.377,-0.584 -0.723,-0.986 -1.032,-1.211 -0.213,-0.1543 -0.419,-0.23 -0.612,-0.23 -0.199,0 -0.372,0.0871 -0.519,0.2621 -0.148,0.1758 -0.221,0.4148 -0.221,0.7179 0,0.3879 0.124,0.802 0.372,1.2418 0.247,0.4411 0.574,0.7981 0.98,1.0731 0.321,0.2219 0.616,0.332 0.884,0.332 0.14,0 0.26,-0.0269 0.363,-0.0851 0.101,-0.0571 0.202,-0.152 0.301,-0.2848 l 0.381,1.3598 c 0.03,0.0961 0.052,0.1722 0.071,0.2293 0.032,0.1046 0.048,0.1918 0.048,0.2589 0,0.0539 -0.02,0.1 -0.059,0.136 -0.056,0.0449 -0.125,0.066 -0.211,0.066 -0.06,0 -0.159,-0.009 -0.298,-0.0262 v 0.1442 z m -1.45,-2.773 c 0,0.1672 -0.048,0.3012 -0.144,0.4031 -0.095,0.1012 -0.218,0.152 -0.367,0.152 -0.329,0 -0.67,-0.2711 -1.027,-0.8121 -0.353,-0.543 -0.533,-1.0598 -0.533,-1.5547 0,-0.1961 0.044,-0.3453 0.13,-0.4481 0.086,-0.1019 0.189,-0.1543 0.309,-0.1543 0.27,0 0.61,0.2934 1.02,0.8801 0.409,0.5852 0.612,1.0973 0.612,1.534"
           style="fill:#000080;fill-opacity:1;fill-rule:evenodd;stroke:none;stroke-width:0.1"
           id="path3457" /><path
           d="m 126.274,80.498 h 2.48 v -0.0968 l -2.702,-2.8141 h 1.144 c 0.271,0 0.443,0.0109 0.515,0.0328 0.074,0.0211 0.14,0.0653 0.201,0.1332 0.062,0.066 0.13,0.1891 0.207,0.3668 h 0.144 l -0.34,-1.0629 h -2.544 v 0.1129 l 2.703,2.8121 h -1.124 c -0.236,0 -0.381,-0.007 -0.43,-0.0191 -0.073,-0.0149 -0.145,-0.057 -0.217,-0.1231 -0.071,-0.0656 -0.145,-0.1757 -0.22,-0.3296 h -0.149 l 0.332,0.9878"
           style="fill:#000080;fill-opacity:1;fill-rule:evenodd;stroke:none;stroke-width:0.1"
           id="path3459" /><path
           d="m 118.681,77.6082 v 1.9488 h -1.947 v 0.3211 h 1.947 v 1.9399 h 0.313 v -1.9399 h 1.953 V 79.557 h -1.953 v -1.9488 h -0.313"
           style="fill:#000080;fill-opacity:1;fill-rule:evenodd;stroke:none;stroke-width:0.1"
           id="path3461" /><g
           id="g7313-6-2"
           transform="translate(-157.2979,-6.761458)"
           style="fill:#000080"><path
             d="m 271.70715,85.73971 0.967,0.472 h 0.099 v -3.356 c 0,-0.221 0.008,-0.36 0.025,-0.415 0.02,-0.054 0.06,-0.096 0.116,-0.127 0.059,-0.028 0.178,-0.045 0.359,-0.049 v -0.108 h -1.495 v 0.108 c 0.187,0.004 0.308,0.02 0.363,0.049 0.056,0.028 0.094,0.066 0.114,0.114 0.022,0.047 0.032,0.191 0.032,0.428 v 2.146 c 0,0.289 -0.009,0.474 -0.029,0.556 -0.012,0.062 -0.039,0.109 -0.075,0.138 -0.035,0.029 -0.077,0.044 -0.129,0.044 -0.071,0 -0.174,-0.03 -0.303,-0.091 l -0.044,0.091"
             style="fill:#000080;fill-opacity:1;fill-rule:evenodd;stroke:none;stroke-width:0.1"
             id="path297-1-4" /><path
             d="m 268.66315,87.69771 h 2.48 v -0.098 l -2.702,-2.813 h 1.143 c 0.272,0 0.444,0.011 0.516,0.032 0.074,0.021 0.141,0.065 0.201,0.132 0.063,0.068 0.13,0.191 0.206,0.368 h 0.145 l -0.34,-1.062 h -2.544 v 0.113 l 2.703,2.812 h -1.124 c -0.236,0 -0.381,-0.007 -0.431,-0.019 -0.072,-0.016 -0.144,-0.057 -0.215,-0.124 -0.073,-0.065 -0.146,-0.176 -0.221,-0.329 h -0.149 l 0.332,0.988"
             style="fill:#000080;fill-opacity:1;fill-rule:evenodd;stroke:none;stroke-width:0.1"
             id="path299-4-8" /></g></g><path
         style="fill:none;stroke:#ff0000;stroke-width:0.75px;stroke-linecap:butt;stroke-linejoin:miter;stroke-opacity:1;marker-start:url(#marker61529317)"
         d="m 213.37838,70.076452 c -10.60483,2.726958 -19.39169,1.96947 -19.39169,1.96947"
         id="path13847" /></g></g></svg>
