* KawaScriptEngine.java (compile): Fix arguments to parse.

Specifically, we don't want INTERACTIVE to be set, as that
cases compilation errors.
Fixes GitLab issue #70 "When evaluated through the javax.script API,
define raises a ClassCastException: Cannot cast IntNum to Location".
1 job for master in 5 minutes and 43 seconds (queued for 1 second)
Status Job ID Name Coverage
  Build And Test
failed #484203426
build_script

00:05:43

 
Name Stage Failure
failed
build_script Build And Test
  -e '(close-output-port out)'
#tdiff tmpP ./ppfile.out
make[1]: diff: Command not found
make[1]: *** [Makefile:691: check-ppfile] Error 127
make[1]: Leaving directory '/builds/kashell/Kawa/testsuite'
make: *** [Makefile:1443: check-recursive] Error 1
Running after_script
Uploading artifacts for failed job
ERROR: Job failed: exit code 1