{
    "monoasteroids_content.zip": "monoasteroids_content.zip",
    "karate_gfx.zip": "karate_gfx.zip",
    "image-17.png": "image-2.png",
    "image-20.png": "image-3.png",
    "image-19.png": "image-4.png",
    "Moonlander-5.png": "image-5.png",
    "lander.png": "image-6.png",
    "Moonlander-1.png": "image-7.png",
    "Moonlander-2.png": "image-8.png",
    "Moonlander-3.png": "image-9.png",
    "Moonlander-4.png": "image-10.png",
    "Shmup-1.png": "image-11.png",
    "Shmup-2.png": "image-12.png",
    "arcade-game.png": "image-13.png",
    "JagaMonster-diagram-9.png": "image-14.png",
    "JagaMonster-diagram-10.png": "image-15.png",
    "resurser.zip": "resurser.zip",
    "image-15.png": "image-17.png",
    "image-16.png": "image-18.png",
    "image-14.png": "image-19.png",
    "JagaMonster-1.png": "image-20.png",
    "JagaMonster-2.png": "image-21.png",
    "JagaMonster-3.png": "image-22.png",
    "JagaMonster-4.png": "image-23.png",
    "JagaMonster-5.png": "image-24.png",
    "JagaMonster-6.png": "image-25.png",
    "JagaMonster-diagram-7.png": "image-26.png",
    "JagaMonster-diagram-8.png": "image-27.png",
    "JagaMonster-diagram-4.png": "image-28.png",
    "JagaMonster-10.png": "image-29.png",
    "image-12.png": "image-30.png",
    "image-10.png": "image-31.png",
    "image-11.png": "image-32.png",
    "image-9.png": "image-33.png",
    "image-13.png": "image-34.png",
    "image-8.png": "image-35.png",
    "image-1.png": "image-36.png",
    "image-2.png": "image-37.png",
    "image-3.png": "image-38.png",
    "MediaRegister.exe": "MediaRegister.exe",
    "image-104.png": "image-40.png",
    "image-106.png": "image-41.png",
    "image-107.png": "image-42.png",
    "image-96.png": "image-43.png",
    "image-97.png": "image-44.png",
    "image-117.png": "image-45.png",
    "image-85.png": "image-46.png",
    "image-124.png": "image-47.png",
    "image-110.png": "image-48.png",
    "image-127.png": "image-49.png",
    "image-108.png": "image-50.png",
    "image-109.png": "image-51.png",
    "image-77.png": "image-52.png",
    "image-73.png": "image-53.png",
    "image-74.png": "image-54.png",
    "image-78.png": "image-55.png",
    "image-75.png": "image-56.png",
    "image-79.png": "image-57.png",
    "image-76.png": "image-58.png",
    "image-69.png": "image-59.png",
    "image-70.png": "image-60.png",
    "image-86.png": "image-61.png",
    "image-87.png": "image-62.png",
    "image-88.png": "image-63.png",
    "image-89.png": "image-64.png",
    "image-90.png": "image-65.png",
    "image-91.png": "image-66.png",
    "image-80.png": "image-67.png",
    "image-81.png": "image-68.png",
    "image-82.png": "image-69.png",
    "image-83.png": "image-70.png",
    "image-68%20copy.png": "image-71.png",
    "luffarschack.png": "image-72.png",
    "image-29%20copy.png": "image-73.png",
    "image-30%20copy.png": "image-74.png",
    "image-31%20copy.png": "image-75.png",
    "image-24%20copy.png": "image-76.png",
    "image-25%20copy.png": "image-77.png",
    "image-21%20copy.png": "image-78.png",
    "image-22%20copy.png": "image-79.png",
    "image-23%20copy.png": "image-80.png",
    "image-27%20copy.png": "image-81.png",
    "image-28%20copy.png": "image-82.png",
    "image-60%20copy.png": "image-83.png",
    "image-61%20copy.png": "image-84.png",
    "image-62%20copy.png": "image-85.png",
    "image-63%20copy.png": "image-86.png",
    "image-64%20copy.png": "image-87.png",
    "image-65%20copy.png": "image-88.png",
    "image-66%20copy.png": "image-89.png",
    "image-67%20copy.png": "image-90.png",
    "image-58 copy.png": "image-91.png",
    "labb-2c.png": "image-92.png",
    "image-57 copy.png": "image-93.png",
    "image-49%20copy.png": "image-94.png",
    "image-50%20copy.png": "image-95.png",
    "image-51%20copy.png": "image-96.png",
    "image-52%20copy.png": "image-97.png",
    "image-53%20copy.png": "image-98.png",
    "image-54%20copy.png": "image-99.png",
    "image-55%20copy.png": "image-100.png",
    "image-56%20copy.png": "image-101.png",
    "image-34 copy.png": "image-102.png",
    "image-35 copy.png": "image-103.png",
    "image-44%20copy.png": "image-104.png",
    "image-37%20copy.png": "image-105.png",
    "image-38%20copy.png": "image-106.png",
    "image-39%20copy.png": "image-107.png",
    "image-40%20copy.png": "image-108.png",
    "image-41%20copy.png": "image-109.png",
    "image-42%20copy.png": "image-110.png",
    "image-43%20copy.png": "image-111.png",
    "image-32 copy.png": "image-112.png",
    "image-33 copy.png": "image-113.png",
    "image-45%20copy.png": "image-114.png",
    "image-46%20copy.png": "image-115.png",
    "image-47%20copy.png": "image-116.png",
    "image-48%20copy.png": "image-117.png",
    "image-136.png": "image-118.png",
    "image-135.png": "image-119.png",
    "image-132.png": "image-120.png",
    "poker.png": "image-121.png",
    "blackjack-diagram.png": "image-122.png",
    "oop_blackjack_console.png": "image-123.png",
    "image-133.png": "image-124.png",
    "pong.png": "image-125.png",
    "image-134.png": "image-126.png",
    "countries.json": "countries.json",
    "image-7.png": "image-128.png",
    "image-4.png": "image-129.png",
    "image-5.png": "image-130.png",
    "image-6.png": "image-131.png"
}