{
    "SUMMARY.md": [],
    "README.md": [],
    "monogame/labb-space-race-3-3.md": [],
    "monogame/monoasteroids.md": [
        "../.gitbook/assets/monogame/monoasteroids_content.zip"
    ],
    "monogame/labb-space-race-2-3.md": [],
    "monogame/labb-space-race-1-3.md": [],
    "monogame/forsta-spelet.md": [
        "../.gitbook/assets/monogame/image-17.png",
        "../.gitbook/assets/monogame/image-20.png",
        "../.gitbook/assets/monogame/karate_gfx.zip"
    ],
    "monogame/introduktion.md": [
        "../.gitbook/assets/monogame/image-19.png",
        "../.gitbook/assets/monogame/image-20.png"
    ],
    "raylib/intro.md": [],
    "raylib/manlandare/manlandare-2.md": [
        "../../.gitbook/assets/raylib/manlandare/Moonlander-5.png"
    ],
    "raylib/manlandare/README.md": [
        "../../.gitbook/assets/raylib/manlandare/lander.png"
    ],
    "raylib/manlandare/manlandare-1.md": [
        "../../.gitbook/assets/raylib/manlandare/Moonlander-1.png",
        "../../.gitbook/assets/raylib/manlandare/Moonlander-2.png",
        "../../.gitbook/assets/raylib/manlandare/Moonlander-3.png",
        "../../.gitbook/assets/raylib/manlandare/Moonlander-4.png"
    ],
    "raylib/shmup/shmup-1.md": [
        "../../.gitbook/assets/raylib/shmup/Shmup-1.png"
    ],
    "raylib/shmup/shmup-2.md": [
        "../../.gitbook/assets/raylib/shmup/Shmup-2.png"
    ],
    "raylib/shmup/shmup-4.md": [],
    "raylib/shmup/README.md": [
        "../../.gitbook/assets/raylib/shmup/arcade-game.png"
    ],
    "raylib/shmup/shmup-3.md": [],
    "raylib/jagamonster/monster-oop-7.md": [
        "../../.gitbook/assets/raylib/jagamonster/JagaMonster-diagram-9.png",
        "../../.gitbook/assets/raylib/jagamonster/JagaMonster-diagram-10.png"
    ],
    "raylib/jagamonster/monster-oop.md": [
        "../../.gitbook/assets/raylib/jagamonster/image-15.png",
        "../../.gitbook/assets/raylib/jagamonster/image-16.png",
        "../../.gitbook/assets/raylib/jagamonster/image-14.png",
        "../../.gitbook/assets/raylib/jagamonster/resurser.zip"
    ],
    "raylib/jagamonster/monster-oop-1.md": [
        "../../.gitbook/assets/raylib/jagamonster/JagaMonster-1.png",
        "../../.gitbook/assets/raylib/jagamonster/JagaMonster-2.png",
        "../../.gitbook/assets/raylib/jagamonster/JagaMonster-3.png",
        "../../.gitbook/assets/raylib/jagamonster/JagaMonster-4.png",
        "../../.gitbook/assets/raylib/jagamonster/JagaMonster-5.png",
        "../../.gitbook/assets/raylib/jagamonster/JagaMonster-6.png",
        "../../.gitbook/assets/raylib/jagamonster/resurser.zip"
    ],
    "raylib/jagamonster/README.md": [
        "../../.gitbook/assets/raylib/jagamonster/JagaMonster-5.png"
    ],
    "raylib/jagamonster/monster-oop-6.md": [
        "../../.gitbook/assets/raylib/jagamonster/JagaMonster-diagram-7.png",
        "../../.gitbook/assets/raylib/jagamonster/JagaMonster-diagram-8.png"
    ],
    "raylib/jagamonster/monster-oop-4.md": [
        "../../.gitbook/assets/raylib/jagamonster/JagaMonster-diagram-4.png"
    ],
    "raylib/jagamonster/monster-oop-3.md": [],
    "raylib/jagamonster/monster-oop-2.md": [
        "../../.gitbook/assets/raylib/jagamonster/JagaMonster-10.png"
    ],
    "raylib/jagamonster/monster-oop-5.md": [],
    "raylib/jagamonster/monster-oop-8.md": [],
    "naetverk/naetverk-json-komplex.md": [
        "../.gitbook/assets/naetverk/image-12.png"
    ],
    "naetverk/labbar.md": [
        "../.gitbook/assets/naetverk/image-10.png",
        "../.gitbook/assets/naetverk/image-11.png",
        "../.gitbook/assets/naetverk/image-9.png"
    ],
    "naetverk/naetverk-json-enkel.md": [
        "../.gitbook/assets/naetverk/image-13.png"
    ],
    "naetverk/naetverk-1.md": [
        "../.gitbook/assets/naetverk/image-8.png"
    ],
    "introduktion/utvecklingsmiljoen.md": [
        "../.gitbook/assets/introduktion/image-1.png",
        "../.gitbook/assets/introduktion/image-2.png",
        "../.gitbook/assets/introduktion/image-3.png"
    ],
    "introduktion/laenkar.md": [],
    "oop/pseudokod.md": [],
    "oop/labb-mediaregister.md": [
        "../.gitbook/assets/oop/image-104.png",
        "../.gitbook/assets/oop/image-106.png",
        "../.gitbook/assets/oop/image-107.png",
        "../.gitbook/assets/oop/image-96.png",
        "../.gitbook/assets/oop/image-97.png",
        "../.gitbook/assets/oop/MediaRegister.exe"
    ],
    "oop/klassmetoder/highscore.md": [
        "../../.gitbook/assets/oop/klassmetoder/image-117.png"
    ],
    "oop/klassmetoder/uppgifter.md": [
        "../../.gitbook/assets/oop/klasser/image-85.png",
        "../../.gitbook/assets/oop/klassmetoder/image-124.png"
    ],
    "oop/klassmetoder/README.md": [
        "../../.gitbook/assets/oop/klassmetoder/image-110.png"
    ],
    "oop/klassmetoder/personinkomst.md": [
        "../../.gitbook/assets/oop/klassmetoder/image-127.png"
    ],
    "oop/arv/uppgifter.md": [
        "../../.gitbook/assets/oop/arv/image-108.png",
        "../../.gitbook/assets/oop/arv/image-109.png"
    ],
    "oop/arv/README.md": [],
    "oop/inkapsling/uppgifter.md": [
        "../../.gitbook/assets/oop/inkapsling/image-77.png",
        "../../.gitbook/assets/oop/inkapsling/image-73.png",
        "../../.gitbook/assets/oop/inkapsling/image-74.png",
        "../../.gitbook/assets/oop/inkapsling/image-78.png",
        "../../.gitbook/assets/oop/inkapsling/image-75.png",
        "../../.gitbook/assets/oop/inkapsling/image-79.png",
        "../../.gitbook/assets/oop/inkapsling/image-76.png"
    ],
    "oop/inkapsling/README.md": [
        "../../.gitbook/assets/oop/inkapsling/image-69.png",
        "../../.gitbook/assets/oop/inkapsling/image-70.png",
        "../../.gitbook/assets/oop/inkapsling/image-71.png",
        "../../.gitbook/assets/oop/inkapsling/image-72.png"
    ],
    "oop/klasser/uppgifter.md": [
        "../../.gitbook/assets/oop/klasser/image-85.png",
        "../../.gitbook/assets/oop/klasser/image-86.png"
    ],
    "oop/klasser/plantuml.md": [
        "../../.gitbook/assets/oop/klasser/image-87.png",
        "../../.gitbook/assets/oop/klasser/image-88.png",
        "../../.gitbook/assets/oop/klasser/image-89.png",
        "../../.gitbook/assets/oop/klasser/image-90.png",
        "../../.gitbook/assets/oop/klasser/image-91.png"
    ],
    "oop/klasser/README.md": [
        "../../.gitbook/assets/oop/klasser/image-80.png",
        "../../.gitbook/assets/oop/klasser/image-81.png",
        "../../.gitbook/assets/oop/klasser/image-82.png",
        "../../.gitbook/assets/oop/klasser/image-83.png"
    ],
    "oop/polymorfism/uppgifter.md": [],
    "oop/polymorfism/README.md": [],
    "gui-appar/labb-luffarschak.md": [
        "../.gitbook/assets/gui-appar/luffarschack.png"
    ],
    "gui-appar/layout-med-grid/uppgifter.md": [
        "../../.gitbook/assets/gui-appar/layout-med-grid/image-29.png",
        "../../.gitbook/assets/gui-appar/layout-med-grid/image-30.png",
        "../../.gitbook/assets/gui-appar/layout-med-grid/image-31.png"
    ],
    "gui-appar/layout-med-grid/README.md": [
        "../../.gitbook/assets/gui-appar/layout-med-grid/image-24.png",
        "../../.gitbook/assets/gui-appar/layout-med-grid/image-25.png",
        "../../.gitbook/assets/gui-appar/layout-med-grid/image-26.png",
        "../../.gitbook/assets/gui-appar/layout-med-grid/image-21.png",
        "../../.gitbook/assets/gui-appar/layout-med-grid/image-22.png",
        "../../.gitbook/assets/gui-appar/layout-med-grid/image-23.png",
        "../../.gitbook/assets/gui-appar/layout-med-grid/image-27.png",
        "../../.gitbook/assets/gui-appar/layout-med-grid/image-28.png"
    ],
    "gui-appar/intro-till-wpf/labbar.md": [
        "../../.gitbook/assets/gui-appar/intro-till-wpf/image-57.png",
        "../../.gitbook/assets/gui-appar/intro-till-wpf/image-58.png",
        "../../.gitbook/assets/gui-appar/intro-till-wpf/image-59.png"
    ],
    "gui-appar/intro-till-wpf/README.md": [
        "../../.gitbook/assets/gui-appar/intro-till-wpf/image-68.png",
        "../../.gitbook/assets/gui-appar/intro-till-wpf/image-60.png",
        "../../.gitbook/assets/gui-appar/intro-till-wpf/image-61.png",
        "../../.gitbook/assets/gui-appar/intro-till-wpf/image-62.png",
        "../../.gitbook/assets/gui-appar/intro-till-wpf/image-63.png",
        "../../.gitbook/assets/gui-appar/intro-till-wpf/image-64.png",
        "../../.gitbook/assets/gui-appar/intro-till-wpf/image-65.png",
        "../../.gitbook/assets/gui-appar/intro-till-wpf/image-66.png",
        "../../.gitbook/assets/gui-appar/intro-till-wpf/image-67.png"
    ],
    "gui-appar/layout-med-stackpanel/labbar.md": [
        "../../.gitbook/assets/gui-appar/layout-med-stackpanel/image-32.png",
        "../../.gitbook/assets/gui-appar/layout-med-stackpanel/image-33.png",
        "../../.gitbook/assets/gui-appar/layout-med-stackpanel/image-34.png",
        "../../.gitbook/assets/gui-appar/layout-med-stackpanel/image-35.png"
    ],
    "gui-appar/layout-med-stackpanel/uppgifter.md": [
        "../../.gitbook/assets/gui-appar/layout-med-stackpanel/image-49.png",
        "../../.gitbook/assets/gui-appar/layout-med-stackpanel/image-50.png",
        "../../.gitbook/assets/gui-appar/layout-med-stackpanel/image-51.png",
        "../../.gitbook/assets/gui-appar/layout-med-stackpanel/image-52.png",
        "../../.gitbook/assets/gui-appar/layout-med-stackpanel/image-53.png",
        "../../.gitbook/assets/gui-appar/layout-med-stackpanel/image-54.png",
        "../../.gitbook/assets/gui-appar/layout-med-stackpanel/image-55.png",
        "../../.gitbook/assets/gui-appar/layout-med-stackpanel/image-56.png"
    ],
    "gui-appar/layout-med-stackpanel/README.md": [
        "../../.gitbook/assets/gui-appar/layout-med-stackpanel/image-44.png",
        "../../.gitbook/assets/gui-appar/layout-med-stackpanel/image-37.png",
        "../../.gitbook/assets/gui-appar/layout-med-stackpanel/image-38.png",
        "../../.gitbook/assets/gui-appar/layout-med-stackpanel/image-39.png",
        "../../.gitbook/assets/gui-appar/layout-med-stackpanel/image-40.png",
        "../../.gitbook/assets/gui-appar/layout-med-stackpanel/image-41.png",
        "../../.gitbook/assets/gui-appar/layout-med-stackpanel/image-42.png",
        "../../.gitbook/assets/gui-appar/layout-med-stackpanel/image-43.png",
        "../../.gitbook/assets/gui-appar/layout-med-stackpanel/image-44.png",
        "../../.gitbook/assets/gui-appar/layout-med-stackpanel/image-45.png",
        "../../.gitbook/assets/gui-appar/layout-med-stackpanel/image-46.png",
        "../../.gitbook/assets/gui-appar/layout-med-stackpanel/image-47.png",
        "../../.gitbook/assets/gui-appar/layout-med-stackpanel/image-48.png"
    ],
    "projekt/labyrint-monogame.md": [
        "../.gitbook/assets/projekt/image-136.png"
    ],
    "projekt/flygplan-monogame.md": [
        "../.gitbook/assets/projekt/image-135.png"
    ],
    "projekt/exempel-konsol-3.md": [],
    "projekt/fiskar-monogame.md": [
        "../.gitbook/assets/projekt/image-132.png"
    ],
    "projekt/blackjack-konsol.md": [
        "../.gitbook/assets/projekt/poker.png",
        "../.gitbook/assets/projekt/blackjack-diagram.png",
        "../.gitbook/assets/projekt/oop_blackjack_console.png"
    ],
    "projekt/exempel-konsol-2.md": [],
    "projekt/natluffarschak-wpf.md": [
        "../.gitbook/assets/projekt/image-133.png"
    ],
    "projekt/pong-raylib.md": [
        "../.gitbook/assets/projekt/pong.png"
    ],
    "projekt/exempel-konsol-1.md": [],
    "projekt/sr-appen-wpf.md": [
        "../.gitbook/assets/projekt/image-134.png"
    ],
    "samlingar/laesa-in-json.md": [
        "../.gitbook/assets/samlingar/countries.json"
    ],
    "samlingar/skapa-json/labbar.md": [],
    "samlingar/skapa-json/uppgifter.md": [],
    "samlingar/skapa-json/README.md": [
        "../../.gitbook/assets/samlingar/skapa-json/image-7.png"
    ],
    "samlingar/intro-till-list/labbar.md": [
        "../../.gitbook/assets/samlingar/intro-till-list/image-4.png"
    ],
    "samlingar/intro-till-list/README.md": [
        "../../.gitbook/assets/samlingar/intro-till-list/image-5.png",
        "../../.gitbook/assets/samlingar/intro-till-list/image-6.png"
    ],
    "repetition/klasser.md": [],
    "repetition/README.md": [],
    "repetition/metoder.md": [],
    "repetition/list-dictionary.md": []
}