{
  "packageName": "com.didapinche.booking",
  "forceDark": true,
  "mainRule": 1152,
  "secondaryRule": 0,
  "forceDarkActivityConfigList": [
    {
      "activityName": "com.didapinche.booking.helpage.view.activity.HelpAgeHomeActivity",
      "forceDark": true,
      "forceDarkViewConfigList": [
        {
          "viewName": "androidx.appcompat.widget.AppCompatTextView",
          "id": "tv_start_address",
          "forceDark": false,
          "conditions": [
            {
              "parent": 0,
              "viewName": "android.widget.LinearLayout",
              "index": -1,
              "id": "ll_start_point"
            },
            {
              "parent": 2,
              "viewName": "androidx.constraintlayout.widget.ConstraintLayout",
              "index": -1,
              "id": "ct_all"
            }
          ]
        },
        {
          "viewName": "androidx.appcompat.widget.AppCompatTextView",
          "id": "tv_family_account",
          "forceDark": false,
          "conditions": [
            {
              "parent": 0,
              "viewName": "androidx.constraintlayout.widget.ConstraintLayout",
              "index": -1,
              "id": "ct_all"
            },
            {
              "parent": 2,
              "viewName": "androidx.appcompat.widget.FitWindowsLinearLayout",
              "index": -1,
              "id": "action_bar_root"
            }
          ]
        },
        {
          "viewName": "androidx.appcompat.widget.AppCompatImageView",
          "id": "top_bg",
          "forceDark": false,
          "conditions": [
            {
              "parent": 0,
              "viewName": "androidx.constraintlayout.widget.ConstraintLayout",
              "index": -1,
              "id": "ct_all"
            },
            {
              "parent": 2,
              "viewName": "androidx.appcompat.widget.FitWindowsLinearLayout",
              "index": -1,
              "id": "action_bar_root"
            }
          ]
        },
        {
          "viewName": "androidx.appcompat.widget.AppCompatImageView",
          "forceDark": true,
          "usage": 103,
          "backgroundUsage": 103,
          "conditions": [
            {
              "parent": 0,
              "viewName": "android.widget.LinearLayout",
              "index": -1
            },
            {
              "parent": 1,
              "viewName": "androidx.constraintlayout.widget.ConstraintLayout",
              "index": -1,
              "id": "ct_all"
            }
          ]
        }
      ]
    },
    {
      "activityName": "com.didapinche.booking.home.activity.IndexNewActivity",
      "forceDark": true,
      "forceDarkViewConfigList": [
        {
          "viewName": "android.widget.FrameLayout",
          "id": "rl_index_new_left_container",
          "forceDark": false,
          "conditions": [
            {
              "parent": 0,
              "viewName": "com.didapinche.booking.home.widget.DiDaDrawerLayout",
              "index": -1,
              "id": "dl_index_new"
            },
            {
              "parent": 2,
              "viewName": "androidx.appcompat.widget.FitWindowsLinearLayout",
              "index": -1,
              "id": "action_bar_root"
            }
          ]
        },
        {
          "viewName": "com.didapinche.booking.home.widget.IndexImageView",
          "id": "ivBottomAtmosphere",
          "forceDark": true,
          "usage": 103,
          "conditions": [
            {
              "parent": 0,
              "viewName": "android.widget.FrameLayout",
              "index": -1,
              "id": "llCard"
            },
            {
              "parent": 2,
              "viewName": "com.didapinche.booking.home.widget.IndexScrollView",
              "index": -1,
              "id": "isv_index_new"
            }
          ]
        },
        {
          "viewName": "com.didapinche.booking.home.widget.IndexScrollView",
          "id": "isv_index_new",
          "forceDark": true,
          "usage": 103,
          "backgroundUsage": 103,
          "conditions": [
            {
              "parent": 0,
              "viewName": "android.widget.FrameLayout",
              "index": -1
            },
            {
              "parent": 1,
              "viewName": "android.widget.FrameLayout",
              "index": -1,
              "id": "flPassenger"
            }
          ]
        },
        {
          "viewName": "com.didapinche.booking.home.widget.IndexImageView",
          "id": "ivTopAtmosphere",
          "forceDark": true,
          "usage": 103,
          "conditions": [
            {
              "parent": 0,
              "viewName": "android.widget.FrameLayout",
              "index": -1,
              "id": "rl_main_passenger_contianer_top"
            },
            {
              "parent": 3,
              "viewName": "android.widget.FrameLayout",
              "index": -1,
              "id": "flPassengerContainer"
            }
          ]
        },
        {
          "viewName": "android.view.View",
          "id": "v_home_new_background",
          "forceDark": true,
          "usage": 103,
          "backgroundUsage": 103,
          "conditions": [
            {
              "parent": 0,
              "viewName": "android.widget.FrameLayout",
              "index": -1,
              "id": "rl_main_passenger_contianer_top"
            }
          ]
        },
        {
          "viewName": "android.widget.FrameLayout",
          "id": "llCard",
          "forceDark": true,
          "usage": 103,
          "backgroundUsage": 103,
          "conditions": [
            {
              "parent": 0,
              "viewName": "android.widget.LinearLayout",
              "index": -1
            },
            {
              "parent": 1,
              "viewName": "com.didapinche.booking.home.widget.IndexScrollView",
              "index": -1,
              "id": "isv_index_new"
            },
            {
              "parent": 3,
              "viewName": "android.widget.FrameLayout",
              "index": -1,
              "id": "flPassenger"
            }
          ]
        },
        {
          "viewName": "androidx.appcompat.widget.AppCompatTextView",
          "forceDark": false,
          "conditions": [
            {
              "parent": 0,
              "viewName": "android.widget.LinearLayout",
              "index": -1
            },
            {
              "parent": 1,
              "viewName": "android.widget.FrameLayout",
              "index": -1,
              "id": "flContainer"
            },
            {
              "parent": 2,
              "viewName": "android.widget.FrameLayout",
              "index": -1,
              "id": "flBottom"
            }
          ]
        },
        {
          "viewName": "androidx.appcompat.widget.AppCompatTextView",
          "forceDark": false,
          "conditions": [
            {
              "parent": 0,
              "viewName": "androidx.constraintlayout.widget.ConstraintLayout",
              "index": -1
            },
            {
              "parent": 1,
              "viewName": "android.widget.FrameLayout",
              "index": -1,
              "id": "flContainer"
            },
            {
              "parent": 2,
              "viewName": "androidx.constraintlayout.widget.ConstraintLayout",
              "index": -1,
              "id": "cl_Constraint"
            }
          ]
        },
        {
          "viewName": "androidx.appcompat.widget.AppCompatTextView",
          "id": "tvTab",
          "forceDark": false,
          "conditions": [
            {
              "parent": 0,
              "viewName": "androidx.constraintlayout.widget.ConstraintLayout",
              "index": -1
            },
            {
              "parent": 1,
              "viewName": "android.widget.LinearLayout",
              "index": -1,
              "id": "scrollTitleContainer"
            },
            {
              "parent": 3,
              "viewName": "android.widget.HorizontalScrollView",
              "index": -1
            }
          ]
        },
        {
          "viewName": "androidx.appcompat.widget.AppCompatTextView",
          "id": "tvStatusTitle",
          "forceDark": false,
          "conditions": [
            {
              "parent": 0,
              "viewName": "androidx.constraintlayout.widget.ConstraintLayout",
              "index": -1,
              "id": "clVerifyStatusParent"
            },
            {
              "parent": 3,
              "viewName": "androidx.recyclerview.widget.RecyclerView",
              "index": -1,
              "id": "rvContent"
            }
          ]
        },
        {
          "viewName": "androidx.appcompat.widget.AppCompatTextView",
          "id": "tvName",
          "forceDark": false,
          "conditions": [
            {
              "parent": 0,
              "viewName": "androidx.constraintlayout.widget.ConstraintLayout",
              "index": -1,
              "id": "cl_time_info"
            },
            {
              "parent": 4,
              "viewName": "com.didapinche.booking.communal.activity.DriverUserRouteLayout",
              "index": -1
            }
          ]
        },
        {
          "viewName": "androidx.appcompat.widget.AppCompatTextView",
          "id": "tvDate",
          "forceDark": false,
          "conditions": [
            {
              "parent": 0,
              "viewName": "androidx.constraintlayout.widget.ConstraintLayout",
              "index": -1,
              "id": "cl_time_info"
            }
          ]
        },
        {
          "viewName": "androidx.appcompat.widget.AppCompatTextView",
          "id": "tvEndAddress",
          "forceDark": false,
          "conditions": [
            {
              "parent": 0,
              "viewName": "android.widget.RelativeLayout",
              "index": -1,
              "id": "ll_line_address"
            }
          ]
        },
        {
          "viewName": "androidx.appcompat.widget.AppCompatTextView",
          "id": "tvStartAddress",
          "forceDark": false,
          "conditions": [
            {
              "parent": 0,
              "viewName": "android.widget.LinearLayout",
              "index": -1,
              "id": "ll_start_address"
            },
            {
              "parent": 1,
              "viewName": "android.widget.RelativeLayout",
              "index": -1,
              "id": "ll_line_address"
            },
            {
              "parent": 4,
              "viewName": "androidx.recyclerview.widget.RecyclerView",
              "index": -1,
              "id": "rl_route"
            }
          ]
        },
        {
          "viewName": "androidx.appcompat.widget.AppCompatTextView",
          "id": "tvKong",
          "forceDark": true,
          "usage": 103,
          "conditions": [
            {
              "parent": 0,
              "viewName": "com.didapinche.booking.common.widget.ItemKongView",
              "index": -1
            },
            {
              "parent": 1,
              "viewName": "android.widget.LinearLayout",
              "index": -1,
              "id": "llKingKong"
            },
            {
              "parent": 2,
              "viewName": "com.didapinche.booking.common.widget.CommonKongView",
              "index": -1,
              "id": "clKong"
            }
          ]
        },
        {
          "viewName": "androidx.appcompat.widget.AppCompatTextView",
          "id": "tv_message_home_login_prompt",
          "forceDark": false,
          "conditions": [
            {
              "parent": 0,
              "viewName": "androidx.constraintlayout.widget.ConstraintLayout",
              "index": -1,
              "id": "cl_index_new_not_login_container"
            },
            {
              "parent": 1,
              "viewName": "android.widget.LinearLayout",
              "index": -1,
              "id": "ll_index_new_top_container"
            },
            {
              "parent": 2,
              "viewName": "android.widget.FrameLayout",
              "index": -1,
              "id": "rl_main_passenger_contianer_top"
            }
          ]
        },
        {
          "viewName": "androidx.appcompat.widget.AppCompatTextView",
          "id": "tv_go_type",
          "forceDark": false,
          "conditions": [
            {
              "parent": 0,
              "viewName": "androidx.constraintlayout.widget.ConstraintLayout",
              "index": -1,
              "id": "constraintLayout"
            },
            {
              "parent": 1,
              "viewName": "com.didapinche.booking.passenger.widget.NewPassengerSubmitInfoViewV1",
              "index": -1
            },
            {
              "parent": 2,
              "viewName": "android.widget.FrameLayout",
              "index": -1,
              "id": "fra_passenger_submit_info_view"
            }
          ]
        },
        {
          "viewName": "androidx.appcompat.widget.AppCompatTextView",
          "forceDark": false,
          "conditions": [
            {
              "parent": 0,
              "viewName": "androidx.constraintlayout.widget.ConstraintLayout",
              "index": -1,
              "id": "ll_free_ride_price"
            },
            {
              "parent": 1,
              "viewName": "androidx.constraintlayout.widget.ConstraintLayout",
              "index": -1,
              "id": "mian_price_layout"
            },
            {
              "parent": 2,
              "viewName": "com.didapinche.booking.home.widget.PlaceOriginOrderPriceCard",
              "index": -1,
              "id": "place_origin_price_card"
            }
          ]
        }
      ]
    },
    {
      "activityName": "com.didapinche.booking.me.activity.MyHomePageActivity",
      "forceDark": true,
      "forceDarkViewConfigList": [
        {
          "viewName": "androidx.appcompat.widget.AppCompatImageView",
          "id": "top_bg",
          "forceDark": true,
          "usage": 105,
          "conditions": [
            {
              "parent": 0,
              "viewName": "androidx.constraintlayout.widget.ConstraintLayout",
              "index": -1,
              "id": "cl_container"
            },
            {
              "parent": 2,
              "viewName": "androidx.appcompat.widget.FitWindowsLinearLayout",
              "index": -1,
              "id": "action_bar_root"
            }
          ]
        },
        {
          "viewName": "androidx.appcompat.widget.AppCompatImageView",
          "forceDark": true,
          "usage": 103,
          "conditions": [
            {
              "parent": 0,
              "viewName": "androidx.constraintlayout.widget.ConstraintLayout",
              "index": -1,
              "id": "cl_evaluate"
            },
            {
              "parent": 2,
              "viewName": "com.didapinche.booking.widget.AutoScrollView",
              "index": -1,
              "id": "sv_content"
            },
            {
              "parent": 3,
              "viewName": "androidx.constraintlayout.widget.ConstraintLayout",
              "index": -1,
              "id": "cl_container"
            }
          ]
        }
      ]
    },
    {
      "activityName": "com.didapinche.booking.passenger.activity.DailyWelfareActivity",
      "forceDark": true,
      "forceDarkViewConfigList": [
        {
          "viewName": "androidx.constraintlayout.widget.ConstraintLayout",
          "id": "cl_welfare_assets_model",
          "forceDark": false,
          "conditions": [
            {
              "parent": 0,
              "viewName": "android.widget.LinearLayout",
              "index": -1,
              "id": "ll_model_container"
            }
          ]
        },
        {
          "viewName": "android.widget.LinearLayout",
          "id": "ll_sign_and_bouns",
          "forceDark": false,
          "conditions": [
            {
              "parent": 0,
              "viewName": "android.widget.LinearLayout",
              "index": -1,
              "id": "ll_model_container"
            }
          ]
        }
      ]
    },
    {
      "activityName": "com.didapinche.booking.home.activity.StartActivity",
      "forceDark": true,
      "forceDarkViewConfigList": [
        {
          "viewName": "androidx.appcompat.widget.AppCompatTextView",
          "id": "tvTitle",
          "forceDark": false,
          "conditions": [
            {
              "parent": 0,
              "viewName": "androidx.constraintlayout.widget.ConstraintLayout",
              "index": -1
            },
            {
              "parent": 1,
              "viewName": "android.widget.FrameLayout",
              "index": -1,
              "id": "flContainer"
            },
            {
              "parent": 2,
              "viewName": "android.widget.FrameLayout",
              "index": -1,
              "id": "flBottom"
            }
          ]
        }
      ]
    },
    {
      "activityName": "com.didapinche.booking.login.activity.SelectLoginTypeActivity",
      "forceDark": true,
      "forceDarkViewConfigList": [
        {
          "viewName": "androidx.appcompat.widget.AppCompatTextView",
          "forceDark": false,
          "conditions": [
            {
              "parent": 0,
              "viewName": "androidx.constraintlayout.widget.ConstraintLayout",
              "index": -1
            },
            {
              "parent": 1,
              "viewName": "android.widget.FrameLayout",
              "index": -1,
              "id": "flContainer"
            },
            {
              "parent": 2,
              "viewName": "android.widget.FrameLayout",
              "index": -1,
              "id": "flBottom"
            }
          ]
        }
      ]
    },
    {
      "activityName": "com.didapinche.booking.passenger.activity.POrderDetailActivity",
      "forceDark": true,
      "forceDarkViewConfigList": [
        {
          "viewName": "android.widget.LinearLayout",
          "forceDark": false,
          "conditions": [
            {
              "parent": 0,
              "viewName": "android.widget.FrameLayout",
              "index": -1,
              "id": "flContainer"
            },
            {
              "parent": 1,
              "viewName": "android.widget.FrameLayout",
              "index": -1,
              "id": "flBottom"
            },
            {
              "parent": 3,
              "viewName": "androidx.appcompat.widget.ContentFrameLayout",
              "index": -1,
              "id": "content"
            }
          ]
        }
      ]
    }
  ],
  "forceDarkViewGlobalConfigList": [
    {
      "viewName": "androidx.appcompat.widget.AppCompatImageView",
      "id": "wb_iv_refresh",
      "forceDark": true,
      "usage": 103
    },
    {
      "viewName": "androidx.appcompat.widget.AppCompatImageView",
      "id": "wb_iv_goback",
      "forceDark": true,
      "usage": 103
    },
    {
      "viewName": "androidx.appcompat.widget.AppCompatImageView",
      "id": "wb_iv_share",
      "forceDark": true,
      "usage": 103
    }
  ]
}