<svg xmlns="http://www.w3.org/2000/svg" width="63.71" height="43.663" viewBox="0 0 63.71 43.663">
  <g id="Vc" transform="translate(1 -0.043)">
    <g id="Group_22" data-name="Group 22">
      <path id="Path_49" data-name="Path 49" d="M550.52,379.18a21.78,21.78,0,0,1,.61-5.14h-.25a5.26,5.26,0,0,0,0,10.52,2.582,2.582,0,0,0,.29,0,22.226,22.226,0,0,1-.65-5.38Z" transform="translate(-546.62 -357.35)" fill="#d0bfe4"/>
      <circle id="Ellipse_3" data-name="Ellipse 3" cx="4.09" cy="4.09" r="4.09" transform="translate(54.53 17.73)" fill="#d0bfe4"/>
      <circle id="Ellipse_4" data-name="Ellipse 4" cx="4.09" cy="4.09" r="4.09" transform="translate(44.53 17.73)" fill="#d0bfe4"/>
      <path id="Path_50" data-name="Path 50" d="M591.13,383.33h0a6.48,6.48,0,0,0-2.23-1.11,5.71,5.71,0,0,0-6.56,2.5h0a10.63,10.63,0,0,1-2.65,3l-.1.08a10.926,10.926,0,0,1-1,.65l-.16.1a10.632,10.632,0,0,1-2.35,1l-.33.09a9.394,9.394,0,0,1-.95.19l-.36.06a11.2,11.2,0,0,1-1.3.08A10.66,10.66,0,0,1,562.5,379.3a10.448,10.448,0,0,1,.48-3.17,11,11,0,0,1,.8-1.91,10.81,10.81,0,0,1,5.23-4.74,10.57,10.57,0,0,1,4.15-.83,10.689,10.689,0,0,1,1.27.08h.37a9.173,9.173,0,0,1,.91.19l.34.08c.36.11.71.22,1.05.36h.11a9.522,9.522,0,0,1,1.16.56l.07.05a9.5,9.5,0,0,1,1,.65l.13.09a10.789,10.789,0,0,1,2.61,2.86h0v-.05a10,10,0,0,0,1.52,1.71c1.3,1,3.64,2.19,6,1a7.886,7.886,0,0,0,1.33-1h0a5.28,5.28,0,0,1,3.17-1.24,21.83,21.83,0,1,0,0,10.47,5.169,5.169,0,0,1-3.07-1.13Z" transform="translate(-545.62 -357.35)" fill="#d0bfe4"/>
      <circle id="Ellipse_5" data-name="Ellipse 5" cx="8.84" cy="8.84" r="8.84" transform="translate(18.7 13.11)" fill="#d0bfe4"/>
      <path id="Path_51" data-name="Path 51" d="M588,378a3.677,3.677,0,0,0,3.251-1.628s-.017,5.541,0,5.594a4.127,4.127,0,0,0-3.367-1.286c-1.089,0-4.812.034-6.927,2.82,0,0-.7-9.463-.375-9.034C582.3,376.393,584,378,588,378Z" transform="translate(-545.62 -357.35)" fill="#d0bfe4"/>
    </g>
  </g>
</svg>
