<svg xmlns="http://www.w3.org/2000/svg" xmlns:xlink="http://www.w3.org/1999/xlink" width="961" height="348" viewBox="0 0 961 348">
  <defs>
    <clipPath id="clip-logo">
      <rect width="961" height="348"/>
    </clipPath>
  </defs>
  <g id="logo" clip-path="url(#clip-logo)">
    <rect width="961" height="348" fill="#fff"/>
    <g id="Group_1" data-name="Group 1" transform="translate(58.184 361.997)">
      <path id="Path_1" data-name="Path 1" d="M133.074-99.527a101.265,101.265,0,0,1-25.811,3.263A107.313,107.313,0,0,1,0-203.526,107.313,107.313,0,0,1,107.262-310.788,107.313,107.313,0,0,1,214.524-203.526a107.22,107.22,0,0,1-73.778,101.85l35.391-42.362Z" transform="translate(0 0)" fill="#f0856f" fill-rule="evenodd"/>
      <path id="Path_2" data-name="Path 2" d="M174.059-221.3a79.9,79.9,0,0,1,3.406,23.151,80.069,80.069,0,0,1-80.031,80.031A80.069,80.069,0,0,1,17.4-198.147a80.069,80.069,0,0,1,80.03-80.031,80.08,80.08,0,0,1,72.419,45.944L140.21-198.147Z" transform="translate(-2.87 -5.378)" fill="#fff" fill-rule="evenodd"/>
      <path id="Path_3" data-name="Path 3" d="M104.791-233.567a42.8,42.8,0,0,1,42.777,42.777,42.8,42.8,0,0,1-42.777,42.777A42.8,42.8,0,0,1,62.015-190.79,42.8,42.8,0,0,1,104.791-233.567Z" transform="translate(-10.228 -12.735)" fill="#f0856f" fill-rule="evenodd"/>
      <path id="Path_4" data-name="Path 4" d="M112.456-8.489l.055,0-.027.03Z" transform="translate(-18.546 -49.856)" fill="#383186" fill-rule="evenodd"/>
      <path id="Path_5" data-name="Path 5" d="M49.22-76.471a98.868,98.868,0,0,0,51.505,16.88,99.168,99.168,0,0,0,50.232-11.151s-52.071,52.63-52.7,56.033C97.932-14.715,49.22-76.471,49.22-76.471Z" transform="translate(-8.117 -38.644)" fill="#f0856f" fill-rule="evenodd"/>
      <path id="Path_6" data-name="Path 6" d="M84.33-91.7s13.366,3.362,14.46,6.721c2.024,6.222,6.962,1.663,10.064,2.439s9.533,3.8,3.52,13.571c-4.962,8.064-2.292,12.407,2.808,11.942s9.444-4.885,6.885-11.089-4.033-8.375-.853-13.725,10.295-8.976,11.383-9.519S84.33-91.7,84.33-91.7Z" transform="translate(-13.908 -36.127)" fill="#fff" fill-rule="evenodd"/>
    </g>
    <text id="Logo-2" data-name="Logo" transform="translate(344 246)" fill="#5e5e5e" font-size="209" font-family="ShowcardGothic-Reg, Showcard Gothic"><tspan x="0" y="0">Logo</tspan></text>
  </g>
</svg>
