
<svg width="25px" height="25px" viewBox="0 0 25 25" version="1.1" xmlns="http://www.w3.org/2000/svg" xmlns:xlink="http://www.w3.org/1999/xlink">
    <g id="Page-1" stroke="none" stroke-width="1" fill="none" fill-rule="evenodd">
        <g id="Campaign-Analysis---openup" transform="translate(-31.000000, -494.000000)">
            <rect fill="#FFFFFF" x="0" y="0" width="1440" height="2552"></rect>
            <g id="Group-7" transform="translate(0.000000, 464.000000)">
                <g id="Group-9" transform="translate(32.000000, 31.000000)">
                    <g id="Result">
                        <g>
                            <path d="M14.0112,17.6654694 C14.0500235,17.6654694 14.0817882,17.6935806 14.0817882,17.7293583 L14.0817882,18.8793583 C14.0817882,18.9144972 14.0500235,18.9432472 14.0112,18.9432472 L2.89637647,18.9432472 C2.85684706,18.9432472 2.82508235,18.9144972 2.82508235,18.8793583 L2.82508235,17.7293583 C2.82508235,17.6935806 2.85684706,17.6654694 2.89637647,17.6654694 L14.0112,17.6654694 Z M14.0112,15.1099139 C14.0500235,15.1099139 14.0817882,15.138025 14.0817882,15.1738028 L14.0817882,16.3238028 C14.0817882,16.3589417 14.0500235,16.3876917 14.0112,16.3876917 L2.89637647,16.3876917 C2.85684706,16.3876917 2.82508235,16.3589417 2.82508235,16.3238028 L2.82508235,15.1738028 C2.82508235,15.138025 2.85684706,15.1099139 2.89637647,15.1099139 L14.0112,15.1099139 Z" id="Shape" fill="#000000" fill-rule="nonzero"></path>
                            <path d="M16.2014118,-0.000255555556 C16.5903529,-0.000255555556 16.9072941,0.285966667 16.9072941,0.638633333 L16.9072941,22.1468278 C16.9072941,22.4994944 16.5903529,22.7857167 16.2014118,22.7857167 L0.705882353,22.7857167 C0.316235294,22.7857167 0,22.4994944 0,22.1468278 L0,0.638633333 C0,0.285966667 0.316235294,-0.000255555556 0.705882353,-0.000255555556 L16.2014118,-0.000255555556 Z" id="Path" stroke="#000000" fill-rule="nonzero"></path>
                            <path d="M22.5543529,1.91666667 C22.9432941,1.91666667 23.2602353,2.14940028 23.2602353,2.43616135 L23.2602353,19.9249498 C23.2602353,20.2117108 22.9432941,20.4444444 22.5543529,20.4444444 L16.9072941,20.4436667 L16.9072941,1.91666667 L22.5543529,1.91666667 Z" id="Combined-Shape" stroke="#000000" fill-rule="nonzero"></path>
                            <path d="M3.49531765,10.9390556 C3.10496471,10.9390556 2.78943529,10.6528333 2.78943529,10.3001667 C2.78943529,9.9475 3.10496471,9.66127778 3.49531765,9.66127778 L4.57814118,9.66127778 L6.36543529,2.98872222 C6.44449412,2.69547222 6.74731765,2.48527778 7.07202353,2.50061111 C7.40590588,2.50955556 7.68614118,2.72869444 7.74614118,3.02577778 L9.05908235,9.58780556 L9.46990588,7.37533333 C9.52425882,7.084 9.79249412,6.86422222 10.1186118,6.84441667 C10.4404941,6.82269444 10.7433176,7.00925 10.8400235,7.29163889 L11.6772,9.72261111 L13.4115529,9.72261111 C13.8019059,9.72261111 14.1174353,10.0081944 14.1174353,10.3615 C14.1174353,10.7141667 13.8019059,11.0003889 13.4115529,11.0003889 L11.1576706,11.0003889 C10.8492,11.0003889 10.5760235,10.8183056 10.4835529,10.5518889 L10.3720235,10.2260556 L9.78049412,13.4083611 C9.72331765,13.7143889 9.43178824,13.9392778 9.08872941,13.9411944 L9.08449412,13.9411944 C8.74355294,13.9411944 8.45131765,13.7207778 8.38990588,13.4160278 L6.95131765,6.22469444 L5.81908235,10.4509444 C5.74284706,10.7371667 5.45908235,10.9390556 5.13296471,10.9390556 L3.49531765,10.9390556 Z M20.9886353,15.0459611 C20.9886353,15.0811 20.9575765,15.10985 20.9180471,15.10985 L18.3189882,15.10985 L18.3189882,13.8320722 L20.9180471,13.8320722 C20.9575765,13.8320722 20.9886353,13.8608222 20.9886353,13.8959611 L20.9886353,15.0459611 Z M20.9886353,17.6015167 C20.9886353,17.6366556 20.9575765,17.6654056 20.9180471,17.6654056 L18.3189882,17.6654056 L18.3189882,16.3876278 L20.9180471,16.3876278 C20.9575765,16.3876278 20.9886353,16.4163778 20.9886353,16.4515167 L20.9886353,17.6015167 Z M20.9886353,9.93485 C20.9886353,9.96998889 20.9575765,9.99873889 20.9180471,9.99873889 L18.3189882,9.99873889 L18.3189882,8.72096111 L20.9180471,8.72096111 C20.9575765,8.72096111 20.9886353,8.74971111 20.9886353,8.78485 L20.9886353,9.93485 Z M20.9886353,12.4904056 C20.9886353,12.5255444 20.9575765,12.5542944 20.9180471,12.5542944 L18.3189882,12.5542944 L18.3189882,11.2765167 L20.9180471,11.2765167 C20.9575765,11.2765167 20.9886353,11.3052667 20.9886353,11.3404056 L20.9886353,12.4904056 Z" id="Shape" fill="#000000" fill-rule="nonzero"></path>
                        </g>
                    </g>
                </g>
            </g>
        </g>
    </g>
</svg>
