<svg width="94" height="94" viewBox="0 0 94 94" fill="none" xmlns="http://www.w3.org/2000/svg">
<path d="M64.6496 90.7187C62.074 93.2977 57.0819 94.6369 53.5583 93.7021L17.9608 84.1518C14.4372 83.2104 10.7843 79.5541 9.83959 76.0336L0.302941 40.4315C-0.641774 36.9111 0.6974 31.9188 3.28625 29.3398L29.3471 3.2813C31.926 0.702304 36.9181 -0.636919 40.4384 0.297885L76.0392 9.8382C79.5595 10.7796 83.2124 14.436 84.1571 17.9564L93.6971 53.5585C94.6418 57.079 93.3026 62.0712 90.7138 64.6502L64.6496 90.7187Z" fill="#E7F4FC"/>
<path d="M30.2471 77.8005V54.4844H57.8717V77.8005C57.8717 78.9137 56.9696 79.8158 55.8564 79.8158H32.2624C31.1496 79.8158 30.2471 78.9137 30.2471 77.8005Z" fill="#DBC5B8" stroke="#477CA8"/>
<path d="M36.8907 77.0063L35.5839 74.6654C35.4541 74.4325 35.1027 74.4325 34.9725 74.6654L33.6657 77.0063C33.5438 77.225 33.7104 77.4884 33.9714 77.4884H34.5764V78.294C34.5764 78.4753 34.7312 78.6223 34.9224 78.6223H35.6345C35.8257 78.6223 35.9805 78.4753 35.9805 78.294V77.4884H36.5855C36.846 77.4884 37.0131 77.225 36.8907 77.0063Z" fill="#BCAAA0"/>
<path d="M52.5216 77.0063L51.2147 74.6654C51.085 74.4325 50.7336 74.4325 50.6034 74.6654L49.2965 77.0063C49.1747 77.225 49.3413 77.4884 49.6022 77.4884H50.2072V78.294C50.2072 78.4753 50.362 78.6223 50.5532 78.6223H51.2654C51.4566 78.6223 51.6114 78.4753 51.6114 78.294V77.4884H52.2164C52.4768 77.4884 52.6435 77.225 52.5216 77.0063Z" fill="#BCAAA0"/>
<path d="M56.3248 48.4243C55.9419 47.3839 54.9506 46.6924 53.8419 46.6924H34.3285C33.2198 46.6924 32.2285 47.3839 31.8456 48.4243L29.7471 53.9843H58.3717L56.3248 48.4243Z" fill="#BCAAA0"/>
<path d="M56.5196 54.139C56.1009 49.4928 55.0167 46.4048 53.8041 46.4048H32.4629C31.2503 46.4048 31.356 46.5181 30.9373 51.1643L30.0449 54.139" stroke="#477CA8" stroke-linecap="round" stroke-linejoin="round"/>
<mask id="path-8-inside-1" fill="white">
<path fill-rule="evenodd" clip-rule="evenodd" d="M41.9741 46.6929H47.0839L47.6673 53.9848H41.375L41.9741 46.6929ZM41.3946 59.0175V53.9848H47.6825V59.0175H47.4495C47.4038 58.813 47.222 58.6597 47.0038 58.6597C46.7855 58.6597 46.6037 58.813 46.558 59.0175H46.2169C46.1712 58.813 45.9894 58.6597 45.7712 58.6597C45.5529 58.6597 45.3711 58.813 45.3254 59.0175H44.9843C44.9386 58.813 44.7568 58.6597 44.5385 58.6597C44.3203 58.6597 44.1385 58.813 44.0928 59.0175H43.7517C43.706 58.813 43.5242 58.6597 43.3059 58.6597C43.0877 58.6597 42.9059 58.813 42.8602 59.0175H42.5191C42.4734 58.813 42.2915 58.6597 42.0733 58.6597C41.8551 58.6597 41.6733 58.813 41.6276 59.0175H41.3946Z"/>
</mask>
<path fill-rule="evenodd" clip-rule="evenodd" d="M41.9741 46.6929H47.0839L47.6673 53.9848H41.375L41.9741 46.6929ZM41.3946 59.0175V53.9848H47.6825V59.0175H47.4495C47.4038 58.813 47.222 58.6597 47.0038 58.6597C46.7855 58.6597 46.6037 58.813 46.558 59.0175H46.2169C46.1712 58.813 45.9894 58.6597 45.7712 58.6597C45.5529 58.6597 45.3711 58.813 45.3254 59.0175H44.9843C44.9386 58.813 44.7568 58.6597 44.5385 58.6597C44.3203 58.6597 44.1385 58.813 44.0928 59.0175H43.7517C43.706 58.813 43.5242 58.6597 43.3059 58.6597C43.0877 58.6597 42.9059 58.813 42.8602 59.0175H42.5191C42.4734 58.813 42.2915 58.6597 42.0733 58.6597C41.8551 58.6597 41.6733 58.813 41.6276 59.0175H41.3946Z" fill="#FDF4BB"/>
<path d="M47.0839 46.6929L48.0807 46.6131L48.0071 45.6929H47.0839V46.6929ZM41.9741 46.6929V45.6929H41.0529L40.9775 46.611L41.9741 46.6929ZM47.6673 53.9848V54.9848H48.7505L48.6641 53.9051L47.6673 53.9848ZM41.375 53.9848L40.3784 53.9029L40.2895 54.9848H41.375V53.9848ZM41.3946 53.9848V52.9848H40.3946V53.9848H41.3946ZM41.3946 59.0175H40.3946V60.0175H41.3946V59.0175ZM47.6825 53.9848H48.6825V52.9848H47.6825V53.9848ZM47.6825 59.0175V60.0175H48.6825V59.0175H47.6825ZM47.4495 59.0175L46.4736 59.2356L46.6484 60.0175H47.4495V59.0175ZM46.558 59.0175V60.0175H47.3591L47.5339 59.2356L46.558 59.0175ZM46.2169 59.0175L45.241 59.2356L45.4158 60.0175H46.2169V59.0175ZM45.3254 59.0175V60.0175H46.1265L46.3013 59.2356L45.3254 59.0175ZM44.9843 59.0175L44.0084 59.2356L44.1832 60.0175H44.9843V59.0175ZM44.0928 59.0175V60.0175H44.8939L45.0687 59.2356L44.0928 59.0175ZM43.7517 59.0175L42.7758 59.2356L42.9506 60.0175H43.7517V59.0175ZM42.8602 59.0175V60.0175H43.6613L43.8361 59.2356L42.8602 59.0175ZM42.5191 59.0175L41.5432 59.2356L41.718 60.0175H42.5191V59.0175ZM41.6276 59.0175V60.0175H42.4287L42.6035 59.2356L41.6276 59.0175ZM47.0839 45.6929H41.9741V47.6929H47.0839V45.6929ZM48.6641 53.9051L48.0807 46.6131L46.0871 46.7726L46.6705 54.0645L48.6641 53.9051ZM41.375 54.9848H47.6673V52.9848H41.375V54.9848ZM40.9775 46.611L40.3784 53.9029L42.3716 54.0667L42.9707 46.7748L40.9775 46.611ZM40.3946 53.9848V59.0175H42.3946V53.9848H40.3946ZM47.6825 52.9848H41.3946V54.9848H47.6825V52.9848ZM48.6825 59.0175V53.9848H46.6825V59.0175H48.6825ZM47.4495 60.0175H47.6825V58.0175H47.4495V60.0175ZM47.0038 59.6597C46.7401 59.6597 46.527 59.4746 46.4736 59.2356L48.4254 58.7993C48.2806 58.1514 47.7039 57.6597 47.0038 57.6597V59.6597ZM47.5339 59.2356C47.4805 59.4747 47.2674 59.6597 47.0038 59.6597V57.6597C46.3037 57.6597 45.7269 58.1514 45.5821 58.7993L47.5339 59.2356ZM46.2169 60.0175H46.558V58.0175H46.2169V60.0175ZM45.7712 59.6597C45.5075 59.6597 45.2944 59.4747 45.241 59.2356L47.1928 58.7993C47.048 58.1514 46.4713 57.6597 45.7712 57.6597V59.6597ZM46.3013 59.2356C46.2479 59.4746 46.0348 59.6597 45.7712 59.6597V57.6597C45.071 57.6597 44.4943 58.1514 44.3495 58.7993L46.3013 59.2356ZM44.9843 60.0175H45.3254V58.0175H44.9843V60.0175ZM44.5385 59.6597C44.2749 59.6597 44.0618 59.4747 44.0084 59.2356L45.9602 58.7993C45.8154 58.1514 45.2387 57.6597 44.5385 57.6597V59.6597ZM45.0687 59.2356C45.0153 59.4746 44.8022 59.6597 44.5385 59.6597V57.6597C43.8384 57.6597 43.2617 58.1514 43.1169 58.7993L45.0687 59.2356ZM43.7517 60.0175H44.0928V58.0175H43.7517V60.0175ZM43.3059 59.6597C43.0423 59.6597 42.8292 59.4747 42.7758 59.2356L44.7276 58.7993C44.5828 58.1514 44.006 57.6597 43.3059 57.6597V59.6597ZM43.8361 59.2356C43.7827 59.4746 43.5696 59.6597 43.3059 59.6597V57.6597C42.6058 57.6597 42.0291 58.1514 41.8843 58.7993L43.8361 59.2356ZM42.5191 60.0175H42.8602V58.0175H42.5191V60.0175ZM42.0733 59.6597C41.8097 59.6597 41.5966 59.4746 41.5432 59.2356L43.495 58.7993C43.3502 58.1514 42.7734 57.6597 42.0733 57.6597V59.6597ZM42.6035 59.2356C42.55 59.4746 42.337 59.6597 42.0733 59.6597V57.6597C41.3732 57.6597 40.7965 58.1514 40.6517 58.7993L42.6035 59.2356ZM41.3946 60.0175H41.6276V58.0175H41.3946V60.0175Z" fill="#477CA8" mask="url(#path-8-inside-1)"/>
<path d="M47.0017 76.3694C47.0621 76.3694 47.1215 76.3638 47.1794 76.3531V79.8079H41.8936V76.353C41.9518 76.3638 42.0116 76.3694 42.0723 76.3694C42.3026 76.3694 42.5196 76.2885 42.6886 76.1497C42.8576 76.2885 43.0745 76.3694 43.3049 76.3694C43.535 76.3694 43.7518 76.2886 43.9207 76.1501C44.0896 76.2886 44.3064 76.3694 44.5365 76.3694C44.7669 76.3694 44.9838 76.2885 45.1528 76.1497C45.3218 76.2885 45.5387 76.3694 45.7691 76.3694C45.9995 76.3694 46.2164 76.2885 46.3854 76.1497C46.5544 76.2885 46.7713 76.3694 47.0017 76.3694Z" fill="#FDF4BB" stroke="#477CA8"/>
<path d="M36.7935 56.501H32.6725C32.5354 56.501 32.4248 56.612 32.4248 56.7487C32.4248 56.8853 32.5359 56.9964 32.6725 56.9964H36.794C36.9311 56.9964 37.0417 56.8853 37.0417 56.7487C37.0417 56.612 36.9306 56.501 36.7935 56.501Z" fill="#BCAAA0"/>
<path d="M36.7935 57.8145H32.6725C32.5354 57.8145 32.4248 57.9255 32.4248 58.0622C32.4248 58.1988 32.5359 58.3099 32.6725 58.3099H36.794C36.9311 58.3099 37.0417 58.1988 37.0417 58.0622C37.0417 57.925 36.9306 57.8145 36.7935 57.8145Z" fill="#BCAAA0"/>
<path d="M36.7935 59.1279H32.6725C32.5354 59.1279 32.4248 59.239 32.4248 59.3756C32.4248 59.5123 32.5359 59.6233 32.6725 59.6233H36.794C36.9311 59.6233 37.0417 59.5123 37.0417 59.3756C37.0417 59.239 36.9306 59.1279 36.7935 59.1279Z" fill="#BCAAA0"/>
<path d="M36.7935 60.4419H32.6725C32.5354 60.4419 32.4248 60.553 32.4248 60.6896C32.4248 60.8262 32.5359 60.9373 32.6725 60.9373H36.794C36.9311 60.9373 37.0417 60.8262 37.0417 60.6896C37.0417 60.553 36.9306 60.4419 36.7935 60.4419Z" fill="#BCAAA0"/>
<path d="M37.0681 66.07L36.4645 65.178L36.639 65.0704C36.8051 64.9681 36.7904 64.7219 36.613 64.6403L35.7819 64.2575C35.748 64.2417 35.7136 64.2349 35.6797 64.2349C35.5539 64.2349 35.4403 64.3336 35.4354 64.4713L35.4035 65.3854C35.3986 65.5323 35.518 65.639 35.6482 65.639C35.691 65.639 35.7347 65.6277 35.776 65.6021L36.009 65.4586L36.6228 66.3664H35.5642C35.5976 66.4322 35.6187 66.5045 35.6212 66.5806C35.6246 66.6981 35.5858 66.8092 35.5175 66.9006H36.6228C36.8199 66.9006 37.0007 66.792 37.0936 66.6185C37.1875 66.4445 37.1772 66.2337 37.0681 66.07Z" fill="#BCAAA0"/>
<path d="M35.1663 63.211C35.0671 63.0621 34.9005 62.9727 34.7216 62.9727C34.5427 62.9727 34.3756 63.0621 34.2768 63.211L33.6575 64.131L33.4634 64.0023C33.4206 63.9743 33.3744 63.961 33.3292 63.961C33.2019 63.961 33.084 64.0622 33.084 64.2062L33.086 65.1213C33.086 65.2619 33.2014 65.3656 33.3302 65.3656C33.3617 65.3656 33.3936 65.3597 33.4256 65.3459L34.2684 64.9906C34.4483 64.9149 34.4709 64.6692 34.3082 64.5616L34.1033 64.4259L34.7221 63.5069L35.2209 64.2569C35.302 64.0878 35.472 63.9723 35.6711 63.9689L35.1663 63.211Z" fill="#BCAAA0"/>
<path d="M35.2393 66.3877L34.4628 65.9041C34.4215 65.8786 34.3773 65.8668 34.334 65.8668C34.2043 65.8668 34.0848 65.9724 34.0893 66.1189L34.0966 66.3651H32.8203L33.3103 65.6284C33.1127 65.6205 32.9441 65.5021 32.8665 65.3311L32.3755 66.0692C32.2664 66.2334 32.2566 66.4442 32.3495 66.6177C32.4423 66.7912 32.6237 66.8998 32.8203 66.8998H34.1124L34.1192 67.1318C34.1237 67.2729 34.2401 67.3692 34.3645 67.3692C34.4122 67.3692 34.4608 67.3549 34.505 67.3235L35.2511 66.7942C35.3941 66.6934 35.3877 66.4801 35.2393 66.3877Z" fill="#BCAAA0"/>
<path d="M30.2471 50.5349V27.2188H57.8717V50.5349C57.8717 51.6477 56.9696 52.5502 55.8564 52.5502H32.2624C31.1496 52.5502 30.2471 51.648 30.2471 50.5349Z" fill="#DBC5B8" stroke="#477CA8"/>
<path d="M36.8907 49.7412L35.5839 47.4003C35.4541 47.1673 35.1027 47.1673 34.9725 47.4003L33.6657 49.7412C33.5438 49.9599 33.7104 50.2233 33.9714 50.2233H34.5764V51.0288C34.5764 51.2102 34.7312 51.3571 34.9224 51.3571H35.6345C35.8257 51.3571 35.9805 51.2102 35.9805 51.0288V50.2233H36.5855C36.846 50.2233 37.0131 49.9599 36.8907 49.7412Z" fill="#BCAAA0"/>
<path d="M52.5216 49.7407L51.2147 47.3998C51.085 47.1669 50.7336 47.1669 50.6034 47.3998L49.2965 49.7407C49.1747 49.9594 49.3413 50.2228 49.6022 50.2228H50.2072V51.0283C50.2072 51.2097 50.362 51.3566 50.5532 51.3566H51.2654C51.4566 51.3566 51.6114 51.2097 51.6114 51.0283V50.2228H52.2164C52.4768 50.2228 52.6435 49.9594 52.5216 49.7407Z" fill="#BCAAA0"/>
<path d="M56.3248 24.4913C55.9419 24.0741 54.9506 23.7974 53.8419 23.7974H34.3285C33.2198 23.7974 32.2285 24.0741 31.8456 24.4913L29.7471 26.7192H58.3717L56.3248 24.4913Z" fill="#BCAAA0"/>
<path d="M57.9981 26.7462L56.3243 24.4913C55.9414 24.0741 54.9501 23.7974 53.8414 23.7974H34.328C33.2193 23.7974 32.228 24.0741 31.8451 24.4913L29.9844 26.7462" stroke="#477CA8" stroke-linecap="round" stroke-linejoin="round"/>
<mask id="path-23-inside-2" fill="white">
<path fill-rule="evenodd" clip-rule="evenodd" d="M41.974 23.7974H47.0838L47.6672 26.7186H47.6824V31.7512H47.4494C47.4037 31.5468 47.2219 31.3934 47.0037 31.3934C46.7855 31.3934 46.6036 31.5468 46.5579 31.7512H46.2168C46.1711 31.5468 45.9893 31.3934 45.7711 31.3934C45.5529 31.3934 45.371 31.5468 45.3253 31.7512H44.9842C44.9385 31.5468 44.7567 31.3934 44.5385 31.3934C44.3202 31.3934 44.1384 31.5468 44.0927 31.7512H43.7516C43.7059 31.5468 43.5241 31.3934 43.3059 31.3934C43.0876 31.3934 42.9058 31.5468 42.8601 31.7512H42.519C42.4733 31.5468 42.2915 31.3934 42.0733 31.3934C41.855 31.3934 41.6732 31.5468 41.6275 31.7512H41.3945V26.7186H41.3946L41.974 23.7974Z"/>
</mask>
<path fill-rule="evenodd" clip-rule="evenodd" d="M41.974 23.7974H47.0838L47.6672 26.7186H47.6824V31.7512H47.4494C47.4037 31.5468 47.2219 31.3934 47.0037 31.3934C46.7855 31.3934 46.6036 31.5468 46.5579 31.7512H46.2168C46.1711 31.5468 45.9893 31.3934 45.7711 31.3934C45.5529 31.3934 45.371 31.5468 45.3253 31.7512H44.9842C44.9385 31.5468 44.7567 31.3934 44.5385 31.3934C44.3202 31.3934 44.1384 31.5468 44.0927 31.7512H43.7516C43.7059 31.5468 43.5241 31.3934 43.3059 31.3934C43.0876 31.3934 42.9058 31.5468 42.8601 31.7512H42.519C42.4733 31.5468 42.2915 31.3934 42.0733 31.3934C41.855 31.3934 41.6732 31.5468 41.6275 31.7512H41.3945V26.7186H41.3946L41.974 23.7974Z" fill="#FDF4BB"/>
<path d="M47.0838 23.7974L48.0644 23.6015L47.9038 22.7974H47.0838V23.7974ZM41.974 23.7974V22.7974H41.1529L40.9931 23.6028L41.974 23.7974ZM47.6672 26.7186L46.6865 26.9144L46.8471 27.7186H47.6672V26.7186ZM47.6824 26.7186H48.6824V25.7186H47.6824V26.7186ZM47.6824 31.7512V32.7512H48.6824V31.7512H47.6824ZM47.4494 31.7512L46.4735 31.9694L46.6483 32.7512H47.4494V31.7512ZM46.5579 31.7512V32.7512H47.359L47.5338 31.9694L46.5579 31.7512ZM46.2168 31.7512L45.2409 31.9694L45.4157 32.7512H46.2168V31.7512ZM45.3253 31.7512V32.7512H46.1264L46.3012 31.9694L45.3253 31.7512ZM44.9842 31.7512L44.0083 31.9694L44.1831 32.7512H44.9842V31.7512ZM44.0927 31.7512V32.7512H44.8938L45.0686 31.9694L44.0927 31.7512ZM43.7516 31.7512L42.7757 31.9694L42.9505 32.7512H43.7516V31.7512ZM42.8601 31.7512V32.7512H43.6612L43.836 31.9694L42.8601 31.7512ZM42.519 31.7512L41.5431 31.9694L41.7179 32.7512H42.519V31.7512ZM41.6275 31.7512V32.7512H42.4286L42.6034 31.9694L41.6275 31.7512ZM41.3945 31.7512H40.3945V32.7512H41.3945V31.7512ZM41.3945 26.7186V25.7186H40.3945V26.7186H41.3945ZM41.3946 26.7186V27.7186H42.2157L42.3755 26.9131L41.3946 26.7186ZM47.0838 22.7974H41.974V24.7974H47.0838V22.7974ZM48.6478 26.5227L48.0644 23.6015L46.1032 23.9932L46.6865 26.9144L48.6478 26.5227ZM47.6824 25.7186H47.6672V27.7186H47.6824V25.7186ZM48.6824 31.7512V26.7186H46.6824V31.7512H48.6824ZM47.4494 32.7512H47.6824V30.7512H47.4494V32.7512ZM47.0037 32.3934C46.74 32.3934 46.527 32.2084 46.4735 31.9694L48.4253 31.5331C48.2805 30.8851 47.7038 30.3934 47.0037 30.3934V32.3934ZM47.5338 31.9694C47.4804 32.2084 47.2673 32.3934 47.0037 32.3934V30.3934C46.3036 30.3934 45.7268 30.8851 45.582 31.5331L47.5338 31.9694ZM46.2168 32.7512H46.5579V30.7512H46.2168V32.7512ZM45.7711 32.3934C45.5074 32.3934 45.2944 32.2084 45.2409 31.9694L47.1927 31.5331C47.0479 30.8851 46.4712 30.3934 45.7711 30.3934V32.3934ZM46.3012 31.9694C46.2478 32.2084 46.0347 32.3934 45.7711 32.3934V30.3934C45.071 30.3934 44.4942 30.8851 44.3494 31.5331L46.3012 31.9694ZM44.9842 32.7512H45.3253V30.7512H44.9842V32.7512ZM44.5385 32.3934C44.2748 32.3934 44.0617 32.2084 44.0083 31.9694L45.9601 31.5331C45.8153 30.8851 45.2386 30.3934 44.5385 30.3934V32.3934ZM45.0686 31.9694C45.0152 32.2084 44.8021 32.3934 44.5385 32.3934V30.3934C43.8384 30.3934 43.2616 30.8851 43.1168 31.5331L45.0686 31.9694ZM43.7516 32.7512H44.0927V30.7512H43.7516V32.7512ZM43.3059 32.3934C43.0422 32.3934 42.8291 32.2084 42.7757 31.9694L44.7275 31.5331C44.5827 30.8851 44.0059 30.3934 43.3059 30.3934V32.3934ZM43.836 31.9694C43.7826 32.2084 43.5695 32.3934 43.3059 32.3934V30.3934C42.6058 30.3934 42.029 30.8851 41.8842 31.5331L43.836 31.9694ZM42.519 32.7512H42.8601V30.7512H42.519V32.7512ZM42.0733 32.3934C41.8096 32.3934 41.5965 32.2084 41.5431 31.9694L43.4949 31.5331C43.3501 30.8851 42.7733 30.3934 42.0733 30.3934V32.3934ZM42.6034 31.9694C42.55 32.2084 42.3369 32.3934 42.0733 32.3934V30.3934C41.3732 30.3934 40.7964 30.8851 40.6516 31.5331L42.6034 31.9694ZM41.3945 32.7512H41.6275V30.7512H41.3945V32.7512ZM40.3945 26.7186V31.7512H42.3945V26.7186H40.3945ZM41.3946 25.7186H41.3945V27.7186H41.3946V25.7186ZM40.9931 23.6028L40.4137 26.524L42.3755 26.9131L42.9549 23.9919L40.9931 23.6028Z" fill="#477CA8" mask="url(#path-23-inside-2)"/>
<path d="M46.9218 49.1038C46.9768 49.1038 47.0307 49.0991 47.0833 49.0902V52.5422H41.9355V49.0897C41.9889 49.099 42.0437 49.1038 42.0995 49.1038C42.3263 49.1038 42.5374 49.0244 42.7025 48.8899C42.8674 49.0243 43.0783 49.1038 43.3051 49.1038C43.5323 49.1038 43.7431 49.0243 43.9079 48.8899C44.0727 49.0243 44.2835 49.1038 44.5107 49.1038C44.7375 49.1038 44.9486 49.0244 45.1136 48.8899C45.2786 49.0243 45.4894 49.1038 45.7162 49.1038C45.9435 49.1038 46.1543 49.0242 46.3191 48.8898C46.484 49.0243 46.6949 49.1038 46.9218 49.1038Z" fill="#FDF4BB" stroke="#477CA8"/>
<path d="M36.7935 29.2349H32.6725C32.5354 29.2349 32.4248 29.3459 32.4248 29.4826C32.4248 29.6192 32.5359 29.7303 32.6725 29.7303H36.794C36.9311 29.7303 37.0417 29.6192 37.0417 29.4826C37.0417 29.3459 36.9306 29.2349 36.7935 29.2349Z" fill="#BCAAA0"/>
<path d="M36.7935 30.5479H32.6725C32.5354 30.5479 32.4248 30.6589 32.4248 30.7956C32.4248 30.9327 32.5359 31.0433 32.6725 31.0433H36.794C36.9311 31.0433 37.0417 30.9322 37.0417 30.7956C37.0417 30.6589 36.9306 30.5479 36.7935 30.5479Z" fill="#BCAAA0"/>
<path d="M36.7935 31.8623H32.6725C32.5354 31.8623 32.4248 31.9734 32.4248 32.11C32.4248 32.2466 32.5359 32.3577 32.6725 32.3577H36.794C36.9311 32.3577 37.0417 32.2466 37.0417 32.11C37.0417 31.9734 36.9306 31.8623 36.7935 31.8623Z" fill="#BCAAA0"/>
<path d="M36.7935 33.1758H32.6725C32.5354 33.1758 32.4248 33.2869 32.4248 33.4235C32.4248 33.5601 32.5359 33.6712 32.6725 33.6712H36.794C36.9311 33.6712 37.0417 33.5601 37.0417 33.4235C37.0417 33.2869 36.9306 33.1758 36.7935 33.1758Z" fill="#BCAAA0"/>
<path d="M37.0681 38.8039L36.4645 37.9119L36.639 37.8042C36.8051 37.702 36.7904 37.4558 36.613 37.3742L35.7819 36.9914C35.748 36.9756 35.7136 36.9688 35.6797 36.9688C35.5539 36.9688 35.4403 37.0675 35.4354 37.2051L35.4035 38.1193C35.3986 38.2662 35.518 38.3724 35.6482 38.3724C35.691 38.3724 35.7347 38.3611 35.776 38.3355L36.009 38.192L36.6228 39.0998H35.5642C35.5976 39.1656 35.6187 39.2379 35.6212 39.314C35.6246 39.4315 35.5858 39.5426 35.5175 39.634H36.6228C36.8199 39.634 37.0007 39.5259 37.0936 39.3519C37.1875 39.1784 37.1772 38.9676 37.0681 38.8039Z" fill="#BCAAA0"/>
<path d="M35.1663 35.9444C35.0671 35.7955 34.9005 35.7061 34.7216 35.7061C34.5427 35.7061 34.3756 35.7955 34.2768 35.9444L33.6575 36.8644L33.4634 36.7357C33.4206 36.7072 33.3744 36.6944 33.3292 36.6944C33.2019 36.6944 33.084 36.7956 33.084 36.9396L33.086 37.8543C33.086 37.9948 33.2014 38.0985 33.3302 38.0985C33.3617 38.0985 33.3936 38.0926 33.4256 38.0789L34.2684 37.7235C34.4483 37.6479 34.4709 37.4021 34.3082 37.2945L34.1033 37.1588L34.7221 36.2398L35.2209 36.9898C35.302 36.8207 35.472 36.7052 35.6711 36.7018L35.1663 35.9444Z" fill="#BCAAA0"/>
<path d="M35.2393 39.1216L34.4628 38.638C34.4215 38.6124 34.3773 38.6006 34.334 38.6006C34.2043 38.6006 34.0848 38.7063 34.0893 38.8528L34.0966 39.099H32.8203L33.3103 38.3623C33.1127 38.3544 32.9441 38.236 32.8665 38.0649L32.3755 38.8031C32.2664 38.9673 32.2566 39.1776 32.3495 39.3516C32.4423 39.5251 32.6237 39.6337 32.8203 39.6337H34.1124L34.1192 39.8657C34.1237 40.0067 34.2401 40.1031 34.3645 40.1031C34.4122 40.1031 34.4608 40.0888 34.505 40.0574L35.2511 39.528C35.3941 39.4273 35.3877 39.214 35.2393 39.1216Z" fill="#BCAAA0"/>
<path d="M54.0116 31.1777H78.2484C79.732 31.1777 80.8874 32.3099 80.8879 33.6506C80.8879 33.6507 80.8879 33.6507 80.8879 33.6508V71.1684C80.8879 72.5084 79.7323 73.6408 78.2484 73.6408H54.0116C52.5277 73.6408 51.3721 72.5084 51.3721 71.1684V33.6501C51.3721 32.3102 52.5277 31.1777 54.0116 31.1777Z" fill="#B0D9EF" stroke="#477CA8"/>
<path d="M54.3223 69.111V34.2534H77.765V69.111H54.3223Z" fill="white" stroke="#477CA8"/>
<path d="M75.446 41.9814H61.1934V42.9644H75.446V41.9814Z" fill="#B0D9EF"/>
<path d="M75.446 47.3877H61.1934V48.3706H75.446V47.3877Z" fill="#B0D9EF"/>
<path d="M75.446 52.7939H61.1934V53.7769H75.446V52.7939Z" fill="#B0D9EF"/>
<path d="M75.446 57.7085H61.1934V58.6914H75.446V57.7085Z" fill="#B0D9EF"/>
<path d="M75.446 63.1147H61.1934V64.0977H75.446V63.1147Z" fill="#B0D9EF"/>
<path d="M58.116 41.2861H56.7104C56.3806 41.2861 56.1133 41.5535 56.1133 41.8833V43.2889C56.1133 43.6186 56.3806 43.886 56.7104 43.886H58.116C58.4458 43.886 58.7132 43.6186 58.7132 43.2889V41.8833C58.7132 41.5535 58.4458 41.2861 58.116 41.2861Z" fill="#F5B1AE"/>
<path d="M58.116 46.5664H56.7104C56.3806 46.5664 56.1133 46.8338 56.1133 47.1635V48.5691C56.1133 48.8989 56.3806 49.1663 56.7104 49.1663H58.116C58.4458 49.1663 58.7132 48.8989 58.7132 48.5691V47.1635C58.7132 46.8333 58.4458 46.5664 58.116 46.5664Z" fill="#F5B1AE"/>
<path d="M56.7104 52.3462H58.116C58.1697 52.3462 58.2132 52.3897 58.2132 52.4433V53.8489C58.2132 53.9026 58.1697 53.9461 58.116 53.9461H56.7104C56.6568 53.9461 56.6133 53.9026 56.6133 53.8489V52.4433C56.6133 52.3897 56.6568 52.3462 56.7104 52.3462Z" fill="white" stroke="#477CA8"/>
<path d="M56.7104 57.6265H58.116C58.1697 57.6265 58.2132 57.67 58.2132 57.7236V59.1292C58.2132 59.1828 58.1697 59.2263 58.116 59.2263H56.7104C56.6568 59.2263 56.6133 59.1828 56.6133 59.1292V57.7236C56.6133 57.67 56.6568 57.6265 56.7104 57.6265Z" fill="white" stroke="#477CA8"/>
<path d="M56.7104 62.9072H58.116C58.1699 62.9072 58.2132 62.9505 58.2132 63.0044V64.41C58.2132 64.4636 58.1697 64.5071 58.116 64.5071H56.7104C56.6568 64.5071 56.6133 64.4636 56.6133 64.41V63.0044C56.6133 62.9507 56.6568 62.9072 56.7104 62.9072Z" fill="white" stroke="#477CA8"/>
<path d="M70.2176 30.4912H62.0268C61.5742 30.4912 61.207 30.8583 61.207 31.311V35.4329C61.207 35.8856 61.5742 36.2527 62.0268 36.2527H70.2176C70.6703 36.2527 71.0374 35.8856 71.0374 35.4329V31.311C71.0374 30.8578 70.6703 30.4912 70.2176 30.4912Z" fill="#BCAAA0"/>
<path d="M70.2176 29.6538H62.0268C61.5742 29.6538 61.207 30.0209 61.207 30.4736V34.5955C61.207 35.0482 61.5742 35.4153 62.0268 35.4153H70.2176C70.6703 35.4153 71.0374 35.0482 71.0374 34.5955V30.4736C71.0374 30.0209 70.6703 29.6538 70.2176 29.6538Z" fill="#E05858"/>
<path d="M70.2176 29.6538H62.0268C61.5742 29.6538 61.207 30.0209 61.207 30.4736V31.6679H71.0374V30.4736C71.0374 30.0209 70.6703 29.6538 70.2176 29.6538Z" fill="#F5B1AE"/>
<path d="M16.6584 39.2657H16.0635V38.3973H16.6584V39.2657ZM16.6584 37.5419H16.0635V36.6736H16.6584V37.5419ZM16.6584 35.8204H16.0635V34.952H16.6584V35.8204ZM16.6584 34.0967H16.0635V33.2283H16.6584V34.0967ZM16.6584 32.3751H16.0635V31.5068H16.6584V32.3751ZM16.6584 30.6514H16.0635V29.7831H16.6584V30.6514ZM16.6584 28.9277H16.0635V28.0594H16.6584V28.9277ZM16.6584 27.2062H16.0635V26.3378H16.6584V27.2062ZM16.6584 25.4825H16.0635V24.6141H16.6584V25.4825ZM16.6584 23.7609H16.0635V22.8926H16.6584V23.7609ZM16.6584 22.0372H16.0635V21.1688H16.6584V22.0372ZM16.6584 20.3157H16.0635V19.4473H16.6584V20.3157ZM16.6584 18.592H16.0635V17.7236H16.6584V18.592ZM16.6584 16.8704H16.0635V16.002H16.6584V16.8704ZM16.6584 15.1467H16.0635V14.2783H16.6584V15.1467Z" fill="#477CA8"/>
<path d="M16.6584 60.0884H16.0635V59.22H16.6584V60.0884ZM16.6584 58.3647H16.0635V57.4963H16.6584V58.3647ZM16.6584 56.6432H16.0635V55.7748H16.6584V56.6432ZM16.6584 54.9194H16.0635V54.0511H16.6584V54.9194ZM16.6584 53.1979H16.0635V52.3295H16.6584V53.1979ZM16.6584 51.4742H16.0635V50.6058H16.6584V51.4742ZM16.6584 49.7505H16.0635V48.8821H16.6584V49.7505ZM16.6584 48.0289H16.0635V47.1606H16.6584V48.0289ZM16.6584 46.3052H16.0635V45.4368H16.6584V46.3052ZM16.6584 44.5837H16.0635V43.7153H16.6584V44.5837ZM16.6584 42.86H16.0635V41.9916H16.6584V42.86ZM16.6584 41.1384H16.0635V40.2701H16.6584V41.1384ZM16.6584 39.4147H16.0635V38.5463H16.6584V39.4147ZM16.6584 37.6932H16.0635V36.8248H16.6584V37.6932ZM16.6584 35.9694H16.0635V35.1011H16.6584V35.9694Z" fill="#477CA8"/>
<path d="M16.4601 13.6833H16.0635V13.0884H16.6584V13.485H16.4601V13.6833Z" fill="#477CA8"/>
<path d="M66.0377 13.6833H65.2097V13.0884H66.0377V13.6833ZM64.3838 13.6833H63.5578V13.0884H64.3859L64.3838 13.6833ZM62.7298 13.6833H61.9039V13.0884H62.7298V13.6833ZM61.0758 13.6833H60.2499V13.0884H61.0758V13.6833ZM59.4219 13.6833H58.5959V13.0884H59.4219V13.6833ZM57.7679 13.6833H56.9419V13.0884H57.7679V13.6833ZM56.116 13.6833H55.288V13.0884H56.116V13.6833ZM54.462 13.6833H53.634V13.0884H54.462V13.6833ZM52.8081 13.6833H51.9863V13.0884H52.8144L52.8081 13.6833ZM51.1541 13.6833H50.3261V13.0884H51.1457L51.1541 13.6833ZM49.5001 13.6833H48.6742V13.0884H49.5001V13.6833ZM47.8462 13.6833H47.0202V13.0884H47.8462V13.6833ZM46.1922 13.6833H45.3662V13.0884H46.1922V13.6833ZM44.5382 13.6833H43.7123V13.0884H44.5382V13.6833ZM42.8863 13.6833H42.0583V13.0884H42.8863V13.6833ZM41.2324 13.6833H40.4043V13.0884H41.2324V13.6833ZM39.5784 13.6833H38.7462V13.0884H39.5868L39.5784 13.6833ZM37.9244 13.6833H37.0964V13.0884H37.9244V13.6833ZM36.2704 13.6833H35.4445V13.0884H36.2704V13.6833ZM34.6165 13.6833H33.7905V13.0884H34.6165V13.6833ZM32.9625 13.6833H32.1366V13.0884H32.9625V13.6833ZM31.3085 13.6833H30.4826V13.0884H31.3085V13.6833ZM29.6546 13.6833H28.8286V13.0884H29.6546V13.6833ZM28.0027 13.6833H27.1747V13.0884H28.0027V13.6833ZM26.3487 13.6833H25.5207V13.0884H26.3466L26.3487 13.6833ZM24.6948 13.6833H23.8667V13.0884H24.6948V13.6833ZM23.0408 13.6833H22.2128V13.0884H23.0408V13.6833ZM21.3868 13.6833H20.5588V13.0884H21.3868V13.6833ZM19.7328 13.6833H18.9069V13.0884H19.7328V13.6833ZM18.0789 13.6833H17.2529V13.0884H18.0789V13.6833Z" fill="#477CA8"/>
<path d="M67.8227 13.6833H67.0294V13.485H66.6328V13.0884H67.8227V13.6833Z" fill="#477CA8"/>
<path d="M67.8225 29.7467H67.2275V28.9323H67.8225V29.7467ZM67.8225 28.118H67.2275V27.3036H67.8225V28.118ZM67.8225 26.4893H67.2275V25.6812H67.8225V26.4893ZM67.8225 24.8606H67.2275V24.0484H67.8225V24.8606ZM67.8225 23.234H67.2275V22.4197H67.8225V23.234ZM67.8225 21.6053H67.2275V20.791H67.8225V21.6053ZM67.8225 19.9766H67.2275V19.1623H67.8225V19.9766ZM67.8225 18.35H67.2275V17.5357H67.8225V18.35ZM67.8225 16.7214H67.2275V15.907H67.8225V16.7214ZM67.8225 15.0927H67.2275V14.2783H67.8225V15.0927Z" fill="#477CA8"/>
<path d="M20.5739 57.7278C20.5747 58.6155 20.3122 59.4834 19.8196 60.2218C19.327 60.9602 18.6264 61.5358 17.8065 61.876C16.9866 62.2161 16.0843 62.3054 15.2136 62.1326C14.343 61.9597 13.5432 61.5325 12.9154 60.905C12.2876 60.2775 11.8601 59.4779 11.6868 58.6073C11.5136 57.7368 11.6025 56.8344 11.9423 56.0144C12.2821 55.1943 12.8574 54.4935 13.5956 54.0006C14.3338 53.5076 15.2016 53.2447 16.0892 53.2451C17.2783 53.2451 18.4187 53.7173 19.2597 54.558C20.1007 55.3986 20.5734 56.5388 20.5739 57.7278Z" fill="#D8E9C9"/>
<path d="M16.0882 62.5142C15.1422 62.5146 14.2174 62.2344 13.4306 61.7092C12.6439 61.1839 12.0306 60.4371 11.6683 59.5633C11.3061 58.6894 11.2111 57.7277 11.3954 56.7999C11.5797 55.8721 12.035 55.0197 12.7038 54.3507C13.3725 53.6816 14.2247 53.226 15.1525 53.0413C16.0802 52.8566 17.0419 52.9512 17.9159 53.3131C18.7899 53.675 19.537 54.288 20.0626 55.0745C20.5882 55.861 20.8687 56.7857 20.8687 57.7317C20.8677 58.9994 20.3637 60.215 19.4675 61.1116C18.5712 62.0082 17.3559 62.5126 16.0882 62.5142ZM16.0882 53.5428C15.2591 53.5425 14.4486 53.788 13.7591 54.2483C13.0696 54.7086 12.5322 55.3631 12.2148 56.129C11.8973 56.8949 11.8142 57.7377 11.9758 58.5508C12.1374 59.3639 12.5366 60.1108 13.1228 60.6971C13.7091 61.2833 14.456 61.6825 15.2691 61.8441C16.0822 62.0057 16.925 61.9226 17.6909 61.6051C18.4567 61.2877 19.1112 60.7502 19.5716 60.0608C20.0319 59.3713 20.2774 58.5607 20.2771 57.7317C20.2765 56.6205 19.8352 55.555 19.0498 54.7689C18.2645 53.9828 17.1993 53.5405 16.0882 53.5389V53.5428Z" fill="#477CA8"/>
<path d="M15.1207 59.2424L13.9512 58.0729L14.3693 57.6548L15.1207 58.4062L17.7929 55.7339L18.211 56.152L15.1207 59.2424Z" fill="#477CA8"/>
<path d="M46.7497 14.2977C46.7505 15.1852 46.488 16.0531 45.9955 16.7914C45.503 17.5298 44.8025 18.1054 43.9828 18.4456C43.163 18.7858 42.2607 18.8752 41.3902 18.7026C40.5196 18.5299 39.7198 18.1029 39.0919 17.4756C38.464 16.8482 38.0363 16.0488 37.8629 15.1784C37.6894 14.3079 37.778 13.4056 38.1175 12.5856C38.457 11.7655 39.0321 11.0645 39.77 10.5714C40.5079 10.0782 41.3755 9.81494 42.263 9.81494C43.4523 9.81494 44.5929 10.2871 45.4342 11.1277C46.2755 11.9682 46.7487 13.1084 46.7497 14.2977Z" fill="#D8E5ED"/>
<path d="M42.2639 19.084C41.3181 19.084 40.3934 18.8035 39.6069 18.278C38.8205 17.7525 38.2075 17.0056 37.8455 16.1317C37.4835 15.2578 37.3888 14.2962 37.5733 13.3685C37.7579 12.4408 38.2134 11.5886 38.8822 10.9198C39.5511 10.251 40.4032 9.79547 41.3309 9.61094C42.2586 9.4264 43.2202 9.52112 44.0941 9.8831C44.968 10.2451 45.7149 10.858 46.2404 11.6445C46.7659 12.431 47.0464 13.3556 47.0464 14.3015C47.0454 15.5696 46.5412 16.7854 45.6445 17.6821C44.7479 18.5788 43.532 19.083 42.2639 19.084ZM42.2639 10.1127C41.435 10.1127 40.6246 10.3585 39.9354 10.8191C39.2462 11.2797 38.7091 11.9343 38.3919 12.7002C38.0748 13.4661 37.9919 14.3088 38.1538 15.1218C38.3156 15.9348 38.715 16.6816 39.3013 17.2676C39.8876 17.8536 40.6345 18.2526 41.4476 18.4141C42.2606 18.5755 43.1033 18.4923 43.8691 18.1748C44.6348 17.8573 45.2892 17.3198 45.7495 16.6304C46.2097 15.9409 46.4552 15.1305 46.4548 14.3015C46.4543 13.19 46.0126 12.1242 45.2269 11.338C44.4411 10.5519 43.3754 10.1098 42.2639 10.1087V10.1127Z" fill="#477CA8"/>
<path d="M42.5594 12.1577H41.9678V16.2145H42.5594V12.1577Z" fill="#477CA8"/>
<path d="M42.2463 16.4198L40.6055 14.779L41.0236 14.3609L42.2522 15.5876L43.5065 14.3589L43.9207 14.7809L42.2463 16.4198Z" fill="#477CA8"/>
</svg>
