<svg width="103" height="94" viewBox="0 0 103 94" fill="none" xmlns="http://www.w3.org/2000/svg">
<path d="M67.3825 90.7187C64.8068 93.2977 59.8145 94.6369 56.2908 93.7021L20.692 84.1518C17.1682 83.2104 13.5152 79.5541 12.5704 76.0336L3.03342 40.4315C2.08867 36.9111 3.4279 31.9188 6.01684 29.3398L32.0787 3.2813C34.6577 0.702304 39.6499 -0.636919 43.1704 0.297885L78.7725 9.8382C82.2929 10.7796 85.9459 14.436 86.8907 17.9564L96.431 53.5585C97.3758 57.079 96.0365 62.0712 93.4476 64.6502L67.3825 90.7187Z" fill="#E7F4FC"/>
<path d="M8.95009 54.623H8.28711V55.286H8.95009V54.623Z" fill="#477CA8"/>
<path d="M8.95009 53.3099H8.28711V51.9839H8.95009V53.3099ZM8.95009 50.6779H8.28711V49.3519H8.95009V50.6779ZM8.95009 48.0491H8.28711V46.7232H8.95009V48.0491ZM8.95009 45.4171H8.28711V44.0911H8.95009V45.4171ZM8.95009 42.7884H8.28711V41.4624H8.95009V42.7884ZM8.95009 40.1563H8.28711V38.8304H8.95009V40.1563ZM8.95009 37.5243H8.28711V36.1983H8.95009V37.5243ZM8.95009 34.8956H8.28711V33.5696H8.95009V34.8956ZM8.95009 32.2635H8.28711V30.9376H8.95009V32.2635ZM8.95009 29.6348H8.28711V28.3088H8.95009V29.6348ZM8.95009 27.0028H8.28711V25.6768H8.95009V27.0028ZM8.95009 24.374H8.28711V23.0481H8.95009V24.374ZM8.95009 21.742H8.28711V20.416H8.95009V21.742ZM8.95009 19.1133H8.28711V17.7873H8.95009V19.1133ZM8.95009 16.4812H8.28711V15.1553H8.95009V16.4812Z" fill="#477CA8"/>
<path d="M8.95009 13.8495H8.28711V12.855H9.28158V13.518H8.95009V13.8495Z" fill="#477CA8"/>
<path d="M87.5369 13.518H86.2308V12.855H87.5369V13.518ZM84.9281 13.518H83.6253V12.855H84.9314L84.9281 13.518ZM82.3192 13.518H81.0165V12.855H82.3192V13.518ZM79.7104 13.518H78.4077V12.855H79.7104V13.518ZM77.1016 13.518H75.7988V12.855H77.1016V13.518ZM74.4927 13.518H73.19V12.855H74.4927V13.518ZM71.8872 13.518H70.5812V12.855H71.8872V13.518ZM69.2784 13.518H67.9723V12.855H69.2784V13.518ZM66.6695 13.518H65.3734V12.855H66.6795L66.6695 13.518ZM64.0607 13.518H62.7546V12.855H64.0475L64.0607 13.518ZM61.4519 13.518H60.1491V12.855H61.4519V13.518ZM58.843 13.518H57.5403V12.855H58.843V13.518ZM56.2342 13.518H54.9315V12.855H56.2342V13.518ZM53.6254 13.518H52.3226V12.855H53.6254V13.518ZM51.0199 13.518H49.7138V12.855H51.0199V13.518ZM48.411 13.518H47.105V12.855H48.411V13.518ZM45.8022 13.518H44.4895V12.855H45.8155L45.8022 13.518ZM43.1934 13.518H41.8873V12.855H43.1934V13.518ZM40.5845 13.518H39.2818V12.855H40.5845V13.518ZM37.9757 13.518H36.6729V12.855H37.9757V13.518ZM35.3668 13.518H34.0641V12.855H35.3668V13.518ZM32.758 13.518H31.4553V12.855H32.758V13.518ZM30.1492 13.518H28.8464V12.855H30.1492V13.518ZM27.5437 13.518H26.2376V12.855H27.5437V13.518ZM24.9348 13.518H23.6288V12.855H24.9315L24.9348 13.518ZM22.326 13.518H21.0199V12.855H22.326V13.518ZM19.7172 13.518H18.4111V12.855H19.7172V13.518ZM17.1083 13.518H15.8023V12.855H17.1083V13.518ZM14.4995 13.518H13.1967V12.855H14.4995V13.518ZM11.8906 13.518H10.5879V12.855H11.8906V13.518Z" fill="#477CA8"/>
<path d="M89.8333 13.8495H89.1704V13.518H88.8389V12.855H89.8333V13.8495Z" fill="#477CA8"/>
<path d="M89.8349 39.6325H89.1719V38.3431H89.8349V39.6325ZM89.8349 37.0535H89.1719V35.764H89.8349V37.0535ZM89.8349 34.4745H89.1719V33.195H89.8349V34.4745ZM89.8349 31.8955H89.1719V30.6094H89.8349V31.8955ZM89.8349 29.3199H89.1719V28.0304H89.8349V29.3199ZM89.8349 26.7409H89.1719V25.4514H89.8349V26.7409ZM89.8349 24.1619H89.1719V22.8724H89.8349V24.1619ZM89.8349 21.5862H89.1719V20.2967H89.8349V21.5862ZM89.8349 19.0072H89.1719V17.7177H89.8349V19.0072ZM89.8349 16.4282H89.1719V15.1387H89.8349V16.4282Z" fill="#477CA8"/>
<path d="M89.8349 40.9185H89.1719V41.5814H89.8349V40.9185Z" fill="#477CA8"/>
<path d="M71.2707 25.8198H12.8984V66.3844H71.2707V25.8198Z" fill="white"/>
<path d="M71.7681 66.8813H12.4014V25.3223H71.7681V66.8813ZM13.3958 65.8868H70.7736V26.3167H13.3958V65.8868Z" fill="#477CA8"/>
<path d="M16.836 26.9233H16.3255C14.449 26.9233 12.9277 28.4446 12.9277 30.3211V37.1366C12.9277 39.0131 14.449 40.5344 16.3255 40.5344H16.836C18.7126 40.5344 20.2338 39.0131 20.2338 37.1366V30.3211C20.2338 28.4446 18.7126 26.9233 16.836 26.9233Z" fill="#F5B1AE"/>
<path d="M24.1221 26.9233H23.6117C21.7351 26.9233 20.2139 28.4446 20.2139 30.3211V37.1366C20.2139 39.0131 21.7351 40.5344 23.6117 40.5344H24.1221C25.9987 40.5344 27.5199 39.0131 27.5199 37.1366V30.3211C27.5199 28.4446 25.9987 26.9233 24.1221 26.9233Z" fill="#B0D9EF"/>
<path d="M31.4092 26.9233H30.8988C29.0222 26.9233 27.501 28.4446 27.501 30.3211V37.1366C27.501 39.0131 29.0222 40.5344 30.8988 40.5344H31.4092C33.2858 40.5344 34.807 39.0131 34.807 37.1366V30.3211C34.807 28.4446 33.2858 26.9233 31.4092 26.9233Z" fill="#F5B1AE"/>
<path d="M38.6954 26.9233H38.1849C36.3083 26.9233 34.7871 28.4446 34.7871 30.3211V37.1366C34.7871 39.0131 36.3083 40.5344 38.1849 40.5344H38.6954C40.5719 40.5344 42.0932 39.0131 42.0932 37.1366V30.3211C42.0932 28.4446 40.5719 26.9233 38.6954 26.9233Z" fill="#B0D9EF"/>
<path d="M45.9805 26.9233H45.47C43.5935 26.9233 42.0723 28.4446 42.0723 30.3211V37.1366C42.0723 39.0131 43.5935 40.5344 45.47 40.5344H45.9805C47.8571 40.5344 49.3783 39.0131 49.3783 37.1366V30.3211C49.3783 28.4446 47.8571 26.9233 45.9805 26.9233Z" fill="#F5B1AE"/>
<path d="M53.2676 26.9233H52.7572C50.8806 26.9233 49.3594 28.4446 49.3594 30.3211V37.1366C49.3594 39.0131 50.8806 40.5344 52.7572 40.5344H53.2676C55.1442 40.5344 56.6654 39.0131 56.6654 37.1366V30.3211C56.6654 28.4446 55.1442 26.9233 53.2676 26.9233Z" fill="#B0D9EF"/>
<path d="M60.5538 26.9233H60.0433C58.1667 26.9233 56.6455 28.4446 56.6455 30.3211V37.1366C56.6455 39.0131 58.1667 40.5344 60.0433 40.5344H60.5538C62.4303 40.5344 63.9516 39.0131 63.9516 37.1366V30.3211C63.9516 28.4446 62.4303 26.9233 60.5538 26.9233Z" fill="#F5B1AE"/>
<path d="M67.837 26.9233H67.3265C65.45 26.9233 63.9287 28.4446 63.9287 30.3211V37.1366C63.9287 39.0131 65.45 40.5344 67.3265 40.5344H67.837C69.7135 40.5344 71.2348 39.0131 71.2348 37.1366V30.3211C71.2348 28.4446 69.7135 26.9233 67.837 26.9233Z" fill="#B0D9EF"/>
<path d="M71.2707 28.501H12.8984V33.0126H71.2707V28.501Z" fill="white"/>
<path d="M71.6026 33.344H12.5674V28.1694H71.6026V33.344ZM13.2304 32.681H70.9396V28.8324H13.2304V32.681Z" fill="#477CA8"/>
<path d="M71.2707 25.8198H12.8984V28.7237H71.2707V25.8198Z" fill="#D8E5ED"/>
<path d="M71.6026 29.0546H12.5674V25.4878H71.6026V29.0546ZM13.2304 28.3917H70.9396V26.1508H13.2304V28.3917Z" fill="#477CA8"/>
<path d="M20.3505 30.4238H14.0488V31.0868H20.3505V30.4238Z" fill="#477CA8"/>
<path d="M55.1437 30.4238H52.6211V31.0868H55.1437V30.4238Z" fill="#477CA8"/>
<path d="M58.7834 30.4238H56.2607V31.0868H58.7834V30.4238Z" fill="#477CA8"/>
<path d="M62.4201 30.4238H59.8975V31.0868H62.4201V30.4238Z" fill="#477CA8"/>
<path d="M66.0588 30.4238H63.5361V31.0868H66.0588V30.4238Z" fill="#477CA8"/>
<path d="M69.6955 30.4238H67.1729V31.0868H69.6955V30.4238Z" fill="#477CA8"/>
<path d="M14.6818 26.7441H13.8398V27.7386H14.6818V26.7441Z" fill="#477CA8"/>
<path d="M16.3264 26.7441H15.4844V27.7386H16.3264V26.7441Z" fill="#477CA8"/>
<path d="M17.9699 26.7441H17.1279V27.7386H17.9699V26.7441Z" fill="#477CA8"/>
<path d="M32.3239 57.6094H21.4941V61.3652H32.3239V57.6094Z" fill="#B0D9EF"/>
<path d="M31.4521 46.0269H21.4941V47.0213H31.4521V46.0269Z" fill="#477CA8"/>
<path d="M40.8864 50.3364H21.4941V50.9994H40.8864V50.3364Z" fill="#B0D9EF"/>
<path d="M40.8864 52.4912H21.4941V53.1542H40.8864V52.4912Z" fill="#B0D9EF"/>
<path d="M40.8864 54.3145H21.4941V54.9774H40.8864V54.3145Z" fill="#B0D9EF"/>
<path d="M57.1893 13.879C57.1906 15.371 56.7493 16.8298 55.9213 18.071C55.0933 19.3121 53.9158 20.2797 52.5377 20.8514C51.1596 21.4231 49.6429 21.5732 48.1795 21.2827C46.716 20.9922 45.3717 20.2742 44.3165 19.2194C43.2612 18.1647 42.5426 16.8206 42.2514 15.3573C41.9603 13.894 42.1097 12.3773 42.6808 10.9989C43.2519 9.62058 44.219 8.4426 45.4598 7.61405C46.7006 6.78549 48.1592 6.34358 49.6512 6.34424C51.6498 6.34424 53.5667 7.13798 54.9803 8.55093C56.3938 9.96388 57.1884 11.8804 57.1893 13.879Z" fill="#D8E9C9"/>
<path d="M49.6504 21.9245C48.0603 21.9251 46.5058 21.4542 45.1834 20.5713C43.8611 19.6884 42.8302 18.4332 42.2213 16.9644C41.6123 15.4956 41.4527 13.8792 41.7625 12.3196C42.0723 10.76 42.8376 9.32737 43.9617 8.20281C45.0858 7.07825 46.5181 6.31232 48.0776 6.00188C49.637 5.69143 51.2535 5.85043 52.7226 6.45876C54.1916 7.06709 55.4473 8.09742 56.3307 9.41945C57.2142 10.7415 57.6857 12.2958 57.6857 13.8858C57.684 16.0167 56.8369 18.0598 55.3305 19.5669C53.824 21.074 51.7812 21.9219 49.6504 21.9245ZM49.6504 6.84496C48.2569 6.8443 46.8945 7.25696 45.7356 8.03073C44.5767 8.8045 43.6733 9.90462 43.1397 11.1919C42.6062 12.4792 42.4664 13.8958 42.7381 15.2626C43.0098 16.6293 43.6807 17.8848 44.6661 18.8701C45.6514 19.8555 46.9069 20.5264 48.2736 20.7981C49.6404 21.0698 51.057 20.9301 52.3443 20.3965C53.6316 19.8629 54.7317 18.9595 55.5055 17.8006C56.2792 16.6417 56.6919 15.2793 56.6912 13.8858C56.6904 12.0181 55.9485 10.2271 54.6285 8.9058C53.3084 7.58452 51.5181 6.84096 49.6504 6.83832V6.84496Z" fill="#477CA8"/>
<path d="M48.0234 16.4251L46.0576 14.4593L46.7604 13.7566L48.0234 15.0195L52.5151 10.5278L53.2178 11.2306L48.0234 16.4251Z" fill="#477CA8"/>
<path d="M75.195 43.2524H35.7178V71.5518H75.195V43.2524Z" fill="white"/>
<path d="M75.693 72.0492H35.208V42.7554H75.6831L75.693 72.0492ZM36.2124 71.0548H74.6985V43.7498H36.2025L36.2124 71.0548Z" fill="#477CA8"/>
<path d="M74.642 48.1055H36.2686V52.6569H74.642V48.1055Z" fill="white"/>
<path d="M74.642 57.2744H36.2686V61.8258H74.642V57.2744Z" fill="white"/>
<path d="M74.642 66.4468H36.2686V70.9981H74.642V66.4468Z" fill="#F5B1AE"/>
<path d="M75.195 43.2524H35.7178V47.764H75.195V43.2524Z" fill="white"/>
<path d="M75.5273 48.112H35.3838V42.9209H75.5273V48.112ZM36.0468 47.4491H74.8644V43.5839H36.0468V47.4491Z" fill="#477CA8"/>
<path d="M50.4425 45.1753H38.6348V45.8383H50.4425V45.1753Z" fill="#477CA8"/>
<path d="M66.1326 45.1753H62.5127V45.8383H66.1326V45.1753Z" fill="#477CA8"/>
<path d="M71.3572 45.1753H67.7373V45.8383H71.3572V45.1753Z" fill="#477CA8"/>
<path d="M50.4425 50.0386H38.6348V50.7016H50.4425V50.0386Z" fill="#B0D9EF"/>
<path d="M66.1326 50.0386H62.5127V50.7016H66.1326V50.0386Z" fill="#B0D9EF"/>
<path d="M71.3572 50.0386H67.7373V50.7016H71.3572V50.0386Z" fill="#B0D9EF"/>
<path d="M50.4425 54.6528H38.6348V55.3158H50.4425V54.6528Z" fill="#B0D9EF"/>
<path d="M66.1326 54.6528H62.5127V55.3158H66.1326V54.6528Z" fill="#B0D9EF"/>
<path d="M71.3572 54.6528H67.7373V55.3158H71.3572V54.6528Z" fill="#B0D9EF"/>
<path d="M50.4425 59.2637H38.6348V59.9267H50.4425V59.2637Z" fill="#B0D9EF"/>
<path d="M66.1326 59.2637H62.5127V59.9267H66.1326V59.2637Z" fill="#B0D9EF"/>
<path d="M71.3572 59.2637H67.7373V59.9267H71.3572V59.2637Z" fill="#B0D9EF"/>
<path d="M50.4425 63.8784H38.6348V64.5414H50.4425V63.8784Z" fill="#B0D9EF"/>
<path d="M66.1326 63.8784H62.5127V64.5414H66.1326V63.8784Z" fill="#B0D9EF"/>
<path d="M71.3572 63.8784H67.7373V64.5414H71.3572V63.8784Z" fill="#B0D9EF"/>
<path d="M50.4425 68.4922H38.6348V69.1552H50.4425V68.4922Z" fill="#477CA8"/>
<path d="M66.1326 68.4922H62.5127V69.1552H66.1326V68.4922Z" fill="#477CA8"/>
<path d="M71.3572 68.4922H67.7373V69.1552H71.3572V68.4922Z" fill="#477CA8"/>
<path d="M67.8361 40.8654H67.3256C66.6123 40.8642 65.9141 40.6588 65.3138 40.2735C64.7134 39.8881 64.2359 39.3389 63.9378 38.6908C63.64 39.3392 63.1626 39.8886 62.5622 40.274C61.9618 40.6594 61.2634 40.8646 60.55 40.8654H60.0428C59.3288 40.8649 58.63 40.6597 58.029 40.2743C57.428 39.889 56.95 39.3394 56.6516 38.6908C56.3541 39.3394 55.8768 39.8891 55.2763 40.2745C54.6758 40.66 53.9773 40.865 53.2638 40.8654H52.7566C52.0431 40.8646 51.3448 40.6594 50.7444 40.274C50.144 39.8886 49.6666 39.3392 49.3688 38.6908C49.0706 39.3389 48.5932 39.8881 47.9928 40.2735C47.3924 40.6588 46.6943 40.8642 45.9809 40.8654H45.4837C44.7702 40.8646 44.0719 40.6594 43.4715 40.274C42.871 39.8886 42.3937 39.3392 42.0959 38.6908C41.7981 39.3392 41.3207 39.8886 40.7202 40.274C40.1198 40.6594 39.4215 40.8646 38.708 40.8654H38.1909C37.4774 40.8646 36.7791 40.6594 36.1787 40.274C35.5782 39.8886 35.1009 39.3392 34.8031 38.6908C34.5053 39.3392 34.0279 39.8886 33.4274 40.274C32.827 40.6594 32.1287 40.8646 31.4152 40.8654H30.8981C30.1846 40.8646 29.4863 40.6594 28.8859 40.274C28.2854 39.8886 27.8081 39.3392 27.5103 38.6908C27.2124 39.3392 26.7351 39.8886 26.1346 40.274C25.5342 40.6594 24.8359 40.8646 24.1224 40.8654H23.6053C22.8918 40.8646 22.1935 40.6594 21.5931 40.274C20.9926 39.8886 20.5153 39.3392 20.2175 38.6908C19.9196 39.3392 19.4422 39.8886 18.8418 40.274C18.2414 40.6594 17.5431 40.8646 16.8296 40.8654H16.3224C15.3331 40.8654 14.3842 40.4726 13.6843 39.7733C12.9844 39.074 12.5907 38.1255 12.5898 37.1361V32.6411H13.2528V37.1361C13.2537 37.9497 13.5775 38.7296 14.1531 39.3045C14.7286 39.8795 15.5089 40.2024 16.3224 40.2024H16.8296C17.6102 40.2021 18.3612 39.9038 18.9292 39.3684C19.4973 38.833 19.8395 38.101 19.886 37.3218H20.5489C20.5954 38.101 20.9376 38.833 21.5056 39.3684C22.0737 39.9038 22.8247 40.2021 23.6053 40.2024H24.1158C24.8964 40.2021 25.6474 39.9038 26.2154 39.3684C26.7835 38.833 27.1257 38.101 27.1721 37.3218H27.8351C27.8824 38.1007 28.2248 38.8323 28.7927 39.3675C29.3605 39.9027 30.1111 40.2013 30.8915 40.2024H31.402C32.1823 40.2013 32.9329 39.9027 33.5007 39.3675C34.0686 38.8323 34.4111 38.1007 34.4583 37.3218H35.1213C35.1685 38.1007 35.511 38.8323 36.0788 39.3675C36.6467 39.9027 37.3973 40.2013 38.1776 40.2024H38.6881C39.4685 40.2013 40.219 39.9027 40.7869 39.3675C41.3548 38.8323 41.6972 38.1007 41.7445 37.3218H42.4074C42.4539 38.101 42.7961 38.833 43.3642 39.3684C43.9322 39.9038 44.6832 40.2021 45.4638 40.2024H45.9743C46.7546 40.2013 47.5052 39.9027 48.0731 39.3675C48.641 38.8323 48.9834 38.1007 49.0307 37.3218H49.6936C49.7409 38.1013 50.0838 38.8333 50.6524 39.3686C51.221 39.9039 51.9724 40.2022 52.7533 40.2024H53.2605C54.0419 40.2021 54.7938 39.9035 55.3624 39.3674C55.9311 38.8314 56.2737 38.0985 56.3201 37.3184H56.9831C57.0296 38.0985 57.3721 38.8314 57.9408 39.3674C58.5094 39.9035 59.2613 40.2021 60.0428 40.2024H60.55C61.3305 40.2021 62.0816 39.9038 62.6496 39.3684C63.2176 38.833 63.5598 38.101 63.6063 37.3218H64.2693C64.3165 38.1007 64.659 38.8323 65.2269 39.3675C65.7947 39.9027 66.5453 40.2013 67.3256 40.2024H67.8361C68.6494 40.2024 69.4293 39.8794 70.0043 39.3043C70.5794 38.7293 70.9024 37.9494 70.9024 37.1361V32.6411H71.5654V37.1361C71.5645 38.1249 71.1713 39.073 70.4722 39.7722C69.773 40.4713 68.8249 40.8645 67.8361 40.8654Z" fill="#477CA8"/>
<path d="M17.3465 42.9111H0.331055V59.9266H17.3465V42.9111Z" fill="#D8E5ED"/>
<path d="M17.6784 60.258H0V42.5796H17.6784V60.258ZM0.662982 59.595H17.0154V43.2426H0.662982V59.595Z" fill="#477CA8"/>
<path d="M17.3471 60.2582H0.331637L0.0996094 59.6946L17.115 42.6792L17.6786 42.9112V59.9267L17.3471 60.2582ZM1.13386 59.5952H17.0156V43.7134L1.13386 59.5952Z" fill="#477CA8"/>
<path d="M17.3469 60.2615H0.331491L0 59.93V42.9112L0.566857 42.6792L17.5823 59.6946L17.3469 60.2615ZM0.662982 59.5985H16.548L0.662982 43.7134V59.5985Z" fill="#477CA8"/>
<path d="M100.11 52.4614H79.2266V66.384H100.11V52.4614Z" fill="#DBC5B8"/>
<path d="M100.607 66.881H78.7285V51.9639H100.607V66.881ZM79.723 65.8865H99.6124V52.9583H79.723V65.8865Z" fill="#477CA8"/>
<path d="M100.11 52.4614H92.4297V66.384H100.11V52.4614Z" fill="#BCAAA0"/>
<path d="M100.607 66.881H91.9316V51.9639H100.607V66.881ZM92.9261 65.8865H99.6123V52.9583H92.9261V65.8865Z" fill="#477CA8"/>
<path d="M102.431 48.043H94.7501L92.4297 52.4618H100.11L102.431 48.043Z" fill="#BCAAA0"/>
<path d="M100.11 52.9587H92.4292L91.9883 52.2294L94.3087 47.8106L94.7496 47.5454H102.43L102.871 48.2747L100.551 52.6935L100.11 52.9587ZM93.2513 51.9642H99.8115L101.608 48.5399H95.0513L93.2513 51.9642Z" fill="#477CA8"/>
<path d="M77.2383 48.043H84.9222L87.2427 52.4618H79.5587L77.2383 48.043Z" fill="#DBC5B8"/>
<path d="M87.2511 52.9587H79.5572L79.1163 52.6935L76.7959 48.2747L77.2368 47.5454H84.9307L85.3716 47.8106L87.692 52.2327L87.2511 52.9587ZM79.8721 51.9642H86.429L84.6323 48.5399H78.0589L79.8721 51.9642Z" fill="#477CA8"/>
<path d="M87.501 61.2227L89.1319 62.8337L90.7629 61.2227H87.501Z" fill="#BCAAA0"/>
<path d="M89.7043 58.8125H88.501V61.2224H89.7043V58.8125Z" fill="#BCAAA0"/>
<path d="M83.7715 61.2227L85.4024 62.8337L87.0334 61.2227H83.7715Z" fill="#BCAAA0"/>
<path d="M85.9748 58.8125H84.7715V61.2224H85.9748V58.8125Z" fill="#BCAAA0"/>
<path d="M90.6467 63.3477H83.6787V64.551H90.6467V63.3477Z" fill="#BCAAA0"/>
<path d="M97.243 36.4205C97.2443 37.9124 96.8031 39.3711 95.9753 40.6121C95.1474 41.8532 93.9701 42.8208 92.5922 43.3926C91.2143 43.9644 89.6977 44.1147 88.2344 43.8245C86.7711 43.5342 85.4267 42.8165 84.3713 41.7621C83.316 40.7077 82.5971 39.3639 82.3056 37.9009C82.014 36.4378 82.163 34.9211 82.7336 33.5427C83.3042 32.1643 84.2708 30.9861 85.5111 30.1572C86.7514 29.3282 88.2097 28.8857 89.7016 28.8857C91.7005 28.8857 93.6177 29.6794 95.0318 31.0922C96.4459 32.5051 97.2412 34.4216 97.243 36.4205Z" fill="#D8E5ED"/>
<path d="M89.7018 44.4655C88.1119 44.4655 86.5577 43.994 85.2357 43.1107C83.9138 42.2274 82.8834 40.972 82.275 39.5031C81.6666 38.0342 81.5074 36.4179 81.8176 34.8586C82.1277 33.2992 82.8933 31.8669 84.0176 30.7427C85.1418 29.6184 86.5741 28.8528 88.1335 28.5426C89.6928 28.2325 91.3091 28.3917 92.778 29.0001C94.2469 29.6085 95.5024 30.6389 96.3857 31.9608C97.269 33.2828 97.7404 34.8369 97.7404 36.4268C97.7387 38.5583 96.8912 40.6019 95.384 42.1091C93.8768 43.6163 91.8332 44.4637 89.7018 44.4655ZM89.7018 29.386C88.3084 29.386 86.9463 29.7992 85.7879 30.5734C84.6294 31.3475 83.7265 32.4479 83.1934 33.7352C82.6604 35.0226 82.5211 36.4391 82.7932 37.8056C83.0652 39.1722 83.7364 40.4273 84.7219 41.4123C85.7074 42.3973 86.9629 43.068 88.3295 43.3394C89.6962 43.6108 91.1126 43.4709 92.3997 42.9372C93.6868 42.4035 94.7868 41.5001 95.5604 40.3413C96.334 39.1824 96.7466 37.8202 96.7459 36.4268C96.7451 34.5586 96.0027 32.767 94.682 31.4457C93.3612 30.1243 91.57 29.3811 89.7018 29.3793V29.386Z" fill="#477CA8"/>
<path d="M90.1986 32.8237H89.2041V39.6425H90.1986V32.8237Z" fill="#477CA8"/>
<path d="M89.6721 39.9875L86.9141 37.2295L87.6168 36.5268L89.682 38.5886L91.7903 36.5234L92.4864 37.2328L89.6721 39.9875Z" fill="#477CA8"/>
</svg>
