<svg width="372" height="68" viewBox="0 0 372 68" fill="none" xmlns="http://www.w3.org/2000/svg">
<path d="M31.08 4.48V23.992H10.128V4.48H0.192V52H10.128V31.984H31.08V52H41.016V4.48H31.08ZM85.2506 16H75.2426L68.6906 37.168L66.4586 44.8L64.5866 37.6L57.7466 16H46.8026L57.8186 43.144L61.7786 52.504L60.5546 55.6C59.1866 59.056 57.3146 59.92 54.5786 59.92C51.9866 59.92 49.9706 59.344 48.2426 57.904L46.1546 65.032C48.4586 66.544 51.5546 67.48 55.3706 67.48C63.0026 67.48 67.1786 64.024 70.7066 54.232L85.2506 16ZM111.027 15.28C105.339 15.28 101.019 18.376 99.0033 23.056L98.5713 16H89.7153V67.12H99.5793V45.808C101.595 49.912 105.483 52.72 110.811 52.72C119.667 52.72 126.291 45.736 126.291 33.928C126.291 22.192 119.811 15.28 111.027 15.28ZM107.931 45.16C102.819 45.16 99.5793 40.912 99.5793 34C99.5793 26.944 102.963 22.84 108.075 22.84C113.331 22.84 116.427 26.728 116.427 34C116.427 41.272 113.187 45.16 107.931 45.16ZM167.192 32.056C167.192 22.408 160.928 15.28 150.056 15.28C139.328 15.28 131.84 22.192 131.84 34C131.84 45.808 139.184 52.72 150.56 52.72C157.904 52.72 164.168 49.48 166.472 43.792L158.624 40.768C157.184 43.648 154.736 45.376 150.488 45.376C145.52 45.376 142.28 42.712 141.488 37.096H166.904C167.048 35.8 167.192 34 167.192 32.056ZM149.984 22.552C154.448 22.552 157.184 25.288 157.688 30.256H141.56C142.496 25.144 145.448 22.552 149.984 22.552ZM174.551 52H184.415V33.352C184.415 26.872 188.807 23.776 193.199 23.776C195.431 23.776 196.655 23.992 197.663 24.352L198.815 16.072C197.951 15.568 196.511 15.28 194.927 15.28C189.311 15.28 185.639 18.088 183.767 23.056L183.119 16H174.551V52Z" fill="#333333"/>
<path d="M218.398 52.72C226.894 52.72 232.726 48.328 232.726 41.488C232.726 37.096 230.35 33.928 223.654 32.56L214.654 30.688C210.694 29.896 209.542 27.952 209.542 25.864C209.542 22.696 212.566 20.32 217.75 20.32C221.638 20.32 225.742 22.192 227.398 26.44L232.222 23.272C229.846 18.232 224.806 15.28 217.75 15.28C209.254 15.28 203.854 20.248 203.854 26.08C203.854 31.048 206.662 34.504 213.646 35.944L222.286 37.744C225.958 38.536 226.966 40.336 226.966 42.352C226.966 45.52 223.87 47.68 218.83 47.68C213.07 47.68 208.894 45.088 206.806 40.624L201.91 44.152C205.078 49.624 211.414 52.72 218.398 52.72ZM256.311 15.28C246.159 15.28 238.887 22.336 238.887 34C238.887 45.664 246.159 52.72 256.311 52.72C266.463 52.72 273.735 45.664 273.735 34C273.735 22.336 266.463 15.28 256.311 15.28ZM256.311 20.248C263.583 20.248 267.975 25.432 267.975 34C267.975 42.568 263.583 47.752 256.311 47.752C249.039 47.752 244.647 42.568 244.647 34C244.647 25.432 249.039 20.248 256.311 20.248ZM300.075 15.28C295.107 15.28 290.499 17.08 287.979 21.616L287.619 16H282.579V52H288.339V32.848C288.339 23.632 294.243 20.32 299.499 20.32C304.467 20.32 308.355 22.984 308.355 30.976V52H314.115V28.96C314.115 19.672 307.779 15.28 300.075 15.28ZM328.037 9.088C330.629 9.088 332.357 7.36 332.357 4.768C332.357 2.176 330.629 0.447999 328.037 0.447999C325.445 0.447999 323.717 2.176 323.717 4.768C323.717 7.36 325.445 9.088 328.037 9.088ZM330.917 16H325.157V52H330.917V16ZM371.586 52L358.338 33.64L371.37 16H364.602L355.242 29.32L345.738 16H338.538L351.498 33.856L337.674 52H344.37L354.594 38.104L364.53 52H371.586Z" fill="#555555"/>
</svg>
