<svg width="96" height="96" viewBox="0 0 96 96" fill="none" xmlns="http://www.w3.org/2000/svg">
<path d="M66.2684 91.925C63.6829 94.5105 58.6781 95.8498 55.1488 94.9159L19.4569 85.3516C15.9177 84.3978 12.2621 80.7322 11.3183 77.2029L1.75391 41.5111C0.806781 37.9818 2.14938 32.9769 4.74485 30.3914L30.8723 4.26396C33.4578 1.68178 38.4627 0.339185 41.992 1.27302L77.6838 10.834C81.2131 11.7812 84.8787 15.4434 85.8225 18.976L95.3868 54.6646C96.334 58.1972 94.9914 63.202 92.3959 65.7842L66.2684 91.925Z" fill="#E7F4FC"/>
<path d="M64.7486 64.0283H64.084V64.693H64.7486V64.0283Z" fill="#477CA8"/>
<path d="M64.7486 62.719H64.084V61.4097H64.7486V62.719ZM64.7486 60.1003H64.084V58.8009H64.7486V60.1003ZM64.7486 57.4849H64.084V56.1755H64.7486V57.4849ZM64.7486 54.8662H64.084V53.5568H64.7486V54.8662ZM64.7486 52.2474H64.084V50.9381H64.7486V52.2474ZM64.7486 49.6287H64.084V48.3193H64.7486V49.6287ZM64.7486 47.01H64.084V45.7006H64.7486V47.01ZM64.7486 44.3912H64.084V43.0819H64.7486V44.3912ZM64.7486 41.7758H64.084V40.4665H64.7486V41.7758ZM64.7486 39.1571H64.084V37.8644H64.7486V39.1571ZM64.7486 36.5384H64.084V35.229H64.7486V36.5384ZM64.7486 33.9196H64.084V32.6103H64.7486V33.9196ZM64.7486 31.3009H64.084V29.9915H64.7486V31.3009ZM64.7486 28.6822H64.084V27.3728H64.7486V28.6822ZM64.7486 26.0634H64.084V24.7574H64.7486V26.0634ZM64.7486 23.448H64.084V22.1387H64.7486V23.448Z" fill="#477CA8"/>
<path d="M64.7489 20.8295H64.0843V20.4972H63.752V19.8325H64.7489V20.8295Z" fill="#477CA8"/>
<path d="M62.4195 20.4972H61.0902V19.8325H62.4195V20.4972ZM59.7609 20.4972H58.4316V19.8325H59.7609V20.4972ZM57.1022 20.4972H55.7729V19.8325H57.1022V20.4972ZM54.4436 20.4972H53.1143V19.8325H54.4436V20.4972ZM51.785 20.4972H50.4557V19.8325H51.785V20.4972ZM49.1264 20.4972H47.7971V19.8325H49.1264V20.4972ZM46.4678 20.4972H45.1385V19.8325H46.4678V20.4972ZM43.8092 20.4972H42.4799V19.8325H43.8092V20.4972ZM41.1506 20.4972H39.8213V19.8325H41.1506V20.4972ZM38.492 20.4972H37.1627V19.8325H38.492V20.4972ZM35.8334 20.4972H34.5041V19.8325H35.8334V20.4972ZM33.1748 20.4972H31.8455V19.8325H33.1748V20.4972ZM30.5162 20.4972H29.1868V19.8325H30.5162V20.4972ZM27.8575 20.4972H26.5282V19.8325H27.8575V20.4972ZM25.1989 20.4972H23.8696V19.8325H25.1989V20.4972ZM22.5403 20.4972H21.211V19.8325H22.5403V20.4972ZM19.8817 20.4972H18.5524V19.8325H19.8817V20.4972ZM17.2231 20.4972H15.8938V19.8325H17.2231V20.4972ZM14.5645 20.4972H13.2352V19.8325H14.5645V20.4972ZM11.9059 20.4972H10.5766V19.8325H11.9059V20.4972ZM9.24727 20.4972H7.91797V19.8325H9.24727V20.4972Z" fill="#477CA8"/>
<path d="M6.15586 20.8295H5.49121V19.8325H6.48819V20.4972H6.15586V20.8295Z" fill="#477CA8"/>
<path d="M6.15586 62.719H5.49121V61.4097H6.15586V62.719ZM6.15586 60.1036H5.49121V58.8009H6.15586V60.1036ZM6.15586 57.4849H5.49121V56.1755H6.15586V57.4849ZM6.15586 54.8662H5.49121V53.5568H6.15586V54.8662ZM6.15586 52.2474H5.49121V50.9381H6.15586V52.2474ZM6.15586 49.6287H5.49121V48.3193H6.15586V49.6287ZM6.15586 47.01H5.49121V45.7006H6.15586V47.01ZM6.15586 44.3912H5.49121V43.0852H6.15586V44.3912ZM6.15586 41.7758H5.49121V40.4665H6.15586V41.7758ZM6.15586 39.1571H5.49121V37.8644H6.15586V39.1571ZM6.15586 36.5384H5.49121V35.229H6.15586V36.5384ZM6.15586 33.9196H5.49121V32.6103H6.15586V33.9196ZM6.15586 31.3009H5.49121V29.9915H6.15586V31.3009ZM6.15586 28.6822H5.49121V27.3728H6.15586V28.6822ZM6.15586 26.0668H5.49121V24.7574H6.15586V26.0668ZM6.15586 23.448H5.49121V22.1387H6.15586V23.448Z" fill="#477CA8"/>
<path d="M6.48819 65.0253H5.49121V64.0283H6.15586V64.3606H6.48819V65.0253Z" fill="#477CA8"/>
<path d="M21.1702 65.0255H19.9472V64.3608H21.1702V65.0255ZM18.7242 65.0255H17.4979V64.3608H18.7309L18.7242 65.0255ZM16.275 65.0255H15.052V64.3608H16.275V65.0255ZM13.8291 65.0255H12.6061V64.3608H13.8291V65.0255ZM11.3831 65.0255H10.1602V64.3608H11.3831V65.0255ZM8.9339 65.0255H7.71094V64.3608H8.9339V65.0255Z" fill="#477CA8"/>
<path d="M23.0582 64.3608H22.3936V65.0255H23.0582V64.3608Z" fill="#477CA8"/>
<path d="M80.5808 43.6201H39.5219C38.7639 43.6201 38.1494 44.2346 38.1494 44.9926V73.0908C38.1494 73.8488 38.7639 74.4633 39.5219 74.4633H80.5808C81.3389 74.4633 81.9533 73.8488 81.9533 73.0908V44.9926C81.9533 44.2346 81.3389 43.6201 80.5808 43.6201Z" fill="#D8E5ED"/>
<path d="M80.5836 74.9618H39.5214C39.0257 74.9618 38.5504 74.7651 38.1996 74.4149C37.8488 74.0648 37.6513 73.5897 37.6504 73.0941V44.9926C37.6513 44.4966 37.8487 44.0212 38.1994 43.6706C38.5501 43.3199 39.0254 43.1225 39.5214 43.1216H80.5836C81.0796 43.1225 81.555 43.3199 81.9056 43.6706C82.2563 44.0212 82.4537 44.4966 82.4546 44.9926V73.0908C82.4546 73.587 82.2575 74.0629 81.9066 74.4138C81.5557 74.7646 81.0798 74.9618 80.5836 74.9618ZM39.5214 44.1186C39.2896 44.1186 39.0673 44.2106 38.9034 44.3746C38.7395 44.5385 38.6474 44.7608 38.6474 44.9926V73.0908C38.6474 73.2054 38.67 73.3189 38.714 73.4247C38.7579 73.5306 38.8224 73.6267 38.9036 73.7076C38.9848 73.7885 39.0811 73.8526 39.1872 73.8961C39.2932 73.9397 39.4068 73.9619 39.5214 73.9615H80.5836C80.6982 73.9619 80.8118 73.9397 80.9178 73.8961C81.0239 73.8526 81.1202 73.7885 81.2015 73.7076C81.2827 73.6267 81.3471 73.5306 81.391 73.4247C81.435 73.3189 81.4576 73.2054 81.4576 73.0908V44.9926C81.4576 44.7608 81.3656 44.5385 81.2017 44.3746C81.0377 44.2106 80.8154 44.1186 80.5836 44.1186H39.5214Z" fill="#477CA8"/>
<path d="M79.8101 45.5908H40.2998V70.8077H79.8101V45.5908Z" fill="white"/>
<path d="M89.4801 74.3701C89.4902 74.3553 89.4991 74.3397 89.5067 74.3235L89.4801 72.9111H30.6251V74.3235C30.6198 74.3386 30.6198 74.355 30.6251 74.3701L30.7746 74.6326C31.529 75.8589 32.8783 76.0782 34.4302 76.0782H85.6849C87.2302 76.0782 88.5795 75.8589 89.3405 74.6326L89.4801 74.3701Z" fill="white"/>
<path d="M85.6849 76.577H34.4203C32.9182 76.577 31.2599 76.3776 30.3493 74.8955L30.1898 74.6163C30.1379 74.5137 30.116 74.3985 30.1266 74.284V72.4263H89.972L90.0085 74.4501L89.7659 74.8921C88.852 76.3776 87.1904 76.577 85.6849 76.577ZM31.1236 74.2507L31.2067 74.397C31.8149 75.3939 32.9315 75.59 34.4203 75.59H85.6849C87.1738 75.59 88.2904 75.384 88.9085 74.3837L89.0049 74.2075V73.4199H31.1236V74.2507Z" fill="#477CA8"/>
<path d="M56.0547 72.9115V73.091C56.0543 73.172 56.0698 73.2523 56.1005 73.3273C56.1312 73.4022 56.1765 73.4704 56.2336 73.5279C56.2907 73.5853 56.3586 73.6309 56.4335 73.662C56.5083 73.6931 56.5885 73.7091 56.6695 73.7091H63.4357C63.5167 73.7091 63.5969 73.6931 63.6717 73.662C63.7465 73.6309 63.8145 73.5853 63.8716 73.5279C63.9287 73.4704 63.9739 73.4022 64.0046 73.3273C64.0353 73.2523 64.0509 73.172 64.0505 73.091V72.9082L56.0547 72.9115Z" fill="#477CA8"/>
<path d="M45 20C45 21.3845 44.5895 22.7378 43.8203 23.889C43.0511 25.0401 41.9579 25.9373 40.6788 26.4672C39.3997 26.997 37.9922 27.1356 36.6344 26.8655C35.2765 26.5954 34.0292 25.9287 33.0503 24.9497C32.0713 23.9708 31.4046 22.7235 31.1345 21.3656C30.8644 20.0078 31.003 18.6003 31.5328 17.3212C32.0627 16.0421 32.9599 14.9489 34.111 14.1797C35.2622 13.4105 36.6155 13 38 13C39.8563 13.0008 41.6363 13.7385 42.9489 15.0511C44.2615 16.3637 44.9992 18.1437 45 20Z" fill="#B0D9EF"/>
<path d="M35 17V23H41V17H35ZM35.5455 17.5455H40.4545V22.4545H35.5455V17.5455ZM36.9091 18.0909C36.4606 18.0909 36.0909 18.4606 36.0909 18.9091V19.1818C36.0909 19.6303 36.4606 20 36.9091 20C37.3576 20 37.7273 19.6303 37.7273 19.1818V18.9091C37.7273 18.4606 37.3576 18.0909 36.9091 18.0909ZM38.9801 18.0909L36.3636 21.9091H37.0199L39.6364 18.0909H38.9801ZM36.9091 18.6364C37.0636 18.6364 37.1818 18.7546 37.1818 18.9091V19.1818C37.1818 19.3363 37.0636 19.4545 36.9091 19.4545C36.7546 19.4545 36.6364 19.3363 36.6364 19.1818V18.9091C36.6364 18.7546 36.7546 18.6364 36.9091 18.6364ZM39.0909 20C38.6424 20 38.2727 20.3697 38.2727 20.8182V21.0909C38.2727 21.5394 38.6424 21.9091 39.0909 21.9091C39.5394 21.9091 39.9091 21.5394 39.9091 21.0909V20.8182C39.9091 20.3697 39.5394 20 39.0909 20ZM39.0909 20.5455C39.2454 20.5455 39.3636 20.6637 39.3636 20.8182V21.0909C39.3636 21.2454 39.2454 21.3636 39.0909 21.3636C38.9364 21.3636 38.8182 21.2454 38.8182 21.0909V20.8182C38.8182 20.6637 38.9364 20.5455 39.0909 20.5455Z" fill="#477CA8"/>
<path d="M38 27C36.6155 27 35.2622 26.5895 34.111 25.8203C32.9599 25.0511 32.0627 23.9579 31.5328 22.6788C31.003 21.3997 30.8644 19.9922 31.1345 18.6344C31.4046 17.2765 32.0713 16.0292 33.0503 15.0503C34.0292 14.0713 35.2765 13.4046 36.6344 13.1345C37.9922 12.8644 39.3997 13.003 40.6788 13.5328C41.9579 14.0627 43.0511 14.9599 43.8203 16.111C44.5895 17.2622 45 18.6155 45 20C44.9978 21.8558 44.2596 23.635 42.9473 24.9473C41.635 26.2596 39.8558 26.9978 38 27ZM38 13.8317C36.78 13.8317 35.5874 14.1935 34.5731 14.8712C33.5587 15.549 32.7681 16.5124 32.3012 17.6395C31.8344 18.7666 31.7122 20.0068 31.9502 21.2034C32.1882 22.3999 32.7757 23.499 33.6383 24.3617C34.501 25.2243 35.6001 25.8118 36.7966 26.0498C37.9932 26.2878 39.2334 26.1656 40.3605 25.6988C41.4876 25.2319 42.451 24.4413 43.1288 23.4269C43.8066 22.4126 44.1683 21.22 44.1683 20C44.1661 18.365 43.5154 16.7976 42.3591 15.6418C41.2027 14.4859 39.635 13.8359 38 13.8345V13.8317Z" fill="#477CA8"/>
<path d="M25 20C25 21.3845 24.5895 22.7378 23.8203 23.889C23.0511 25.0401 21.9579 25.9373 20.6788 26.4672C19.3997 26.997 17.9922 27.1356 16.6344 26.8655C15.2765 26.5954 14.0292 25.9287 13.0503 24.9497C12.0713 23.9708 11.4046 22.7235 11.1345 21.3656C10.8644 20.0078 11.003 18.6003 11.5328 17.3212C12.0627 16.0421 12.9599 14.9489 14.111 14.1797C15.2622 13.4105 16.6155 13 18 13C19.8563 13.0008 21.6363 13.7385 22.9489 15.0511C24.2615 16.3637 24.9992 18.1437 25 20Z" fill="#D8E5ED"/>
<path d="M18 17C16.3457 17 15 18.3457 15 20C15 21.6543 16.3457 23 18 23C19.6543 23 21 21.6543 21 20C21 18.3457 19.6543 17 18 17ZM18 17.5C19.3838 17.5 20.5 18.6162 20.5 20C20.5 21.3838 19.3838 22.5 18 22.5C16.6162 22.5 15.5 21.3838 15.5 20C15.5 18.6162 16.6162 17.5 18 17.5ZM17.75 18V20.25H19.5V19.75H18.25V18H17.75Z" fill="#477CA8"/>
<path d="M18 27C16.6155 27 15.2622 26.5895 14.111 25.8203C12.9599 25.0511 12.0627 23.9579 11.5328 22.6788C11.003 21.3997 10.8644 19.9922 11.1345 18.6344C11.4046 17.2765 12.0713 16.0292 13.0503 15.0503C14.0292 14.0713 15.2765 13.4046 16.6344 13.1345C17.9922 12.8644 19.3997 13.003 20.6788 13.5328C21.9579 14.0627 23.0511 14.9599 23.8203 16.111C24.5895 17.2622 25 18.6155 25 20C24.9978 21.8558 24.2596 23.635 22.9473 24.9473C21.635 26.2596 19.8558 26.9978 18 27ZM18 13.8317C16.78 13.8317 15.5874 14.1935 14.5731 14.8712C13.5587 15.549 12.7681 16.5124 12.3012 17.6395C11.8344 18.7666 11.7122 20.0068 11.9502 21.2034C12.1882 22.3999 12.7757 23.499 13.6383 24.3617C14.501 25.2243 15.6001 25.8118 16.7966 26.0498C17.9932 26.2878 19.2334 26.1656 20.3605 25.6988C21.4876 25.2319 22.451 24.4413 23.1288 23.4269C23.8066 22.4126 24.1683 21.22 24.1683 20C24.1661 18.365 23.5154 16.7976 22.3591 15.6418C21.2027 14.4859 19.635 13.8359 18 13.8345V13.8317Z" fill="#477CA8"/>
<path d="M77 22C77 24.1756 76.3549 26.3023 75.1462 28.1113C73.9375 29.9202 72.2195 31.3301 70.2095 32.1627C68.1995 32.9952 65.9878 33.2131 63.854 32.7886C61.7202 32.3642 59.7602 31.3165 58.2218 29.7782C56.6834 28.2398 55.6358 26.2798 55.2114 24.146C54.7869 22.0122 55.0048 19.8005 55.8373 17.7905C56.6699 15.7805 58.0798 14.0625 59.8887 12.8538C61.6977 11.6451 63.8244 11 66 11C68.917 11.0012 71.7142 12.1605 73.7768 14.2232C75.8395 16.2858 76.9988 19.083 77 22Z" fill="white"/>
<path d="M66 34C63.6266 34 61.3066 33.2962 59.3332 31.9776C57.3598 30.6591 55.8217 28.7849 54.9135 26.5922C54.0052 24.3995 53.7676 21.9867 54.2306 19.6589C54.6936 17.3311 55.8365 15.193 57.5147 13.5147C59.193 11.8365 61.3311 10.6936 63.6589 10.2306C65.9867 9.76756 68.3995 10.0052 70.5922 10.9134C72.7849 11.8217 74.6591 13.3598 75.9776 15.3332C77.2962 17.3066 78 19.6266 78 22C77.9962 25.1814 76.7307 28.2315 74.4811 30.4811C72.2315 32.7307 69.1814 33.9962 66 34ZM66 11.4257C63.9086 11.4257 61.8642 12.0459 60.1253 13.2078C58.3863 14.3697 57.031 16.0212 56.2307 17.9534C55.4303 19.8856 55.2209 22.0117 55.6289 24.0629C56.0369 26.1141 57.044 27.9983 58.5229 29.4771C60.0017 30.956 61.8859 31.9631 63.9371 32.3711C65.9883 32.7791 68.1144 32.5697 70.0466 31.7693C71.9788 30.969 73.6303 29.6137 74.7922 27.8747C75.9541 26.1358 76.5743 24.0914 76.5743 22C76.5705 19.1971 75.4551 16.5102 73.4727 14.5287C71.4903 12.5472 68.8029 11.433 66 11.4305V11.4257Z" fill="#477CA8"/>
<path d="M34.2905 35.2256H1.47656V47.5482H34.2905V35.2256Z" fill="white"/>
<path d="M34.7894 48.0467H0.978516V34.7271H34.7894V48.0467ZM1.97549 47.0497H33.7924V35.724H1.97549V47.0497Z" fill="#477CA8"/>
<path d="M34.2905 35.2256H1.47656V38.1368H34.2905V35.2256Z" fill="#D8E5ED"/>
<path d="M34.6231 38.4694H1.14453V34.8936H34.6231V38.4694ZM1.80918 37.8047H33.9584V35.5582H1.80918V37.8047Z" fill="#477CA8"/>
<path d="M3.2654 36.1528H2.41797V37.1498H3.2654V36.1528Z" fill="#477CA8"/>
<path d="M4.90954 36.1528H4.06543V37.1498H4.90954V36.1528Z" fill="#477CA8"/>
<path d="M6.55797 36.1528H5.71387V37.1498H6.55797V36.1528Z" fill="#477CA8"/>
<path d="M8.67903 45.5476V44.8431C8.67903 44.4597 8.52673 44.092 8.25562 43.8209C7.98451 43.5498 7.61681 43.3975 7.23341 43.3975H4.70441C4.321 43.3975 3.9533 43.5498 3.6822 43.8209C3.41109 44.092 3.25879 44.4597 3.25879 44.8431V45.5642L8.67903 45.5476Z" fill="#B5D1DE"/>
<path d="M7.23252 41.0313C7.23252 40.7809 7.15826 40.5361 7.01914 40.3279C6.88001 40.1196 6.68226 39.9574 6.4509 39.8615C6.21954 39.7657 5.96496 39.7406 5.71934 39.7895C5.47373 39.8383 5.24812 39.9589 5.07104 40.136C4.89397 40.3131 4.77338 40.5387 4.72452 40.7843C4.67567 41.0299 4.70074 41.2845 4.79658 41.5158C4.89241 41.7472 5.0547 41.9449 5.26292 42.0841C5.47114 42.2232 5.71593 42.2975 5.96636 42.2975C6.30216 42.2975 6.62422 42.1641 6.86167 41.9266C7.09912 41.6892 7.23252 41.3671 7.23252 41.0313Z" fill="#B5D1DE"/>
<path d="M21.2836 41.5898H9.81836V42.2545H21.2836V41.5898Z" fill="#B5D1DE"/>
<path d="M17.4951 43.0454H9.81836V43.7101H17.4951V43.0454Z" fill="#B5D1DE"/>
<path d="M32.297 39.9048H26.6475V45.5543H32.297V39.9048Z" fill="#B0D9EF"/>
<path d="M29.5125 44.431L29.0439 43.9624L30.3566 42.6464L29.0439 41.3337L29.5125 40.8618L31.2971 42.6464L29.5125 44.431Z" fill="#477CA8"/>
<path d="M30.5491 42.314H27.5615V42.9786H30.5491V42.314Z" fill="#477CA8"/>
<path d="M26.8832 54.3047H17.2059C16.8241 54.3047 16.5146 54.6142 16.5146 54.9959V75.3875C16.5146 75.7692 16.8241 76.0787 17.2059 76.0787H26.8832C27.265 76.0787 27.5745 75.7692 27.5745 75.3875V54.9959C27.5745 54.6142 27.265 54.3047 26.8832 54.3047Z" fill="white"/>
<path d="M26.8837 76.5772H17.2063C16.8908 76.5772 16.5882 76.4518 16.3651 76.2287C16.1419 76.0056 16.0166 75.703 16.0166 75.3874V54.9959C16.0175 54.6806 16.1431 54.3785 16.366 54.1556C16.589 53.9327 16.8911 53.807 17.2063 53.8062H26.8837C27.1989 53.807 27.501 53.9327 27.724 54.1556C27.9469 54.3785 28.0725 54.6806 28.0734 54.9959V75.3874C28.0734 75.703 27.948 76.0056 27.7249 76.2287C27.5018 76.4518 27.1992 76.5772 26.8837 76.5772ZM17.2063 54.8131C17.181 54.8131 17.156 54.8181 17.1326 54.8278C17.1092 54.8375 17.0879 54.8517 17.07 54.8696C17.0521 54.8875 17.0379 54.9087 17.0282 54.9321C17.0186 54.9555 17.0136 54.9805 17.0136 55.0059V75.3974C17.0136 75.4227 17.0186 75.4478 17.0282 75.4712C17.0379 75.4946 17.0521 75.5158 17.07 75.5337C17.0879 75.5516 17.1092 75.5658 17.1326 75.5755C17.156 75.5852 17.181 75.5902 17.2063 75.5902H26.8837C26.9348 75.5902 26.9838 75.5699 27.02 75.5337C27.0561 75.4976 27.0764 75.4485 27.0764 75.3974V54.9959C27.0764 54.9448 27.0561 54.8957 27.02 54.8596C26.9838 54.8234 26.9348 54.8031 26.8837 54.8031L17.2063 54.8131Z" fill="#477CA8"/>
<path d="M27.548 73.1904H16.5381V73.8551H27.548V73.1904Z" fill="#477CA8"/>
<path d="M27.548 56.5312H16.5381V57.1959H27.548V56.5312Z" fill="#477CA8"/>
<path d="M23.8927 55.1851H20.1973V55.8497H23.8927V55.1851Z" fill="#477CA8"/>
<path d="M22.4934 74.1709H21.5928V74.8355H22.4934V74.1709Z" fill="#477CA8"/>
<path d="M89.1383 40.2402H42.9648V67.491H89.1383V40.2402Z" fill="white"/>
<path d="M89.6362 67.9894H42.4658V39.7417H89.6362V67.9894ZM43.4628 66.9925H88.6392V40.7387H43.4628V66.9925Z" fill="#477CA8"/>
<path d="M89.1383 40.2402H42.9648V43.1514H89.1383V40.2402Z" fill="#D8E5ED"/>
<path d="M89.4699 43.484H42.6318V39.9082H89.4699V43.484ZM43.2965 42.8194H88.8052V40.5729H43.2965V42.8194Z" fill="#477CA8"/>
<path d="M44.7523 41.1675H43.9082V42.1645H44.7523V41.1675Z" fill="#477CA8"/>
<path d="M46.4008 41.1675H45.5566V42.1645H46.4008V41.1675Z" fill="#477CA8"/>
<path d="M48.0492 41.1675H47.2051V42.1645H48.0492V41.1675Z" fill="#477CA8"/>
<path d="M87.58 65.0488H56.873V45.1724H57.2054V64.7165H87.58V65.0488Z" fill="#B0D9EF"/>
<path d="M49.9698 54.2514C48.9563 54.2537 47.9768 53.8862 47.2148 53.2179L50.1061 50.3267H54.1339C54.0712 51.3885 53.6051 52.3862 52.8311 53.1158C52.057 53.8453 51.0335 54.2516 49.9698 54.2514Z" fill="#B0D9EF"/>
<path d="M50.2354 49.6917V45.9165C51.2278 45.975 52.166 46.3886 52.8787 47.0818C53.5914 47.7749 54.0309 48.7013 54.1169 49.6917H50.2354Z" fill="#F5B1AE"/>
<path d="M49.95 55.4575C48.6343 55.4583 47.3642 54.9758 46.3809 54.1016L46.8228 53.6064C47.3862 54.1055 48.061 54.4622 48.7906 54.6467C49.5203 54.8313 50.2835 54.8383 51.0164 54.6671C51.7493 54.4959 52.4304 54.1515 53.0028 53.6629C53.5752 53.1742 54.0222 52.5555 54.3062 51.8585C54.5902 51.1616 54.703 50.4067 54.6352 49.6572C54.5674 48.9076 54.3209 48.1852 53.9164 47.5506C53.512 46.9159 52.9612 46.3874 52.3104 46.0094C51.6596 45.6314 50.9277 45.4149 50.176 45.378L50.2059 44.7134C51.6238 44.7573 52.9667 45.3601 53.9419 46.3902C54.9171 47.4204 55.4454 48.7943 55.4117 50.2125C55.3779 51.6306 54.7847 52.9778 53.7616 53.9604C52.7385 54.9429 51.3684 55.4811 49.95 55.4575Z" fill="#477CA8"/>
<path d="M46.0021 53.1013C45.4772 52.4133 45.1412 51.6001 45.0275 50.7423C44.9137 49.8845 45.0261 49.0119 45.3536 48.2109C45.681 47.4099 46.2121 46.7084 46.8942 46.1759C47.5763 45.6435 48.3857 45.2985 49.2422 45.1753V49.8013L46.0021 53.1013Z" fill="white"/>
<path d="M48.91 45.5641V49.655L46.0454 52.5828C45.6437 51.9572 45.3985 51.2441 45.3305 50.5038C45.2625 49.7635 45.3736 49.0176 45.6546 48.3293C45.9355 47.641 46.378 47.0304 46.9446 46.5491C47.5112 46.0678 48.1853 45.7299 48.91 45.5641ZM49.5747 44.7964C48.5878 44.8655 47.64 45.2096 46.8386 45.7897C46.0372 46.3698 45.4143 47.1627 45.0404 48.0786C44.6665 48.9945 44.5565 49.9969 44.723 50.9721C44.8895 51.9473 45.3257 52.8564 45.9823 53.5964L49.5747 49.9408V44.7964Z" fill="#477CA8"/>
<path d="M48.2889 57.4683H46.0723V58.1329H48.2889V57.4683Z" fill="#F5B1AE"/>
<path d="M54.0216 57.4683H49.3125V58.1329H54.0216V57.4683Z" fill="#477CA8"/>
<path d="M48.2889 59.2959H46.0723V59.9605H48.2889V59.2959Z" fill="#B2DDC9"/>
<path d="M54.0216 59.2959H49.3125V59.9605H54.0216V59.2959Z" fill="#477CA8"/>
<path d="M48.2889 61.124H46.0723V61.7887H48.2889V61.124Z" fill="#D8E5ED"/>
<path d="M54.0216 61.124H49.3125V61.7887H54.0216V61.124Z" fill="#477CA8"/>
<path d="M86.307 46.7871H57.0391V47.1194H86.307V46.7871Z" fill="#D8E5ED"/>
<path d="M86.307 49.416H57.0391V49.7483H86.307V49.416Z" fill="#D8E5ED"/>
<path d="M86.307 52.0444H57.0391V52.3768H86.307V52.0444Z" fill="#D8E5ED"/>
<path d="M86.307 54.6733H57.0391V55.0057H86.307V54.6733Z" fill="#D8E5ED"/>
<path d="M86.307 57.3022H57.0391V57.6346H86.307V57.3022Z" fill="#D8E5ED"/>
<path d="M86.307 59.9307H57.0391V60.263H86.307V59.9307Z" fill="#D8E5ED"/>
<path d="M86.307 62.5562H57.0391V62.8885H86.307V62.5562Z" fill="#D8E5ED"/>
<path d="M74.7483 64.9155H74.416V65.9723H74.7483V64.9155Z" fill="#D8E5ED"/>
<path d="M72.2024 64.9155H71.8701V65.9723H72.2024V64.9155Z" fill="#D8E5ED"/>
<path d="M69.6575 64.9155H69.3252V65.9723H69.6575V64.9155Z" fill="#D8E5ED"/>
<path d="M65.5 15V16.1274C64.082 16.384 63 17.7197 63 19.3077C63 20.2647 63.416 21.003 63.9688 21.4784C64.5215 21.9537 65.1875 22.2188 65.8125 22.488C66.4375 22.7572 67.0215 23.0307 67.4062 23.363C67.791 23.6953 68 24.0319 68 24.6923C68 25.8534 67.1035 26.8462 66 26.8462C64.8906 26.8462 64 25.887 64 24.6923V24.1538H63V24.6923C63 26.2888 64.082 27.616 65.5 27.8726V29H66.5V27.8726C67.9219 27.6139 69 26.2677 69 24.6923C69 23.7332 68.584 22.9991 68.0312 22.5216C67.4785 22.0442 66.8125 21.7644 66.1875 21.4952C65.5625 21.226 64.9785 20.9672 64.5938 20.637C64.209 20.3068 64 19.9639 64 19.3077C64 18.1277 64.8926 17.1538 66 17.1538C67.1094 17.1538 68 18.113 68 19.3077V19.8462H69V19.3077C69 17.7112 67.918 16.384 66.5 16.1274V15H65.5Z" fill="#477CA8"/>
<path d="M67.1146 64.9155H66.7822V65.9723H67.1146V64.9155Z" fill="#D8E5ED"/>
<path d="M64.5687 64.9155H64.2363V65.9723H64.5687V64.9155Z" fill="#D8E5ED"/>
<path d="M62.0237 64.9155H61.6914V65.9723H62.0237V64.9155Z" fill="#D8E5ED"/>
<path d="M59.4778 64.9155H59.1455V65.9723H59.4778V64.9155Z" fill="#D8E5ED"/>
<path d="M87.473 64.9155H87.1406V65.9723H87.473V64.9155Z" fill="#D8E5ED"/>
<path d="M84.928 64.9155H84.5957V65.9723H84.928V64.9155Z" fill="#D8E5ED"/>
<path d="M82.3851 64.9155H82.0527V65.9723H82.3851V64.9155Z" fill="#D8E5ED"/>
<path d="M79.8392 64.9155H79.5068V65.9723H79.8392V64.9155Z" fill="#D8E5ED"/>
<path d="M77.2942 64.9155H76.9619V65.9723H77.2942V64.9155Z" fill="#D8E5ED"/>
<path d="M58.9432 62.7689L58.4082 61.9281L70.1792 54.4807L77.3076 56.7173L83.891 50.8052L84.5589 51.5463L77.5502 57.8405L70.3188 55.5707L58.9432 62.7689Z" fill="#F5B1AE"/>
<path d="M70.9931 60.2531L64.9248 55.9794L58.8333 59.2628L58.5176 58.6779L64.9714 55.1985L70.9001 59.3758L77.6729 52.1045L83.8807 54.4341L83.6448 55.0555L77.8557 52.8821L70.9931 60.2531Z" fill="#B0D9EF"/>
<path d="M25.6167 64.5867C25.6167 65.2937 25.4069 65.9848 25.0139 66.5725C24.6209 67.1602 24.0624 67.6181 23.409 67.8882C22.7556 68.1583 22.0368 68.2284 21.3436 68.0898C20.6503 67.9511 20.0137 67.6099 19.5145 67.1093C19.0153 66.6086 18.6758 65.9712 18.5391 65.2775C18.4024 64.5838 18.4746 63.8652 18.7465 63.2126C19.0184 62.56 19.4779 62.0027 20.0667 61.6114C20.6555 61.22 21.3472 61.0122 22.0542 61.0142C22.9999 61.0168 23.906 61.3944 24.5739 62.0641C25.2417 62.7337 25.6167 63.6409 25.6167 64.5867Z" fill="#B0D9EF"/>
<path d="M21.3566 66.3079L20.2998 65.2478L20.7684 64.7759L21.3566 65.3674L23.5932 63.1309L24.0651 63.5994L21.3566 66.3079Z" fill="#477CA8"/>
</svg>
