<svg width="96" height="96" viewBox="0 0 96 96" fill="none" xmlns="http://www.w3.org/2000/svg">
<path d="M48.0001 3.69238C23.5254 3.69238 3.69238 23.5254 3.69238 48.0001C3.69238 72.4748 23.5254 92.3078 48.0001 92.3078C48.0792 92.3078 48.1583 92.3078 48.2374 92.3078V3.69238C48.1583 3.69238 48.0792 3.69238 48.0001 3.69238Z" fill="#D1495D"/>
<path d="M92.3079 48.0001C92.3079 23.6045 72.6068 3.82425 48.2375 3.69238V92.3078C72.6068 92.1759 92.3079 72.3957 92.3079 48.0001Z" fill="#C7374A"/>
<path d="M55.8594 59.3669V56.5977H40.8V66.8306L55.8594 59.3669Z" fill="#FCC57F"/>
<path d="M40.8 45.7061V67.4907C40.8 71.5786 44.5715 73.4247 48.3429 73.3192V45.7061H40.8Z" fill="#FFD8AA"/>
<path d="M55.8593 67.4907V45.7061H48.3428V73.3193C52.1142 73.1874 55.8593 71.1566 55.8593 67.4907Z" fill="#FCC57F"/>
<path d="M48.3429 24.7119C16.4571 24.7119 29.3802 66.8306 48.3429 66.8306V24.7119Z" fill="#FFE6C8"/>
<path d="M48.3428 24.7119V66.8306C67.3054 66.8306 80.2021 24.7119 48.3428 24.7119Z" fill="#F4DBAD"/>
<path d="M47.789 22.8662C38.5846 22.8662 31.2791 31.5431 29.9076 34.7871C28.5362 38.031 28.1933 38.6376 28.4307 42.119C28.6681 45.6003 32.0703 48.1058 32.5977 44.308C33.2571 39.6135 36.2901 33.9168 40.7736 30.8047C41.8549 30.0662 45.0725 31.6223 48.3164 33.3629V22.8926C48.1582 22.8662 47.9736 22.8662 47.789 22.8662Z" fill="#FBB762"/>
<path d="M53.3801 29.697C58.4703 31.8332 63.1648 36.7651 65.1428 43.7805C65.934 46.5497 67.3845 44.9673 68.0175 42.7255C68.6505 40.4838 68.334 37.7937 66.9626 35.2882C67.1999 35.7102 55.9384 23.4728 48.3428 22.8926V33.3629C51.4549 35.0244 54.5933 36.7915 55.8856 36.8179C57.6527 36.8442 51.6131 28.9321 53.3801 29.697Z" fill="#E5A85A"/>
<path d="M27.6659 40.9847C29.9868 49.9254 32.8615 44.8616 32.7296 41.0111C32.6241 37.1605 35.9472 28.7473 47.789 28.4572C47.9736 28.4572 48.1582 28.4836 48.3428 28.4836V15.666C32.0703 15.9034 25.3714 32.0968 27.6659 40.9847Z" fill="#FBB762"/>
<path d="M64.0087 40.8792C64.3516 46.2858 66.2241 46.7869 68.545 41.855C70.8658 36.9232 65.1955 15.6924 48.712 15.6396H48.6856H48.6593C48.5538 15.6396 48.4483 15.6396 48.3428 15.6396V28.4836C58.6549 28.721 63.6658 35.5781 64.0087 40.8792Z" fill="#E5A85A"/>
<path d="M27.2704 39.2179C26.11 39.4817 25.6616 41.8553 26.2419 44.5454C26.8484 47.2355 28.2726 49.2135 29.4331 48.9498C30.5935 48.6861 31.0419 46.3124 30.4616 43.6223C29.855 40.9322 28.4309 38.9542 27.2704 39.2179Z" fill="#FFE6C8"/>
<path d="M68.7824 39.2179C69.9428 39.4817 70.3912 41.8553 69.811 44.5454C69.2044 47.2355 67.7802 49.2135 66.6198 48.9498C65.4594 48.6861 65.011 46.3124 65.5912 43.6223C66.1978 40.9322 67.622 38.9542 68.7824 39.2179Z" fill="#FFE6C8"/>
<path d="M48.3429 71.1561C43.0682 71.0769 37.5825 71.9473 28.9055 77.5912C26.611 79.0682 24.5275 82.2066 22.8396 85.5824C29.6704 89.8286 37.7407 92.3077 46.3649 92.3077C47.0242 92.3077 47.6836 92.255 48.3429 92.2286V71.7363C48.2374 71.7099 48.4484 71.1561 48.3429 71.1561Z" fill="#EDEDED"/>
<path d="M67.1735 77.5914C58.6285 72.2376 53.4065 71.2881 48.3428 71.1562V92.2024C57.2834 91.8068 65.9076 89.4859 72.7384 84.5804C71.2351 81.864 69.1252 78.8046 67.1735 77.5914Z" fill="#DBDBDB"/>
<path d="M41.3274 71.2354L46.4439 83.4727L44.6241 92.2552C45.8637 92.3079 46.3911 92.3079 47.9999 92.2552C48.1054 92.2552 48.2109 92.2552 48.3164 92.2552V71.1562C46.0746 71.1562 43.8329 71.1826 41.3274 71.2354Z" fill="#5BC0A0"/>
<path d="M49.6087 83.4727L54.7252 71.2354C52.4571 71.1826 50.3999 71.1826 48.3428 71.1826V92.2815C49.2659 92.2551 49.9516 92.176 50.9538 92.0969L49.6087 83.4727Z" fill="#66AD97"/>
<path d="M41.0111 66.8311L35.4463 73.9256L38.9276 80.3871L48.1056 71.1563L41.0111 66.8311Z" fill="white"/>
<path d="M55.4903 66.8311L61.4243 74.4003L57.6001 80.3871L48.4221 71.1563L55.4903 66.8311Z" fill="#EDEDED"/>
<path d="M48 95.789C21.6527 95.789 0.210938 74.3472 0.210938 48C0.210938 21.6527 21.6527 0.210938 48 0.210938C74.3472 0.210938 95.789 21.6527 95.789 48C95.789 74.3472 74.3472 95.789 48 95.789ZM48 3.98237C23.7362 3.98237 3.98237 23.7362 3.98237 48C3.98237 72.2637 23.7098 92.0175 48 92.0175C72.2637 92.0175 92.0175 72.2637 92.0175 48C92.0175 23.7362 72.2637 3.98237 48 3.98237Z" fill="#F1F1F2"/>
</svg>
