<?xml version="1.0" standalone="no"?>
<!DOCTYPE svg PUBLIC "-//W3C//DTD SVG 1.1//EN" "http://www.w3.org/Graphics/SVG/1.1/DTD/svg11.dtd" >
<svg xmlns="http://www.w3.org/2000/svg">
<metadata>Generated by IcoMoon</metadata>
<defs>
<font id="icomoon" horiz-adv-x="1024">
<font-face units-per-em="1024" ascent="960" descent="-64" />
<missing-glyph horiz-adv-x="1024" />
<glyph unicode="&#x20;" horiz-adv-x="512" d="" />
<glyph unicode="&#xe900;" glyph-name="format-cells1" d="M341.333 86.187v88.747c-54.613 0-102.4 13.653-136.533 40.96l20.48 61.44c34.133-20.48 75.093-40.96 129.707-40.96 61.44 0 102.4 34.133 102.4 88.747 0 47.787-34.133 81.92-102.4 102.4-88.747 34.133-143.36 75.093-143.36 157.013 0 75.093 54.613 129.707 136.533 143.36v88.747h54.613v-88.747c54.613 0 88.747-13.653 116.053-34.133l-27.307-54.613c-13.653 13.653-54.613 27.307-109.227 27.307-68.267 0-95.573-40.96-95.573-75.093 0-47.787 34.133-68.267 109.227-102.4 88.747-34.133 136.533-81.92 136.533-163.84 0-68.267-47.787-136.533-143.36-150.187v-95.573h-47.787zM88.747 960c-47.787 0-88.747-40.96-88.747-88.747v-846.507c0-47.787 40.96-88.747 88.747-88.747h846.507c47.787 0 88.747 40.96 88.747 88.747v846.507c0 47.787-40.96 88.747-88.747 88.747h-846.507zM95.573 830.293c0 27.307 20.48 54.613 54.613 54.613h464.213v-873.813h-464.213c-27.307 0-54.613 20.48-54.613 54.613v764.587zM703.147 721.067v163.84h177.493c27.307 0 47.787-20.48 47.787-47.787v-109.227l-225.28-6.827zM703.147 482.133v177.493h232.107v-170.667l-232.107-6.827zM703.147 243.2v177.493h232.107v-177.493h-232.107zM703.147 11.093v170.667h232.107v-116.053c0-27.307-20.48-47.787-47.787-47.787l-184.32-6.827z" />
<glyph unicode="&#xe901;" glyph-name="conditional-formatting" d="M600.747 359.253c6.827-6.827 20.48 0 20.48 6.827 6.827 6.827 0 20.48-6.827 20.48l-102.4 68.267 102.4 68.267c6.827 6.827 6.827 13.653 6.827 20.48-6.827 6.827-13.653 6.827-20.48 0l-122.88-81.92c-6.827 0-6.827-6.827-6.827-13.653s0-13.653 6.827-13.653l122.88-75.093zM696.32 304.64c-6.827 6.827-20.48 0-20.48-6.827-6.827-6.827 0-20.48 6.827-20.48l102.4-68.267-102.4-68.267c-6.827-6.827-6.827-13.653-6.827-20.48 6.827-6.827 13.653-6.827 20.48-6.827l129.707 81.92c6.827 0 6.827 6.827 6.827 13.653s0 13.653-6.827 13.653l-129.707 81.92zM484.693 222.72h122.88c6.827 0 13.653 6.827 13.653 13.653s-6.827 20.48-13.653 20.48h-122.88c-6.827 0-13.653-6.827-13.653-13.653s6.827-20.48 13.653-20.48zM512 161.28h122.88c6.827 0 13.653 6.827 13.653 13.653s-6.827 13.653-13.653 13.653h-122.88c-6.827 0-13.653-6.827-13.653-13.653-6.827-6.827 0-13.653 13.653-13.653zM689.493 434.347c-6.827 0-13.653-6.827-13.653-13.653s6.827-13.653 13.653-13.653h20.48l-6.827-13.653c-6.827-6.827 0-20.48 6.827-20.48 6.827-6.827 20.48 0 20.48 6.827l13.653 27.307h68.267c6.827 0 13.653 6.827 13.653 13.653s-6.827 13.653-13.653 13.653h-54.613l13.653 27.307h40.96c6.827 0 13.653 6.827 13.653 13.653s-6.827 20.48-13.653 20.48h-27.307l6.827 20.48c6.827 6.827 0 20.48-6.827 20.48-6.827 6.827-20.48 0-20.48-6.827l-13.653-34.133h-61.44c-13.653 0-20.48-6.827-20.48-13.653s6.827-13.653 13.653-13.653h47.787l-13.653-27.307h-27.307zM942.080 960h-860.16c-47.787 0-81.92-40.96-81.92-88.747v-853.333c0-47.787 34.133-81.92 81.92-81.92h853.333c47.787 0 81.92 34.133 81.92 81.92v860.16c6.827 47.787-27.307 81.92-75.093 81.92zM375.467 871.253h245.76v-157.013h-245.76v157.013zM293.547 17.92h-150.187c-27.307 0-54.613 20.48-54.613 54.613v95.573h197.973v-150.187zM293.547 263.68h-197.973v136.533h197.973v-136.533zM293.547 495.787h-197.973v143.36h197.973v-143.36zM293.547 721.067h-197.973v102.4c0 27.307 20.48 54.613 54.613 54.613h150.187v-157.013zM928.427 72.533c0-27.307-20.48-54.613-54.613-54.613h-505.173v621.227h552.96v-566.613zM928.427 721.067h-245.76v150.187h191.147c27.307 0 54.613-20.48 54.613-54.613v-95.573z" />
</font></defs></svg>