<svg width="94" height="94" viewBox="0 0 94 94" fill="none" xmlns="http://www.w3.org/2000/svg">
<g clip-path="url(#clip0)">
<path d="M64.6609 90.7248C62.0819 93.3037 57.0901 94.6414 53.5676 93.6976L17.9636 84.1579C14.4411 83.2137 10.7863 79.5592 9.84281 76.0368L0.302778 40.4324C-0.641081 36.9099 0.696632 31.9181 3.27525 29.3391L29.339 3.27541C31.9179 0.697124 36.9097 -0.64059 40.4322 0.303269L76.0366 9.84297C79.5591 10.7872 83.2128 14.4409 84.157 17.9634L93.6974 53.5678C94.6409 57.0903 93.3035 62.0828 90.7246 64.6611L64.6609 90.7248Z" fill="#E7F4FC"/>
<path d="M66.15 37.93C61.1579 37.93 57.0967 33.8684 57.0967 28.8763C57.0967 23.8845 61.1579 19.8232 66.15 19.8232C71.1422 19.8232 75.2034 23.8845 75.2034 28.8763C75.2034 33.8684 71.1422 37.93 66.15 37.93ZM66.15 20.4866C61.5236 20.4866 57.7597 24.2505 57.7597 28.8766C57.7597 33.5031 61.5236 37.2672 66.15 37.2672C70.7765 37.2672 74.5403 33.5031 74.5403 28.8766C74.5403 24.2501 70.7765 20.4866 66.15 20.4866Z" fill="#B5D1DE"/>
<path d="M66.1506 37.93C63.2626 37.93 60.9131 33.8684 60.9131 28.8763C60.9131 23.8845 63.2626 19.8232 66.1506 19.8232C69.0385 19.8232 71.388 23.8845 71.388 28.8763C71.388 33.8684 69.0385 37.93 66.1506 37.93ZM66.1506 20.4866C63.6283 20.4866 61.5761 24.2505 61.5761 28.8766C61.5761 33.5031 63.628 37.2672 66.1506 37.2672C68.6732 37.2672 70.725 33.5031 70.725 28.8766C70.725 24.2501 68.6732 20.4866 66.1506 20.4866Z" fill="#B5D1DE"/>
<path d="M75.1017 28.5449H57.1992V29.208H75.1017V28.5449Z" fill="#B5D1DE"/>
<path d="M72.9205 23.9546H58.4609V24.6176H72.9205V23.9546Z" fill="#B5D1DE"/>
<path d="M73.3805 33.1353H58.9209V33.7983H73.3805V33.1353Z" fill="#B5D1DE"/>
<path d="M66.7109 19.9253H66.0479V37.8278H66.7109V19.9253Z" fill="#B5D1DE"/>
<path d="M12.4492 19.8149H11.7861V20.478H12.4492V19.8149Z" fill="#477CA8"/>
<path d="M12.4492 17.1626H11.7861V18.4887H12.4492V17.1626Z" fill="#477CA8"/>
<path d="M12.4492 15.8364H11.7861V14.8418H12.7807V15.5049H12.4492V15.8364Z" fill="#477CA8"/>
<path d="M76.7584 15.5049H75.4253V14.8418H76.7584V15.5049ZM74.0926 15.5049H72.7598V14.8418H74.0926V15.5049ZM71.4271 15.5049H70.094V14.8418H71.4271V15.5049ZM68.7613 15.5049H67.4282V14.8418H68.7613V15.5049ZM66.0955 15.5049H64.7624V14.8418H66.0955V15.5049ZM63.4297 15.5049H62.0966V14.8418H63.4297V15.5049ZM60.7638 15.5049H59.4311V14.8418H60.7638V15.5049ZM58.0984 15.5049H56.7653V14.8418H58.0984V15.5049ZM55.4325 15.5049H54.0995V14.8418H55.4325V15.5049ZM52.7667 15.5049H51.4337V14.8418H52.7667V15.5049ZM50.1009 15.5049H48.7678V14.8418H50.1009V15.5049ZM47.4351 15.5049H46.1024V14.8418H47.4351V15.5049ZM44.7696 15.5049H43.4366V14.8418H44.7696V15.5049ZM42.1038 15.5049H40.7707V14.8418H42.1038V15.5049ZM39.438 15.5049H38.1049V14.8418H39.438V15.5049ZM36.7722 15.5049H35.4391V14.8418H36.7722V15.5049ZM34.1064 15.5049H32.7736V14.8418H34.1064V15.5049ZM31.4409 15.5049H30.1078V14.8418H31.4409V15.5049ZM28.7751 15.5049H27.442V14.8418H28.7751V15.5049ZM26.1093 15.5049H24.7762V14.8418H26.1093V15.5049ZM23.4435 15.5049H22.1104V14.8418H23.4435V15.5049ZM20.778 15.5049H19.4449V14.8418H20.778V15.5049ZM18.1122 15.5049H16.7791V14.8418H18.1122V15.5049ZM15.4464 15.5049H14.1133V14.8418H15.4464V15.5049Z" fill="#477CA8"/>
<path d="M79.0864 15.8364H78.4233V15.5049H78.0918V14.8418H79.0864V15.8364Z" fill="#477CA8"/>
<path d="M79.0859 29.6999H78.4229V28.3131H79.0859V29.6999ZM79.0859 26.927H78.4229V25.5405H79.0859V26.927ZM79.0859 24.1541H78.4229V22.7676H79.0859V24.1541ZM79.0859 21.3815H78.4229V19.9947H79.0859V21.3815ZM79.0859 18.6086H78.4229V17.2222H79.0859V18.6086Z" fill="#477CA8"/>
<path d="M79.0859 31.0864H78.4229V31.7495H79.0859V31.0864Z" fill="#477CA8"/>
<path d="M47.9232 23.0467C52.2716 23.0467 55.7967 19.5216 55.7967 15.1733C55.7967 10.8249 52.2716 7.2998 47.9232 7.2998C43.5749 7.2998 40.0498 10.8249 40.0498 15.1733C40.0498 19.5216 43.5749 23.0467 47.9232 23.0467Z" fill="#B0D9EF"/>
<path d="M47.9231 23.5436C43.3076 23.5436 39.5527 19.7887 39.5527 15.1731C39.5527 10.5576 43.3076 6.80273 47.9231 6.80273C52.5387 6.80273 56.2939 10.5576 56.2939 15.1731C56.2939 19.7887 52.5387 23.5436 47.9231 23.5436ZM47.9231 7.79732C43.856 7.79732 40.5473 11.106 40.5473 15.1731C40.5473 19.2403 43.856 22.549 47.9231 22.549C51.9907 22.549 55.2993 19.2403 55.2993 15.1731C55.2993 11.106 51.9903 7.79732 47.9231 7.79732Z" fill="#477CA8"/>
<path d="M40.5622 45.48H7.82617V57.7743H40.5622V45.48Z" fill="white"/>
<path d="M41.06 58.2719H7.3291V44.9829H41.06V58.2719ZM8.32368 57.2773H40.0651V45.9775H8.32368V57.2773Z" fill="#477CA8"/>
<path d="M40.5622 45.4805H7.82617V48.3846H40.5622V45.4805Z" fill="#D8E5ED"/>
<path d="M40.8945 48.7157H7.49512V45.1484H40.8945V48.7157ZM8.15817 48.0526H40.2311V45.8115H8.15817V48.0526Z" fill="#477CA8"/>
<path d="M9.61132 46.4048H8.76758V47.3994H9.61132V46.4048Z" fill="#477CA8"/>
<path d="M11.2558 46.4048H10.4121V47.3994H11.2558V46.4048Z" fill="#477CA8"/>
<path d="M12.9004 46.4048H12.0566V47.3994H12.9004V46.4048Z" fill="#477CA8"/>
<path d="M15.0127 55.7788V55.0574C15.0127 54.261 14.3672 53.6152 13.5706 53.6152H11.0466C10.2506 53.6152 9.60449 54.2607 9.60449 55.0574V55.7788H15.0127Z" fill="#B5D1DE"/>
<path d="M12.309 52.534C13.0061 52.534 13.5711 51.9689 13.5711 51.2719C13.5711 50.5748 13.0061 50.0098 12.309 50.0098C11.6119 50.0098 11.0469 50.5748 11.0469 51.2719C11.0469 51.9689 11.6119 52.534 12.309 52.534Z" fill="#B5D1DE"/>
<path d="M27.5861 51.8281H16.1484V52.4912H27.5861V51.8281Z" fill="#B5D1DE"/>
<path d="M23.8054 53.2803H16.1484V53.9433H23.8054V53.2803Z" fill="#B5D1DE"/>
<path d="M38.5735 50.1494H32.9375V55.7854H38.5735V50.1494Z" fill="#D8E9C9"/>
<path d="M34.9058 54.6651L33.7461 53.5054L34.4493 52.8022L34.9058 53.2584L36.9785 51.186L37.6817 51.8892L34.9058 54.6651Z" fill="#477CA8"/>
<path d="M40.5622 60.7305H7.82617V73.0248H40.5622V60.7305Z" fill="white"/>
<path d="M41.06 73.5223H7.3291V60.2334H41.06V73.5223ZM8.32368 72.5278H40.0651V61.228H8.32368V72.5278Z" fill="#477CA8"/>
<path d="M40.5622 60.731H7.82617V63.6351H40.5622V60.731Z" fill="#D8E5ED"/>
<path d="M40.8945 63.9662H7.49512V60.3989H40.8945V63.9662ZM8.15817 63.3031H40.2311V61.062H8.15817V63.3031Z" fill="#477CA8"/>
<path d="M9.61132 61.6553H8.76758V62.6499H9.61132V61.6553Z" fill="#477CA8"/>
<path d="M11.2558 61.6553H10.4121V62.6499H11.2558V61.6553Z" fill="#477CA8"/>
<path d="M12.9004 61.6553H12.0566V62.6499H12.9004V61.6553Z" fill="#477CA8"/>
<path d="M15.0127 71.0293V70.3079C15.0127 69.5115 14.3672 68.8657 13.5706 68.8657H11.0466C10.2506 68.8657 9.60449 69.5112 9.60449 70.3079V71.0293H15.0127Z" fill="#B5D1DE"/>
<path d="M12.309 67.7845C13.0061 67.7845 13.5711 67.2194 13.5711 66.5224C13.5711 65.8253 13.0061 65.2603 12.309 65.2603C11.6119 65.2603 11.0469 65.8253 11.0469 66.5224C11.0469 67.2194 11.6119 67.7845 12.309 67.7845Z" fill="#B5D1DE"/>
<path d="M27.5861 67.0786H16.1484V67.7417H27.5861V67.0786Z" fill="#B5D1DE"/>
<path d="M23.8054 68.5308H16.1484V69.1938H23.8054V68.5308Z" fill="#B5D1DE"/>
<path d="M38.5735 65.3999H32.9375V71.0359H38.5735V65.3999Z" fill="#D8E9C9"/>
<path d="M34.9058 69.9986L33.7461 68.8389L34.4493 68.1357L34.9058 68.5919L36.9785 66.5195L37.6817 67.2227L34.9058 69.9986Z" fill="#477CA8"/>
<path d="M40.5622 30.23H7.82617V42.5243H40.5622V30.23Z" fill="white"/>
<path d="M41.06 43.0219H7.3291V29.7329H41.06V43.0219ZM8.32368 42.0273H40.0651V30.7275H8.32368V42.0273Z" fill="#477CA8"/>
<path d="M40.5622 30.2305H7.82617V33.1346H40.5622V30.2305Z" fill="#D8E5ED"/>
<path d="M40.8945 33.4657H7.49512V29.8984H40.8945V33.4657ZM8.15817 32.8026H40.2311V30.5615H8.15817V32.8026Z" fill="#477CA8"/>
<path d="M9.61132 31.1548H8.76758V32.1494H9.61132V31.1548Z" fill="#477CA8"/>
<path d="M11.2558 31.1548H10.4121V32.1494H11.2558V31.1548Z" fill="#477CA8"/>
<path d="M12.9004 31.1548H12.0566V32.1494H12.9004V31.1548Z" fill="#477CA8"/>
<path d="M15.0127 40.5288V39.8074C15.0127 39.011 14.3672 38.3652 13.5706 38.3652H11.0466C10.2506 38.3652 9.60449 39.0107 9.60449 39.8074V40.5288H15.0127Z" fill="#B5D1DE"/>
<path d="M12.309 37.284C13.0061 37.284 13.5711 36.7189 13.5711 36.0219C13.5711 35.3248 13.0061 34.7598 12.309 34.7598C11.6119 34.7598 11.0469 35.3248 11.0469 36.0219C11.0469 36.7189 11.6119 37.284 12.309 37.284Z" fill="#B5D1DE"/>
<path d="M27.5861 36.5781H16.1484V37.2412H27.5861V36.5781Z" fill="#B5D1DE"/>
<path d="M23.8054 38.0303H16.1484V38.6933H23.8054V38.0303Z" fill="#B5D1DE"/>
<path d="M38.5735 34.8994H32.9375V40.5354H38.5735V34.8994Z" fill="#B0D9EF"/>
<path d="M35.8094 39.9654L33.9121 38.07L34.6153 37.3662L35.8094 38.5597L37.0036 37.3662L37.7068 38.07L35.8094 39.9654Z" fill="#477CA8"/>
<path d="M36.3071 36.0049H35.3125V38.9866H36.3071V36.0049Z" fill="#477CA8"/>
<path d="M33.6853 20.2769H7.82617V26.366H33.6853V20.2769Z" fill="white"/>
<path d="M33.6858 20.2769H27.2764V26.366H33.6858V20.2769Z" fill="#B0D9EF"/>
<path d="M23.5184 22.9902H10.6992V23.6533H23.5184V22.9902Z" fill="#B0D9EF"/>
<path d="M30.2592 24.6478C29.3452 24.6478 28.6016 23.9042 28.6016 22.9902C28.6016 22.0761 29.3452 21.3325 30.2592 21.3325C31.1732 21.3325 31.9168 22.0761 31.9168 22.9902C31.9168 23.9042 31.1732 24.6478 30.2592 24.6478ZM30.2592 21.9956C29.7109 21.9956 29.2646 22.4418 29.2646 22.9902C29.2646 23.5385 29.7109 23.9847 30.2592 23.9847C30.8075 23.9847 31.2538 23.5385 31.2538 22.9902C31.2538 22.4418 30.8079 21.9956 30.2592 21.9956Z" fill="#477CA8"/>
<path d="M30.9219 23.9849L31.9165 24.9794L30.9219 23.9849Z" fill="white"/>
<path d="M32.1509 24.7447L31.1562 23.75L30.6874 24.2188L31.6821 25.2135L32.1509 24.7447Z" fill="#477CA8"/>
<path d="M34.1828 26.8635H7.3291V19.7798H34.1828V26.8635ZM8.32368 25.869H33.1882V20.7744H8.32368V25.869Z" fill="#477CA8"/>
<path d="M77.382 64.5436L73.3602 68.5703L65.4609 60.67L69.487 56.6489L77.382 64.5436Z" fill="#D8E5ED"/>
<path d="M73.3609 69.2739L64.7578 60.6697L69.4877 55.9458L78.0859 64.5433L73.3609 69.2739ZM66.1648 60.6704L73.3603 67.8669L76.6792 64.544L69.487 57.3525L66.1648 60.6704Z" fill="#477CA8"/>
<path d="M69.0167 33.7408C65.4753 30.2034 60.7752 28.255 55.7824 28.2583C50.777 28.2557 46.0703 30.213 42.5303 33.768C39.0085 37.3087 37.067 42.0024 37.0684 46.9787C37.0737 57.2968 45.4703 65.6964 55.7901 65.6904C60.7991 65.6904 65.5078 63.7284 69.0505 60.1748C72.5723 56.6354 74.5074 51.9456 74.5074 46.9707C74.5074 41.9779 72.5591 37.2775 69.0167 33.7408Z" fill="#D8E5ED"/>
<path d="M55.7793 66.1879C45.193 66.1876 36.5763 57.5705 36.5713 46.9792C36.57 41.8697 38.5611 37.0536 42.1778 33.4178C45.81 29.77 50.638 27.7612 55.7724 27.7612C60.9144 27.7612 65.7348 29.7597 69.3683 33.3892C73.0032 37.0181 75.0049 41.8419 75.0049 46.9713C75.0049 52.0821 73.0154 56.8962 69.4035 60.5261C65.7636 64.1775 60.9289 66.1883 55.7903 66.1883H55.7793V66.1879ZM55.7946 28.7558C50.9042 28.7558 46.3265 30.6604 42.8826 34.1193C39.4529 37.5672 37.5645 42.1343 37.5659 46.9789C37.5712 57.0222 45.7413 65.193 55.7793 65.1933V65.6906L55.7896 65.1933C60.6621 65.1933 65.2464 63.2864 68.6983 59.8243C72.1236 56.3817 74.01 51.8172 74.01 46.9709C74.01 42.1074 72.1117 37.534 68.6651 34.0927C65.2196 30.6512 60.6491 28.7558 55.7946 28.7558Z" fill="#477CA8"/>
<path d="M71.5425 46.934C71.5515 51.1676 69.9137 55.134 66.9349 58.1161C60.7931 64.2662 50.7955 64.2696 44.65 58.1207C41.6855 55.1552 40.0474 51.2097 40.0401 47.0049C40.0298 42.778 41.6669 38.8106 44.643 35.8334C47.6162 32.8573 51.57 31.2186 55.79 31.2192C60.002 31.2166 63.9635 32.8567 66.9369 35.8252C69.8991 38.787 71.5365 42.7286 71.5425 46.934Z" fill="white"/>
<path d="M91.4997 75.6805L84.4951 82.684L69.2227 67.4119L76.2275 60.4097L91.4997 75.6805Z" fill="#D8E5ED"/>
<path d="M84.4952 83.3871L68.5195 67.4114L76.2275 59.7061L92.2032 75.6804L84.4952 83.3871ZM69.9259 67.4117L84.4952 81.9807L90.7965 75.6804L76.2275 61.1127L69.9259 67.4117Z" fill="#477CA8"/>
<path d="M91.499 75.6806L84.4944 82.6841L71.8477 70.0364L78.8525 63.0342L91.499 75.6806Z" fill="#D8E9C9"/>
<path d="M84.4948 83.153L71.3789 70.0364L78.8525 62.5654L91.9681 75.681L84.4948 83.153ZM72.3168 70.0364L84.4948 82.2154L91.0305 75.6807L78.8529 63.503L72.3168 70.0364Z" fill="#477CA8"/>
<path d="M84.9742 73.6715L76.5137 65.21L84.9742 73.6715Z" fill="#D8E5ED"/>
<path d="M85.21 73.4437L76.749 64.9814L76.2801 65.4503L84.7411 73.9125L85.21 73.4437Z" fill="#477CA8"/>
<path d="M91.9978 77.7776C91.9978 80.7613 89.5766 83.1818 86.5902 83.1831C86.1582 82.7492 85.7259 82.3189 85.2939 81.8849C87.0968 80.0827 88.8986 78.2822 90.6992 76.48C91.1315 76.9106 91.5641 77.3433 91.9978 77.7776Z" fill="#D8E5ED"/>
<path d="M86.384 83.6805L84.5918 81.8839L84.9429 81.5332C86.7467 79.7303 88.5479 77.9301 90.3478 76.1283L90.6989 75.7769L91.051 76.1276C91.4836 76.5586 91.9166 76.9912 92.3506 77.4262L92.4958 77.5717V77.7773C92.4958 81.0306 89.8472 83.6788 86.5912 83.6802H86.384V83.6805ZM85.9975 81.8853L86.7925 82.6816C89.3399 82.5772 91.3931 80.5243 91.4962 77.9792C91.2303 77.713 90.9648 77.4474 90.6999 77.1829C89.1334 78.7507 87.5663 80.3178 85.9975 81.8853Z" fill="#477CA8"/>
<path d="M47.0918 69.0882V56.8372C47.0918 55.7266 48.1368 54.8262 49.4267 54.8262H62.2711C63.5614 54.8262 64.6064 55.7269 64.6064 56.8372V69.0882H47.0918Z" fill="#B0D9EF"/>
<path d="M65.1039 69.0884H64.1093V56.8374C64.1093 56.0027 63.2848 55.3237 62.2713 55.3237H49.427C48.4135 55.3237 47.5893 56.003 47.5893 56.8374V69.0884H46.5947V56.8374C46.5947 55.4543 47.8651 54.3291 49.427 54.3291H62.2713C63.8332 54.3291 65.1039 55.4546 65.1039 56.8374V69.0884Z" fill="#477CA8"/>
<path d="M50.4141 69.0882V57.7212C50.4141 56.7491 51.0622 55.9624 51.8622 55.9624H59.8348C60.6357 55.9624 61.2845 56.7491 61.2845 57.7212V69.0882H50.4141Z" fill="white"/>
<path d="M61.782 69.0885H60.7875V57.7214C60.7875 57.0258 60.3601 56.4599 59.835 56.4599H51.8624C51.3383 56.4599 50.9116 57.0258 50.9116 57.7214V69.0885H49.917V57.7214C49.917 56.4775 50.7899 55.4653 51.8624 55.4653H59.835C60.9085 55.4653 61.782 56.4775 61.782 57.7214V69.0885Z" fill="#477CA8"/>
<path d="M55.8503 59.045C57.6641 59.045 59.1397 57.5701 59.1397 55.7563V54.8257H52.5605V55.7563C52.5605 57.5697 54.0362 59.045 55.8503 59.045Z" fill="#B0D9EF"/>
<path d="M55.8505 59.5425C53.7622 59.5425 52.0635 57.8441 52.0635 55.7565V54.3286H59.6372V55.7565C59.6372 57.8441 57.9385 59.5425 55.8505 59.5425ZM53.0581 55.3232V55.7565C53.0581 57.2958 54.3106 58.548 55.8505 58.548C57.3901 58.548 58.6426 57.2958 58.6426 55.7565V55.3232H53.0581Z" fill="#477CA8"/>
<path d="M57.6208 55.7565C57.6208 56.7349 56.8278 57.5276 55.8498 57.5276C54.8711 57.5276 54.0781 56.7349 54.0781 55.7565V50.0881C54.0781 49.1097 54.8711 48.3164 55.8498 48.3164C56.8278 48.3164 57.6208 49.1097 57.6208 50.0881V55.7565Z" fill="white"/>
<path d="M55.85 58.0246C54.5992 58.0246 53.5811 57.0071 53.5811 55.7563V50.0878C53.5811 48.837 54.5988 47.8188 55.85 47.8188C57.1006 47.8188 58.1183 48.8366 58.1183 50.0878V55.7563C58.1183 57.0071 57.1006 58.0246 55.85 58.0246ZM55.85 48.8138C55.1475 48.8138 54.5756 49.3856 54.5756 50.0882V55.7566C54.5756 56.4588 55.1475 57.0303 55.85 57.0303C56.5522 57.0303 57.1238 56.4588 57.1238 55.7566V50.0882C57.1238 49.3856 56.5522 48.8138 55.85 48.8138Z" fill="#477CA8"/>
<path d="M50.5313 45.9411C52.8457 45.9411 54.7218 43.9899 54.7218 41.5829C54.7218 39.1759 52.8457 37.2246 50.5313 37.2246C48.217 37.2246 46.3408 39.1759 46.3408 41.5829C46.3408 43.9899 48.217 45.9411 50.5313 45.9411Z" fill="#B0D9EF"/>
<path d="M50.5315 46.4383C47.9466 46.4383 45.8438 44.2602 45.8438 41.5828C45.8438 38.9057 47.9466 36.7275 50.5315 36.7275C53.1165 36.7275 55.2193 38.9053 55.2193 41.5828C55.2193 44.2602 53.1165 46.4383 50.5315 46.4383ZM50.5315 37.7221C48.495 37.7221 46.8383 39.454 46.8383 41.5828C46.8383 43.7118 48.495 45.4437 50.5315 45.4437C52.5681 45.4437 54.2248 43.7115 54.2248 41.5828C54.2248 39.454 52.5678 37.7221 50.5315 37.7221Z" fill="#477CA8"/>
<path d="M49.5255 49.126C51.0066 49.126 52.2072 47.8774 52.2072 46.3372C52.2072 44.7969 51.0066 43.5483 49.5255 43.5483C48.0444 43.5483 46.8438 44.7969 46.8438 46.3372C46.8438 47.8774 48.0444 49.126 49.5255 49.126Z" fill="#B0D9EF"/>
<path d="M49.5257 49.6235C47.7729 49.6235 46.3467 48.1495 46.3467 46.3374C46.3467 44.5252 47.7729 43.0513 49.5257 43.0513C51.2785 43.0513 52.7047 44.5252 52.7047 46.3374C52.7047 48.1495 51.2785 49.6235 49.5257 49.6235ZM49.5257 44.0455C48.3213 44.0455 47.3413 45.0736 47.3413 46.337C47.3413 47.6005 48.3213 48.6286 49.5257 48.6286C50.7301 48.6286 51.7101 47.6005 51.7101 46.337C51.7101 45.0736 50.7301 44.0455 49.5257 44.0455Z" fill="#477CA8"/>
<path d="M50.0287 46.9468C51.51 46.9468 52.7108 45.6982 52.7108 44.158C52.7108 42.6177 51.51 41.3691 50.0287 41.3691C48.5475 41.3691 47.3467 42.6177 47.3467 44.158C47.3467 45.6982 48.5475 46.9468 50.0287 46.9468Z" fill="white"/>
<path d="M50.0293 47.4443C48.2762 47.4443 46.8496 45.9703 46.8496 44.1582C46.8496 42.346 48.2762 40.8721 50.0293 40.8721C51.7821 40.8721 53.2083 42.346 53.2083 44.1582C53.2083 45.9703 51.7821 47.4443 50.0293 47.4443ZM50.0293 41.8667C48.8245 41.8667 47.8442 42.8947 47.8442 44.1582C47.8442 45.4216 48.8245 46.4497 50.0293 46.4497C51.2337 46.4497 52.2137 45.4216 52.2137 44.1582C52.2137 42.8947 51.2337 41.8667 50.0293 41.8667Z" fill="#477CA8"/>
<path d="M60.588 49.126C62.0691 49.126 63.2697 47.8774 63.2697 46.3372C63.2697 44.7969 62.0691 43.5483 60.588 43.5483C59.1069 43.5483 57.9062 44.7969 57.9062 46.3372C57.9062 47.8774 59.1069 49.126 60.588 49.126Z" fill="#B0D9EF"/>
<path d="M60.5879 49.6235C58.8351 49.6235 57.4092 48.1495 57.4092 46.3374C57.4092 44.5252 58.8351 43.0513 60.5879 43.0513C62.341 43.0513 63.7675 44.5252 63.7675 46.3374C63.7675 48.1495 62.341 49.6235 60.5879 49.6235ZM60.5879 44.0455C59.3834 44.0455 58.4038 45.0736 58.4038 46.337C58.4038 47.6005 59.3834 48.6286 60.5879 48.6286C61.7926 48.6286 62.773 47.6005 62.773 46.337C62.773 45.0736 61.7926 44.0455 60.5879 44.0455Z" fill="#477CA8"/>
<path d="M60.9091 46.755C60.9091 50.0581 58.2323 52.7348 54.93 52.7348C51.6269 52.7348 48.9502 50.0581 48.9502 46.755V41.9718C48.9502 38.6694 51.6269 35.9927 54.93 35.9927C58.2323 35.9927 60.9091 38.6694 60.9091 41.9718V46.755Z" fill="white"/>
<path d="M54.9302 53.2323C51.359 53.2323 48.4531 50.3265 48.4531 46.7553V41.972C48.4531 38.4011 51.359 35.4956 54.9302 35.4956C58.5011 35.4956 61.4066 38.4011 61.4066 41.972V46.7553C61.4066 50.3268 58.5011 53.2323 54.9302 53.2323ZM54.9302 36.4902C51.9073 36.4902 49.4477 38.9495 49.4477 41.972V46.7553C49.4477 49.7781 51.9073 52.2377 54.9302 52.2377C57.9527 52.2377 60.412 49.7781 60.412 46.7553V41.972C60.412 38.9495 57.9527 36.4902 54.9302 36.4902Z" fill="#477CA8"/>
<path d="M60.3327 37.5957L64.5922 41.8558L63.822 42.6256C61.4652 44.9824 57.6444 44.9824 55.2889 42.6256L49.9639 37.3009C52.9297 34.6504 57.4849 34.7478 60.3327 37.5957Z" fill="#B0D9EF"/>
<path d="M59.5554 44.8904C57.8106 44.8904 56.1708 44.2108 54.9375 42.9772L49.2402 37.2805L49.6324 36.9301C51.1074 35.6119 53.011 34.8862 54.9932 34.8862C57.1432 34.8862 59.1645 35.7233 60.6849 37.2437L65.2958 41.8553L64.1739 42.9768C62.9403 44.2108 61.2999 44.8904 59.5554 44.8904ZM50.7016 37.3352L55.6407 42.2737C56.686 43.3196 58.0764 43.8958 59.5554 43.8958C61.0343 43.8958 62.4248 43.32 63.4711 42.2737L63.8898 41.8553L59.9821 37.9469C58.6493 36.6141 56.878 35.8808 54.9936 35.8808C53.4331 35.8808 51.9283 36.394 50.7016 37.3352Z" fill="#477CA8"/>
<path d="M50.8232 44.5605C50.8232 43.7486 51.4803 43.0918 52.2919 43.0918C53.1035 43.0918 53.7606 43.7482 53.7606 44.5605H50.8232Z" fill="white"/>
<path d="M54.2571 44.5607H53.2625C53.2625 44.0253 52.8269 43.5893 52.2912 43.5893C51.7554 43.5893 51.3198 44.0249 51.3198 44.5607H50.3252C50.3252 43.4766 51.2071 42.5947 52.2912 42.5947C53.3752 42.5947 54.2571 43.4769 54.2571 44.5607Z" fill="#477CA8"/>
<path d="M55.8952 48.2935H53.6318V49.288H55.8952V48.2935Z" fill="#477CA8"/>
<path d="M55.9228 63.123C47.0568 63.123 39.8438 55.91 39.8438 47.0439C39.8438 38.1779 47.0568 30.9648 55.9228 30.9648C64.7889 30.9648 72.0019 38.1779 72.0019 47.0439C72.0019 55.91 64.7889 63.123 55.9228 63.123ZM55.9228 31.9594C47.6051 31.9594 40.8383 38.7262 40.8383 47.0439C40.8383 55.3616 47.6051 62.1284 55.9228 62.1284C64.2405 62.1284 71.0074 55.3616 71.0074 47.0439C71.0074 38.7262 64.2405 31.9594 55.9228 31.9594Z" fill="#477CA8"/>
<path d="M61.8393 80.8159H49.9043V81.479H61.8393V80.8159Z" fill="#B5D1DE"/>
<path d="M56.1953 82.1411H55.5479V82.8042H56.1953V82.1411Z" fill="#B5D1DE"/>
<path d="M52.8876 80.1527H50.8984V78.1636H52.8876V80.1527ZM51.5615 79.4897H52.2246V78.8266H51.5615V79.4897Z" fill="#B5D1DE"/>
<path d="M55.54 80.1527H53.5508V78.1636H55.54V80.1527ZM54.2138 79.4897H54.8769V78.8266H54.2138V79.4897Z" fill="#B5D1DE"/>
<path d="M58.1923 80.1527H56.2031V78.1636H58.1923V80.1527ZM56.8662 79.4897H57.5292V78.8266H56.8662V79.4897Z" fill="#B5D1DE"/>
<path d="M60.8446 80.1527H58.8555V78.1636H60.8446V80.1527ZM59.5185 79.4897H60.1816V78.8266H59.5185V79.4897Z" fill="#B5D1DE"/>
<path d="M55.5401 74.1853H47.252V69.2124H55.5401V74.1853ZM47.915 73.5223H54.8771V69.8755H47.915V73.5223Z" fill="#B5D1DE"/>
<path d="M51.2477 72.8901L47.2793 69.729L47.6924 69.2104L51.2477 72.0427L54.803 69.2104L55.2161 69.729L51.2477 72.8901Z" fill="#B5D1DE"/>
<path d="M57.8608 77.0912V75.8423H56.8662V70.5034H65.1544V75.8423H59.9418L57.8608 77.0912ZM57.5293 75.1796H58.5238V75.9199L59.7581 75.1796H64.4913V71.1668H57.5293V75.1796Z" fill="#B5D1DE"/>
<path d="M63.4964 72.1963H58.5234V72.8593H63.4964V72.1963Z" fill="#B5D1DE"/>
<path d="M63.4964 73.522H58.5234V74.185H63.4964V73.522Z" fill="#B5D1DE"/>
<path d="M51.5615 74.8481H50.8984V76.5058H51.5615V74.8481Z" fill="#B5D1DE"/>
<path d="M52.8877 74.8481H52.2246V75.8427H52.8877V74.8481Z" fill="#B5D1DE"/>
<path d="M59.1865 67.5547H58.5234V69.5439H59.1865V67.5547Z" fill="#B5D1DE"/>
<path d="M59.8495 68.2178H57.8604V68.8808H59.8495V68.2178Z" fill="#B5D1DE"/>
<path d="M44.9394 14.5107C45.3056 14.5107 45.6025 14.2138 45.6025 13.8476C45.6025 13.4814 45.3056 13.1846 44.9394 13.1846C44.5732 13.1846 44.2764 13.4814 44.2764 13.8476C44.2764 14.2138 44.5732 14.5107 44.9394 14.5107Z" fill="#477CA8"/>
<path d="M44.6084 17.163H43.9453V15.5053C43.9453 15.14 44.2427 14.8423 44.6084 14.8423H45.7389L47.1634 16.2662L46.6947 16.735L45.4644 15.5053H44.6084V17.163Z" fill="#477CA8"/>
<path d="M45.934 19.1517H45.2709V17.1626H44.9394V19.1517H44.2764V16.4995H45.934V19.1517Z" fill="#477CA8"/>
<path d="M45.934 15.1738H44.2764V17.163H45.934V15.1738Z" fill="#477CA8"/>
<path d="M49.2499 14.8421H47.2607V14.1724C46.8476 13.8611 46.5977 13.3715 46.5977 12.8529C46.5977 11.9393 47.3413 11.1953 48.2553 11.1953C49.1693 11.1953 49.9129 11.9393 49.9129 12.8529C49.9129 13.3715 49.663 13.8611 49.2499 14.1724V14.8421ZM47.9238 14.1791H48.5868V13.8048L48.7516 13.709C49.0636 13.5269 49.2499 13.207 49.2499 12.8529C49.2499 12.3046 48.8036 11.8584 48.2553 11.8584C47.7069 11.8584 47.2607 12.3046 47.2607 12.8529C47.2607 13.207 47.447 13.5269 47.759 13.709L47.9238 13.8048V14.1791Z" fill="#477CA8"/>
<path d="M49.2489 15.1738H47.2598V15.8369H49.2489V15.1738Z" fill="#477CA8"/>
<path d="M50.9072 14.5107C51.2734 14.5107 51.5703 14.2138 51.5703 13.8476C51.5703 13.4814 51.2734 13.1846 50.9072 13.1846C50.541 13.1846 50.2441 13.4814 50.2441 13.8476C50.2441 14.2138 50.541 14.5107 50.9072 14.5107Z" fill="#477CA8"/>
<path d="M51.5703 15.1738H50.2441V19.1522H51.5703V15.1738Z" fill="#477CA8"/>
<path d="M51.9023 16.8314H51.2392V15.5053H50.5761V16.8314H49.9131V15.5053C49.9131 15.14 50.2105 14.8423 50.5761 14.8423H51.2392C51.6049 14.8423 51.9023 15.14 51.9023 15.5053V16.8314Z" fill="#477CA8"/>
<path d="M80.7107 37.3523H77.1299V33.7715H79.0653V34.4345H77.7929V36.6893H80.0477V35.7278H80.7107V37.3523Z" fill="#477CA8"/>
<path d="M79.0641 36.1951L78.168 35.299L78.6368 34.8302L79.0667 35.2599L80.5109 33.834L80.977 34.3057L79.0641 36.1951Z" fill="#477CA8"/>
<path d="M80.7107 42.3255H77.1299V38.7446H79.0653V39.4077H77.7929V41.6624H80.0477V40.701H80.7107V42.3255Z" fill="#477CA8"/>
<path d="M79.0641 41.1683L78.168 40.2721L78.6368 39.8034L79.0667 40.233L80.5109 38.8071L80.977 39.2789L79.0641 41.1683Z" fill="#477CA8"/>
<path d="M86.3801 34.7334H81.4072V35.3965H86.3801V34.7334Z" fill="#477CA8"/>
<path d="M86.3801 36.0596H81.4072V36.7226H86.3801V36.0596Z" fill="#477CA8"/>
<path d="M86.3801 39.7388H81.4072V40.4018H86.3801V39.7388Z" fill="#477CA8"/>
<path d="M86.3801 41.0649H81.4072V41.728H86.3801V41.0649Z" fill="#477CA8"/>
<path d="M80.7107 47.2986H77.1299V43.7178H79.0653V44.3808H77.7929V46.6355H80.0477V45.6741H80.7107V47.2986Z" fill="#477CA8"/>
<path d="M79.0641 46.1414L78.168 45.2453L78.6368 44.7765L79.0667 45.2062L80.5109 43.7803L80.977 44.252L79.0641 46.1414Z" fill="#477CA8"/>
<path d="M80.7107 52.2717H77.1299V48.6909H79.0653V49.354H77.7929V51.6087H80.0477V50.6473H80.7107V52.2717Z" fill="#477CA8"/>
<path d="M79.0641 51.1146L78.168 50.2184L78.6368 49.7497L79.0667 50.1793L80.5109 48.7534L80.977 49.2252L79.0641 51.1146Z" fill="#477CA8"/>
<path d="M86.3801 44.6797H81.4072V45.3427H86.3801V44.6797Z" fill="#477CA8"/>
<path d="M86.3801 46.0059H81.4072V46.6689H86.3801V46.0059Z" fill="#477CA8"/>
<path d="M86.3801 49.6851H81.4072V50.3481H86.3801V49.6851Z" fill="#477CA8"/>
<path d="M86.3801 51.0112H81.4072V51.6743H86.3801V51.0112Z" fill="#477CA8"/>
</g>
<defs>
<clipPath id="clip0">
<rect width="94" height="94.0003" fill="white"/>
</clipPath>
</defs>
</svg>
