Production Release:
===================


Enterprise
===========
1. 02-Apirl-2019 19:54:55
2. 25-Apirl-2019 15:16:36
3. 21-June-2019 14:09:00
4. 24-June-2019 11:50:00
5. 06-July-2019 11:56:00
6. 09-July-2019 19:13:00



Runner Installed in Local System: 2020-02-20

After Flexmonster Update copy
    hsweb3\hx\node_modules\ng-flexmonster
    to 
    hsweb3\hx\src\vendor\libs\flexmonster\ng-flexmonster