<svg width="93" height="94" viewBox="0 0 93 94" fill="none" xmlns="http://www.w3.org/2000/svg">
<path d="M63.9628 90.365C61.4113 92.9165 56.4756 94.2381 52.9894 93.3166L17.7703 83.8682C14.294 82.9335 10.6864 79.3194 9.73537 75.8333L0.300085 40.6141C-0.634588 37.1279 0.687074 32.1922 3.25169 29.6407L29.0356 3.85682C31.5871 1.30532 36.5228 -0.016337 40.009 0.905218L75.215 10.3667C78.7012 11.3014 82.3152 14.9155 83.2499 18.4017L92.6754 53.6077C93.61 57.0906 92.2884 62.0296 89.7238 64.5811L63.9628 90.365Z" fill="#E7F4FC"/>
<path d="M14.306 51.0107C17.3794 51.0107 19.8708 48.5247 19.8708 45.458C19.8708 42.3913 17.3794 39.9053 14.306 39.9053C11.2327 39.9053 8.74121 42.3913 8.74121 45.458C8.74121 48.5247 11.2327 51.0107 14.306 51.0107Z" fill="#FDF4BB"/>
<path d="M14.3067 51.3616C11.0445 51.3616 8.39062 48.7135 8.39062 45.4584C8.39062 42.2033 11.0445 39.5552 14.3067 39.5552C17.5688 39.5552 20.2229 42.2033 20.2229 45.4584C20.2229 48.7135 17.5688 51.3616 14.3067 51.3616ZM14.3067 40.2566C11.4321 40.2566 9.09358 42.59 9.09358 45.4584C9.09358 48.3267 11.4321 50.6602 14.3067 50.6602C17.1813 50.6602 19.52 48.3267 19.52 45.4584C19.52 42.59 17.1813 40.2566 14.3067 40.2566Z" fill="#477CA8"/>
<path d="M13.9604 42.0908V42.6767C12.9288 42.81 12.1416 43.5041 12.1416 44.3293C12.1416 44.8267 12.4443 45.2103 12.8464 45.4573C13.2485 45.7044 13.7331 45.8421 14.1878 45.982C14.6425 46.1219 15.0673 46.264 15.3472 46.4367C15.6272 46.6094 15.7792 46.7843 15.7792 47.1275C15.7792 47.7308 15.127 48.2468 14.3242 48.2468C13.5171 48.2468 12.8691 47.7483 12.8691 47.1275V46.8477H12.1416V47.1275C12.1416 47.9571 12.9288 48.6468 13.9604 48.7802V49.366H14.6879V48.7802C15.7224 48.6457 16.5067 47.9462 16.5067 47.1275C16.5067 46.6291 16.2041 46.2476 15.8019 45.9995C15.3998 45.7514 14.9153 45.606 14.4606 45.4661C14.0059 45.3262 13.581 45.1917 13.3011 45.0201C13.0212 44.8485 12.8691 44.6704 12.8691 44.3293C12.8691 43.7162 13.5185 43.2101 14.3242 43.2101C15.1313 43.2101 15.7792 43.7085 15.7792 44.3293V44.6092H16.5067V44.3293C16.5067 43.4997 15.7195 42.81 14.6879 42.6767V42.0908H13.9604Z" fill="#477CA8"/>
<path d="M37.9797 28.8765C35.4282 26.325 34.1033 21.386 35.0281 17.8998L37.0516 10.3568C37.9863 6.87392 41.6003 3.25985 45.0865 2.32518L52.6295 0.298411C56.1157 -0.632983 61.0514 0.688678 63.6029 3.25001L69.1584 8.75967C71.7099 11.3112 73.0316 16.2469 72.11 19.7331L70.0866 27.276C69.1519 30.7622 65.5378 34.3763 62.0549 35.311L54.4956 37.3344C51.0127 38.2691 46.0737 36.9442 43.5222 34.3828L37.9797 28.8765Z" fill="#D1ECF7"/>
<path d="M14.5729 38.8037H13.917V39.4596H14.5729V38.8037Z" fill="#477CA8"/>
<path d="M14.5729 37.5871H13.917V36.3638H14.5729V37.5871ZM14.5729 35.1406H13.917V33.914H14.5729V35.1406ZM14.5729 32.6973H13.917V31.474H14.5729V32.6973ZM14.5729 30.2507H13.917V29.0242H14.5729V30.2507ZM14.5729 27.8075H13.917V26.5776H14.5729V27.8075Z" fill="#477CA8"/>
<path d="M14.5729 25.3545H13.917V24.3706H14.9009V25.0265H14.5729V25.3545Z" fill="#477CA8"/>
<path d="M33.5714 25.0294H32.2367V24.3735H33.5714V25.0294ZM30.9052 25.0294H29.5704V24.3735H30.9052V25.0294ZM28.2356 25.0294H26.9041V24.3735H28.2356V25.0294ZM25.5693 25.0294H24.2345V24.3735H25.5693V25.0294ZM22.903 25.0294H21.5683V24.3735H22.903V25.0294ZM20.2335 25.0294H18.902V24.3735H20.2335V25.0294ZM17.5672 25.0294H16.2324V24.3735H17.5738L17.5672 25.0294Z" fill="#477CA8"/>
<path d="M35.5612 24.3735H34.9053V25.0294H35.5612V24.3735Z" fill="#477CA8"/>
<path d="M63.2174 24.3735H62.5615V25.0294H63.2174V24.3735Z" fill="#477CA8"/>
<path d="M76.6349 25.0294H75.2936V24.3735H76.6349V25.0294ZM73.9522 25.0294H72.6109V24.3735H73.9522V25.0294ZM71.2695 25.0294H69.9249V24.3735H71.2695V25.0294ZM68.5836 25.0294H67.2422V24.3735H68.5836V25.0294ZM65.9009 25.0294H64.5596V24.3735H65.9009V25.0294Z" fill="#477CA8"/>
<path d="M78.9604 25.3545H78.3045V25.0265H77.9766V24.3706H78.9604V25.3545Z" fill="#477CA8"/>
<path d="M78.9596 44.8444H78.3037V43.4505H78.9596V44.8444ZM78.9596 42.06H78.3037V40.6662H78.9596V42.06ZM78.9596 39.2757H78.3037V37.8851H78.9596V39.2757ZM78.9596 36.4913H78.3037V35.1008H78.9596V36.4913ZM78.9596 33.707H78.3037V32.3165H78.9596V33.707ZM78.9596 30.9226H78.3037V29.5321H78.9596V30.9226ZM78.9596 28.1383H78.3037V26.7642H78.9596V28.1383Z" fill="#477CA8"/>
<path d="M78.9596 46.2349H78.3037V46.8908H78.9596V46.2349Z" fill="#477CA8"/>
<path d="M59.6033 22.0814C59.6347 21.8224 59.6511 21.5618 59.6525 21.3009C59.6525 19.5543 58.9586 17.8793 57.7236 16.6443C56.4887 15.4093 54.8136 14.7155 53.0671 14.7155C52.465 14.7176 51.8659 14.8015 51.2863 14.9648C50.9499 12.5415 49.707 10.336 47.8083 8.79315C45.9097 7.25029 43.4966 6.48487 41.0557 6.65131C38.6149 6.81775 36.328 7.90365 34.6564 9.68997C32.9848 11.4763 32.0528 13.8301 32.0484 16.2766C32.0484 16.2995 32.0484 16.3192 32.0484 16.3422C30.5722 16.5386 29.2248 17.2857 28.2763 18.4337C27.3277 19.5817 26.8481 21.0458 26.9336 22.5325C27.019 24.0193 27.6632 25.4188 28.7371 26.4506C29.8109 27.4823 31.235 28.0701 32.724 28.0961H59.2491C59.3343 28.0961 59.4196 28.0961 59.5049 28.0961C60.2889 28.0851 61.0377 27.769 61.5925 27.215C62.1472 26.6609 62.4642 25.9124 62.4762 25.1284C62.4881 24.3444 62.1941 23.5867 61.6565 23.0159C61.1189 22.4452 60.38 22.1064 59.5967 22.0716L59.6033 22.0814Z" fill="white"/>
<path d="M59.5129 28.5974H32.7288C31.1484 28.5794 29.6308 27.9762 28.4693 26.9044C27.3078 25.8326 26.5847 24.3683 26.44 22.7945C26.2952 21.2207 26.7389 19.6491 27.6854 18.3833C28.6319 17.1176 30.014 16.2477 31.5645 15.9416C31.6759 13.4644 32.6888 11.1132 34.4126 9.33063C36.1364 7.54805 38.4524 6.45696 40.9245 6.2627C43.3966 6.06845 45.8545 6.78442 47.8356 8.27587C49.8168 9.76733 51.1845 11.9314 51.6813 14.3609C52.7077 14.1555 53.7669 14.1806 54.7824 14.4343C55.7978 14.688 56.7444 15.164 57.5535 15.8279C58.3627 16.4918 59.0144 17.3271 59.4616 18.2735C59.9088 19.2199 60.1402 20.2537 60.1393 21.3004C60.1393 21.4119 60.1393 21.5234 60.1393 21.6284C61.0011 21.7839 61.7735 22.2564 62.3045 22.9528C62.8354 23.6492 63.0866 24.5191 63.0084 25.3913C62.9303 26.2635 62.5286 27.0749 61.8823 27.6658C61.236 28.2568 60.3919 28.5844 59.5162 28.5843L59.5129 28.5974ZM58.8964 27.5841L59.2965 27.6037C59.3653 27.6037 59.4375 27.6037 59.5096 27.6037C60.1642 27.5927 60.7889 27.3275 61.2515 26.8643C61.7141 26.4011 61.9785 25.7761 61.9887 25.1215C61.9989 24.4669 61.7542 23.834 61.3063 23.3565C60.8583 22.8791 60.2423 22.5946 59.5884 22.5631H59.0505L59.1128 22.0285C59.1416 21.789 59.1569 21.5482 59.1587 21.307C59.157 19.6914 58.5145 18.1426 57.3721 17.0002C56.2297 15.8579 54.6809 15.2153 53.0653 15.2136C52.511 15.2171 51.9595 15.2943 51.4255 15.4431L50.8844 15.5973L50.8057 15.0365C50.4552 12.7616 49.2631 10.7013 47.4655 9.26369C45.668 7.82606 43.3961 7.11591 41.0998 7.27389C38.8035 7.43187 36.6503 8.44646 35.0665 10.1167C33.4828 11.787 32.5841 13.9911 32.5484 16.2925V16.7976L32.1122 16.8468C30.7424 17.0059 29.4851 17.6826 28.5979 18.7383C27.7107 19.7941 27.2606 21.1491 27.3399 22.5259C27.4191 23.9027 28.0216 25.1971 29.024 26.1441C30.0265 27.0912 31.353 27.6192 32.7321 27.6201H58.8964V27.5841Z" fill="#477CA8"/>
<path d="M47.4668 21.5535H46.4829V19.0578C46.4821 18.2497 46.1609 17.4749 45.5898 16.9032C45.0187 16.3315 44.2443 16.0095 43.4362 16.0078H42.3343C41.5262 16.0095 40.7518 16.3315 40.1807 16.9032C39.6096 17.4749 39.2884 18.2497 39.2876 19.0578V21.5535H38.3037V19.0578C38.3046 17.9888 38.7294 16.9637 39.485 16.2075C40.2406 15.4513 41.2653 15.0257 42.3343 15.0239H43.4362C44.5052 15.0257 45.5299 15.4513 46.2855 16.2075C47.0411 16.9637 47.4659 17.9888 47.4668 19.0578V21.5535Z" fill="#477CA8"/>
<path d="M48.3124 21.4155H37.457V30.9361H48.3124V21.4155Z" fill="#FDF4BB"/>
<path d="M48.804 31.4282H36.9648V20.9336H48.804V31.4282ZM37.9487 30.4443H47.8202V21.9175H37.9487V30.4443Z" fill="#477CA8"/>
<path d="M43.8853 25.0393C43.8853 24.774 43.7799 24.5196 43.5923 24.332C43.4047 24.1444 43.1503 24.0391 42.885 24.0391C42.6197 24.0391 42.3653 24.1444 42.1777 24.332C41.9902 24.5196 41.8848 24.774 41.8848 25.0393C41.8854 25.2121 41.9304 25.3818 42.0154 25.5323C42.1004 25.6827 42.2225 25.8088 42.3701 25.8986L42.1438 28.3648H43.6262L43.3999 25.8986C43.548 25.8093 43.6705 25.6833 43.7555 25.5327C43.8406 25.3822 43.8853 25.2122 43.8853 25.0393Z" fill="#477CA8"/>
<path d="M38.7326 23.5801H36.4336V24.5639H38.7326V23.5801Z" fill="#477CA8"/>
<path d="M38.7326 25.6294H36.4336V26.6133H38.7326V25.6294Z" fill="#477CA8"/>
<path d="M38.7326 27.6792H36.4336V28.6631H38.7326V27.6792Z" fill="#477CA8"/>
<path d="M49.3322 23.5801H47.0332V24.5639H49.3322V23.5801Z" fill="#477CA8"/>
<path d="M49.3322 25.6294H47.0332V26.6133H49.3322V25.6294Z" fill="#477CA8"/>
<path d="M49.3322 27.6792H47.0332V28.6631H49.3322V27.6792Z" fill="#477CA8"/>
<path d="M15.7725 41.6602L16.7563 42.644L15.7725 41.6602Z" fill="white"/>
<path d="M50.8649 70.4976V75.4328C50.8649 76.9471 49.6371 78.1746 48.123 78.1746H64.5736C63.0596 78.1746 61.8318 76.9471 61.8318 75.4328V70.4976H50.8649Z" fill="#D8E5ED"/>
<path d="M64.5746 78.587H48.124V77.7645C49.4091 77.7645 50.4546 76.719 50.4546 75.4339V70.0874H62.244V75.4339C62.244 76.719 63.2895 77.7645 64.5746 77.7645V78.587ZM50.2456 77.7645H62.4527C61.8193 77.1876 61.4212 76.3563 61.4212 75.4339V70.9099H51.2768V75.4339C51.2771 76.3563 50.879 77.1873 50.2456 77.7645Z" fill="#477CA8"/>
<path d="M81.5482 65.4595V35.6898C81.5482 34.9213 80.9226 34.2959 80.1535 34.2959H32.048C31.2794 34.2959 30.6543 34.9213 30.6543 35.6898V65.4593H81.5482V65.4595Z" fill="#D8E5ED"/>
<path d="M81.9606 65.8709H30.2441V35.69C30.2441 34.6944 31.0538 33.8848 32.0491 33.8848H80.1546C81.1504 33.8848 81.9606 34.6944 81.9606 35.69V65.8709ZM31.0667 65.0484H81.1381V35.69C81.1381 35.1479 80.6969 34.7073 80.1546 34.7073H32.0491C31.5073 34.7073 31.0667 35.1479 31.0667 35.69V65.0484Z" fill="#477CA8"/>
<path d="M78.8106 37.0425H33.3389V62.6803H78.8106V37.0425Z" fill="white"/>
<path d="M30.625 65.4297V69.7223C30.625 70.5453 31.4689 71.4628 32.2915 71.4628H80.2805C81.1041 71.4628 81.596 70.6166 81.596 69.793V65.4297H30.625Z" fill="white"/>
<path d="M80.2809 71.8742H32.2916C31.2623 71.8742 30.2139 70.7881 30.2139 69.7224V65.0186H82.0074V69.7931C82.0077 70.8161 81.3617 71.8742 80.2809 71.8742ZM31.0364 65.8411V69.7224C31.0364 70.3311 31.7167 71.0516 32.2916 71.0516H80.2806C80.8465 71.0516 81.1848 70.4117 81.1848 69.7931V65.8411H31.0364Z" fill="#477CA8"/>
<path d="M76.1813 59.9425H45.3359V40.6128H45.6101V59.6683H76.1813V59.9425Z" fill="#B0D9EF"/>
<path d="M39.6377 48.1054C38.7932 48.1054 37.9953 47.8033 37.3672 47.2508L39.752 44.8657H43.074C43.0257 45.7094 42.674 46.4946 42.0719 47.0973C41.4215 47.7474 40.5573 48.1054 39.6377 48.1054Z" fill="#B2DDC9"/>
<path d="M39.8623 44.3422V41.2275C41.5609 41.3345 42.9109 42.6481 43.0647 44.3422H39.8623Z" fill="#F5B1AE"/>
<path d="M39.6244 49.0992C38.5384 49.0992 37.4932 48.7025 36.6816 47.9816L37.0458 47.5715C37.757 48.2032 38.6727 48.5508 39.6244 48.5508C41.7671 48.5508 43.5101 46.8079 43.5101 44.6652C43.5101 42.5874 41.8859 40.8826 39.8122 40.7841L39.8383 40.2363C42.2047 40.3487 44.0585 42.2943 44.0585 44.6652C44.0587 47.11 42.0696 49.0992 39.6244 49.0992Z" fill="#477CA8"/>
<path d="M36.3678 47.1538C35.8222 46.4407 35.5244 45.5677 35.5244 44.6645C35.5244 42.6197 37.0475 40.8913 39.0424 40.6069V44.4233L36.3678 47.1538Z" fill="white"/>
<path d="M38.768 40.9371V44.312L36.4024 46.7273C36.01 46.115 35.7984 45.4008 35.7984 44.6652C35.7984 42.8654 37.0623 41.3287 38.768 40.9371ZM39.3164 40.3032C37.0445 40.4612 35.25 42.353 35.25 44.6652C35.25 45.7778 35.6662 46.7923 36.35 47.5641L39.3164 44.5357V40.3032Z" fill="#477CA8"/>
<path d="M38.2547 50.7583H36.4268V51.3067H38.2547V50.7583Z" fill="#F5B1AE"/>
<path d="M42.9829 50.7578H39.0986V51.3062H42.9829V50.7578Z" fill="#477CA8"/>
<path d="M38.2537 52.2656H36.4258V52.814H38.2537V52.2656Z" fill="#B2DDC9"/>
<path d="M42.9829 52.2656H39.0986V52.814H42.9829V52.2656Z" fill="#477CA8"/>
<path d="M38.2537 53.7739H36.4258V54.3223H38.2537V53.7739Z" fill="#D8E5ED"/>
<path d="M42.9829 53.7739H39.0986V54.3223H42.9829V53.7739Z" fill="#477CA8"/>
<path d="M74.9035 42.2124H45.4746V42.4866H74.9035V42.2124Z" fill="#D8E5ED"/>
<path d="M74.9025 44.772H45.4736V45.0462H74.9025V44.772Z" fill="#D8E5ED"/>
<path d="M74.9025 47.3311H45.4736V47.6052H74.9025V47.3311Z" fill="#D8E5ED"/>
<path d="M74.9025 49.8901H45.4736V50.1643H74.9025V49.8901Z" fill="#D8E5ED"/>
<path d="M74.9025 52.4492H45.4736V52.7234H74.9025V52.4492Z" fill="#D8E5ED"/>
<path d="M74.9025 55.0083H45.4736V55.2825H74.9025V55.0083Z" fill="#D8E5ED"/>
<path d="M74.9025 57.5679H45.4736V57.8421H74.9025V57.5679Z" fill="#D8E5ED"/>
<path d="M63.2517 59.8394H62.9775V60.8675H63.2517V59.8394Z" fill="#D8E5ED"/>
<path d="M60.6921 59.8394H60.418V60.8675H60.6921V59.8394Z" fill="#D8E5ED"/>
<path d="M58.1336 59.8394H57.8594V60.8675H58.1336V59.8394Z" fill="#D8E5ED"/>
<path d="M55.574 59.8394H55.2998V60.8675H55.574V59.8394Z" fill="#D8E5ED"/>
<path d="M53.0154 59.8394H52.7412V60.8675H53.0154V59.8394Z" fill="#D8E5ED"/>
<path d="M50.4558 59.8394H50.1816V60.8675H50.4558V59.8394Z" fill="#D8E5ED"/>
<path d="M47.8963 59.8394H47.6221V60.8675H47.8963V59.8394Z" fill="#D8E5ED"/>
<path d="M76.0457 59.8398H75.7715V60.868H76.0457V59.8398Z" fill="#D8E5ED"/>
<path d="M73.4871 59.8398H73.2129V60.868H73.4871V59.8398Z" fill="#D8E5ED"/>
<path d="M70.9275 59.8398H70.6533V60.868H70.9275V59.8398Z" fill="#D8E5ED"/>
<path d="M68.3679 59.8398H68.0938V60.868H68.3679V59.8398Z" fill="#D8E5ED"/>
<path d="M65.8084 59.8394H65.5342V60.8675H65.8084V59.8394Z" fill="#D8E5ED"/>
<path d="M45.6804 57.6937L45.2686 56.9817L57.7473 49.7655L65.3572 51.9475L74.5453 44.4028L75.0673 45.0384L65.5453 52.8575L57.8567 50.6525L45.6804 57.6937Z" fill="#F5B1AE"/>
<path d="M59.652 55.2095L52.6862 51.0666L45.5874 54.2973L45.3604 53.798L52.7199 50.4486L59.5837 54.5309L67.408 47.4326L74.4737 49.6735L74.3078 50.1964L67.5429 48.0506L59.652 55.2095Z" fill="#B2DDC9"/>
<path d="M81.9408 77.7642H66.3125V78.5867H81.9408V77.7642Z" fill="#477CA8"/>
<path d="M46.2968 77.7642H35.8779V78.5867H46.2968V77.7642Z" fill="#477CA8"/>
</svg>
