<?xml version="1.0" encoding="utf-8"?>
<!-- Generator: Adobe Illustrator 23.0.6, SVG Export Plug-In . SVG Version: 6.00 Build 0)  -->
<svg version="1.1" id="Layer_1" xmlns="http://www.w3.org/2000/svg" xmlns:xlink="http://www.w3.org/1999/xlink" x="0px" y="0px"
	 viewBox="0 0 49.1 60" style="enable-background:new 0 0 49.1 60;" xml:space="preserve">
<style type="text/css">
	.st0{fill:#333333;}
</style>
<g id="Group_2106" transform="translate(-2703 331)">
	<g id="Group_2107" transform="translate(2608.092 -527)">
		<path id="Combined_Shape" class="st0" d="M103.1,256c-4.5,0-8.2-3.7-8.2-8.2v-43.6c0-4.5,3.7-8.2,8.2-8.2h21.8
			c0.6,0,1.1,0.2,1.6,0.5h0c0,0,0,0,0,0c0.1,0.1,0.2,0.2,0.3,0.3l16.4,16.4c0.1,0.1,0.2,0.2,0.3,0.3c0,0,0,0,0,0l0,0
			c0.3,0.4,0.5,1,0.5,1.5v32.8c0,4.5-3.7,8.2-8.2,8.2H103.1z M100.4,204.2v43.6c0,1.5,1.2,2.7,2.7,2.7h32.7c1.5,0,2.7-1.2,2.7-2.7
			v-30h-13.6c-1.5,0-2.7-1.2-2.7-2.7v-13.6h-19.1C101.6,201.5,100.4,202.7,100.4,204.2z M127.6,212.4h7.1l-7.1-7.1L127.6,212.4z"/>
		<g id="Group_2106-2">
			<path id="Path_1867" class="st0" d="M126.1,244.3c0,1.5-1.2,2.7-2.7,2.7c-1.5,0-2.7-1.2-2.7-2.7v-8.8c0-1.5,1.2-2.7,2.7-2.7
				c1.5,0,2.7,1.2,2.7,2.7l0,0V244.3z"/>
			<path id="Path_1868" class="st0" d="M134,244.3c0,1.5-1.2,2.7-2.7,2.7c-1.5,0-2.7-1.2-2.7-2.7c0,0,0,0,0,0v-15.8
				c0-1.5,1.2-2.7,2.7-2.7c1.5,0,2.7,1.2,2.7,2.7c0,0,0,0,0,0V244.3z"/>
			<path id="Path_1869" class="st0" d="M118.2,244.3c0,1.5-1.2,2.7-2.7,2.7c-1.5,0-2.7-1.2-2.7-2.7l0,0v-16.8c0-1.5,1.2-2.7,2.7-2.7
				c1.5,0,2.7,1.2,2.7,2.7l0,0V244.3z"/>
			<path id="Path_1870" class="st0" d="M110.3,244.3c0,1.5-1.2,2.7-2.7,2.7c-1.5,0-2.7-1.2-2.7-2.7l0,0v-5.5c0-1.5,1.2-2.7,2.7-2.7
				c1.5,0,2.7,1.2,2.7,2.7V244.3z"/>
		</g>
		<path id="Path_1871" class="st0" d="M107.5,247c-1.5,0-2.7-1.2-2.7-2.7c0-1.5,1.2-2.7,2.7-2.7h23.8c1.5,0,2.7,1.2,2.7,2.7
			c0,1.5-1.2,2.7-2.7,2.7C131.4,247,107.5,247,107.5,247z"/>
	</g>
	<path id="Shape" class="st0" d="M2722.2-311.9h-5.5c-1.5,0-2.7,1.2-2.7,2.7c0,1.5,1.2,2.7,2.7,2.7h5.5c1.5,0,2.7-1.2,2.7-2.7
		C2724.9-310.7,2723.7-311.9,2722.2-311.9z"/>
	<circle id="Ellipse_12" class="st0" cx="2717" cy="-317" r="3"/>
</g>
</svg>
