{
  "bookmark_id": 0,
  "act": "1",
  "ui_flow_config": {
    "reset_dash_id": "464"
  },
  "name": "Cherry Picking",
  "global_filter": {
    "fromdate": "2019-12-31",
    "todate": "2019-12-31"
  },
  "createdby": "",
  "flow": [
    [
      {
        "object_id": 0,
        "app_glo_fil": 0,
        "edit_content": "%3Cp%3Eoverview%20trend%20with%20metrics%20%28gross%2C%20check%20count%29%3C/p%3E",
        "group_name": "v464",
        "card_type": "existing_card",
        "view_name": "Gross sales trend",
        "is_visible": 1,
        "filters": {},
        "run_sales_analysis": true,
        "outline_display_name": null,
        "bookmark_card_id": 0,
        "default_display": "chart",
        "is_expand": 1,
        "hs_flow_json": {
          "intent": "cherry",
          "todate": "2019-12-31",
          "rawtext": "Gross sales trend",
          "fromdate": "2019-10-01",
          "hsdimlist": [
            "transaction_date"
          ],
          "object_id": 41,
          "page_count": 0,
          "date_lim_ap": 0,
          "grid_config": {
            "expand_collapse": {
              "is_expand_all": false,
              "headers": []
            },
            "heatmap": {
              "enabled": 1,
              "measures": [
                {
                  "selected": true,
                  "uniqueName": "Gross Sales",
                  "min": null,
                  "max": null,
                  "color_code": 3
                }
              ]
            }
          },
          "pivot_config": {
            "dataSource": {
              "type": "json",
              "data": [
                {
                  "Transaction Date": {
                    "type": "date string"
                  },
                  "Gross Sales": {
                    "type": "number"
                  }
                }
              ]
            },
            "slice": {
              "rows": [
                {
                  "uniqueName": "Transaction Date",
                  "sort": "asc"
                }
              ],
              "columns": [
                {
                  "uniqueName": "[Measures]"
                }
              ],
              "measures": [
                {
                  "uniqueName": "Gross Sales",
                  "aggregation": "sum",
                  "grandTotalCaption": "Gross Sales",
                  "format": "gross_sales"
                }
              ]
            },
            "options": {
              "grid": {
                "showHeaders": false,
                "showTotals": "off",
                "grandTotalsPosition": "bottom"
              },
              "chart": {
                "type": "line",
                "axisShortNumberFormat": true
              },
              "configuratorButton": false,
              "drillThrough": false,
              "datePattern": "MMM d, yyyy",
              "defaultHierarchySortName": "unsorted",
              "showAggregationLabels": false
            },
            "formats": [
              {
                "name": "gross_sales",
                "thousandsSeparator": ",",
                "decimalSeparator": ".",
                "decimalPlaces": 2,
                "maxDecimalPlaces": -1,
                "maxSymbols": 20,
                "currencySymbol": "$",
                "positiveCurrencyFormat": "$1",
                "nullValue": "",
                "infinityValue": "",
                "divideByZeroValue": "",
                "textAlign": "right",
                "isPercent": false
              },
              {
                "name": "",
                "thousandsSeparator": "",
                "decimalSeparator": ".",
                "decimalPlaces": 0,
                "maxDecimalPlaces": -1,
                "maxSymbols": 20,
                "currencySymbol": "",
                "positiveCurrencyFormat": "$1",
                "nullValue": "",
                "infinityValue": "",
                "divideByZeroValue": "",
                "isPercent": false
              }
            ],
            "version": "2.8.1",
            "creationDate": "2020-02-29T14:44:08.552Z"
          },
          "hsmeasurelist": [
            "gross_sales"
          ],
          "highchart_config": {
            "xAxis": [
              {
                "max": null,
                "min": null
              }
            ],
            "yAxis": [
              {
                "max": null,
                "min": null
              }
            ]
          }
        }
      },
      {
        "object_id": 1,
        "app_glo_fil": 0,
        "edit_content": null,
        "group_name": "v464",
        "card_type": "existing_card",
        "view_name": "Traffic trend",
        "default_display": "chart",
        "is_visible": 0,
        "filters": {},
        "run_sales_analysis": false,
        "outline_display_name": null,
        "bookmark_card_id": 1,
        "is_expand": 0,
        "hs_flow_json": {
          "intent": "cherry",
          "todate": "2019-12-31",
          "rawtext": "Gross sales trend",
          "fromdate": "2019-10-01",
          "hsdimlist": [
            "transaction_date"
          ],
          "object_id": 41,
          "page_count": 0,
          "date_lim_ap": 0,
          "grid_config": {
            "expand_collapse": {
              "is_expand_all": false,
              "headers": []
            },
            "heatmap": {
              "enabled": 1,
              "measures": [
                {
                  "selected": true,
                  "uniqueName": "Check Count",
                  "min": null,
                  "max": null,
                  "color_code": 3
                }
              ]
            }
          },
          "hsmeasurelist": [
            "check_count"
          ],
          "highchart_config": {
            "xAxis": [
              {
                "max": null,
                "min": null
              }
            ],
            "yAxis": [
              {
                "max": null,
                "min": null
              }
            ]
          },
          "pivot_config": {
            "dataSource": {
              "type": "json",
              "data": [
                {
                  "Transaction Date": {
                    "type": "date string"
                  },
                  "Check Count": {
                    "type": "number"
                  }
                }
              ]
            },
            "slice": {
              "rows": [
                {
                  "uniqueName": "Transaction Date",
                  "sort": "asc"
                }
              ],
              "columns": [
                {
                  "uniqueName": "[Measures]"
                }
              ],
              "measures": [
                {
                  "uniqueName": "Check Count",
                  "aggregation": "sum",
                  "grandTotalCaption": "Check Count",
                  "format": "check_count"
                }
              ]
            },
            "options": {
              "grid": {
                "showHeaders": false,
                "showTotals": "off",
                "grandTotalsPosition": "bottom"
              },
              "chart": {
                "type": "line",
                "axisShortNumberFormat": true
              },
              "configuratorButton": false,
              "drillThrough": false,
              "datePattern": "MMM d, yyyy",
              "defaultHierarchySortName": "unsorted",
              "showAggregationLabels": false
            },
            "formats": [
              {
                "name": "",
                "thousandsSeparator": "",
                "decimalSeparator": ".",
                "decimalPlaces": 0,
                "maxDecimalPlaces": -1,
                "maxSymbols": 20,
                "currencySymbol": "",
                "positiveCurrencyFormat": "$1",
                "nullValue": "",
                "infinityValue": "",
                "divideByZeroValue": "",
                "isPercent": false
              },
              {
                "name": "check_count",
                "thousandsSeparator": ",",
                "decimalSeparator": ".",
                "decimalPlaces": 0,
                "maxDecimalPlaces": -1,
                "maxSymbols": 20,
                "currencySymbol": "",
                "positiveCurrencyFormat": "$1",
                "nullValue": "",
                "infinityValue": "",
                "divideByZeroValue": "",
                "textAlign": "right",
                "isPercent": false
              }
            ],
            "version": "2.8.1",
            "creationDate": "2020-02-29T14:44:23.047Z"
          }
        }
      },
      {
        "object_id": 2,
        "app_glo_fil": 0,
        "edit_content": null,
        "group_name": "v464",
        "card_type": "existing_card",
        "view_name": "Average Basket Value Trend",
        "is_visible": 0,
        "filters": {},
        "default_display": "chart",
        "run_sales_analysis": false,
        "outline_display_name": null,
        "bookmark_card_id": 2,
        "is_expand": 0,
        "hs_flow_json": {
          "intent": "cherry",
          "todate": "2019-12-31",
          "rawtext": "",
          "fromdate": "2019-10-01",
          "hsdimlist": [
            "transaction_date"
          ],
          "page_count": "",
          "grid_config": {
            "expand_collapse": {
              "is_expand_all": false,
              "headers": []
            },
            "heatmap": {
              "enabled": 1,
              "measures": [
                {
                  "selected": true,
                  "uniqueName": "Average Basket Value",
                  "min": null,
                  "max": null,
                  "color_code": 3
                }
              ]
            }
          },
          "hsmeasurelist": [
            "gross_sales",
            "check_count"
          ],
          "highchart_config": {
            "xAxis": [
              {
                "max": null,
                "min": null
              }
            ],
            "yAxis": [
              {
                "max": null,
                "min": null
              }
            ]
          },
          "date_lim_ap": 0,
          "pivot_config": {
            "dataSource": {
              "type": "json",
              "data": [
                {
                  "Transaction Date": {
                    "type": "date string"
                  },
                  "Gross Sales": {
                    "type": "number"
                  },
                  "Check Count": {
                    "type": "number"
                  }
                }
              ]
            },
            "slice": {
              "rows": [
                {
                  "uniqueName": "Transaction Date",
                  "sort": "asc"
                }
              ],
              "columns": [
                {
                  "uniqueName": "[Measures]"
                }
              ],
              "measures": [
                {
                  "uniqueName": "Average Basket Value Trend",
                  "formula": "sum(\"Gross Sales\") / sum(\"Check Count\")",
                  "caption": "Average Basket Value",
                  "format": "average_basket_value_trend"
                }
              ]
            },
            "options": {
              "grid": {
                "showHeaders": false,
                "showTotals": "off",
                "showGrandTotals": "off",
                "grandTotalsPosition": "bottom"
              },
              "chart": {
                "type": "line",
                "axisShortNumberFormat": true
              },
              "configuratorButton": false,
              "drillThrough": false,
              "datePattern": "MMM d, yyyy",
              "defaultHierarchySortName": "unsorted",
              "showAggregationLabels": false
            },
            "formats": [
              {
                "name": "",
                "thousandsSeparator": "",
                "decimalSeparator": ".",
                "decimalPlaces": 0,
                "maxDecimalPlaces": -1,
                "maxSymbols": 20,
                "currencySymbol": "",
                "positiveCurrencyFormat": "$1",
                "nullValue": "",
                "infinityValue": "",
                "divideByZeroValue": "",
                "isPercent": false
              },
              {
                "name": "average_basket_value_trend",
                "thousandsSeparator": ",",
                "decimalSeparator": ".",
                "decimalPlaces": 0,
                "maxDecimalPlaces": -1,
                "maxSymbols": 20,
                "currencySymbol": "",
                "positiveCurrencyFormat": "$1",
                "nullValue": "",
                "infinityValue": "",
                "divideByZeroValue": "",
                "isPercent": false
              }
            ],
            "version": "2.8.1",
            "creationDate": "2020-02-29T14:49:09.458Z"
          }
        }
      }
    ],
    [
      {
        "object_id": 3,
        "app_glo_fil": 0,
        "default_display": "chart",
        "edit_content": null,
        "group_name": "v464",
        "card_type": "existing_card",
        "view_name": "Gross sale_Summary",
        "is_visible": 1,
        "filters": {},
        "run_sales_analysis": false,
        "outline_display_name": null,
        "bookmark_card_id": 3,
        "is_expand": 1,
        "hs_flow_json": {
          "intent": "cherry",
          "todate": "2019-12-31",
          "rawtext": "",
          "fromdate": "2019-10-01",
          "hsdimlist": [
            "picker_group"
          ],
          "object_id": 74,
          "page_count": 0,
          "date_lim_ap": 0,
          "grid_config": {
            "expand_collapse": {
              "is_expand_all": false,
              "headers": []
            },
            "heatmap": {
              "enabled": 1,
              "measures": [
                {
                  "selected": true,
                  "uniqueName": "Gross Sales",
                  "min": null,
                  "max": null,
                  "color_code": 3
                }
              ]
            }
          },
          "hsmeasurelist": [
            "gross_sales"
          ],
          "highchart_config": {
            "xAxis": [
              {
                "max": null,
                "min": null
              }
            ],
            "yAxis": [
              {
                "max": null,
                "min": null
              }
            ]
          },
          "pivot_config": {
            "dataSource": {
              "type": "json",
              "data": [
                {
                  "Picker Group": {
                    "type": "string"
                  },
                  "Gross Sales": {
                    "type": "number"
                  }
                }
              ]
            },
            "slice": {
              "rows": [
                {
                  "uniqueName": "Picker Group",
                  "sortOrder": [
                    "heavy",
                    "high",
                    "medium",
                    "low",
                    "none"
                  ]
                }
              ],
              "columns": [
                {
                  "uniqueName": "[Measures]"
                }
              ],
              "measures": [
                {
                  "uniqueName": "Gross Sales",
                  "aggregation": "sum",
                  "grandTotalCaption": "Gross Sales",
                  "format": "gross_sales"
                }
              ],
              "expands": {
                "expandAll": true
              }
            },
            "options": {
              "grid": {
                "type": "classic",
                "showHeaders": false,
                "showTotals": "off",
                "grandTotalsPosition": "bottom"
              },
              "chart": {
                "axisShortNumberFormat": true,
                "type": "pie"
              },
              "configuratorButton": false,
              "drillThrough": false,
              "datePattern": "MMM d, yyyy",
              "defaultHierarchySortName": "unsorted",
              "showAggregationLabels": false
            },
            "formats": [
              {
                "name": "gross_sales",
                "thousandsSeparator": ",",
                "decimalSeparator": ".",
                "decimalPlaces": 2,
                "maxDecimalPlaces": -1,
                "maxSymbols": 20,
                "currencySymbol": "$",
                "positiveCurrencyFormat": "$1",
                "nullValue": "",
                "infinityValue": "",
                "divideByZeroValue": "",
                "textAlign": "right",
                "isPercent": false
              },
              {
                "name": "",
                "thousandsSeparator": "",
                "decimalSeparator": ".",
                "decimalPlaces": 0,
                "maxDecimalPlaces": -1,
                "maxSymbols": 20,
                "currencySymbol": "",
                "positiveCurrencyFormat": "$1",
                "nullValue": "",
                "infinityValue": "",
                "divideByZeroValue": "",
                "isPercent": false
              }
            ],
            "version": "2.8.1",
            "creationDate": "2020-02-29T14:48:16.495Z"
          }
        }
      },
      {
        "object_id": 4,
        "default_display": "chart",
        "app_glo_fil": 0,
        "edit_content": null,
        "group_name": "v464",
        "card_type": "existing_card",
        "view_name": "Traffic_Summary",
        "is_visible": 0,
        "filters": {},
        "run_sales_analysis": false,
        "outline_display_name": null,
        "bookmark_card_id": 4,
        "is_expand": 0,
        "hs_flow_json": {
          "intent": "cherry",
          "todate": "2019-12-31",
          "rawtext": "",
          "fromdate": "2019-10-01",
          "hsdimlist": [
            "picker_group"
          ],
          "object_id": 73,
          "page_count": null,
          "date_lim_ap": 0,
          "grid_config": {
            "expand_collapse": {
              "is_expand_all": false,
              "headers": []
            },
            "heatmap": {
              "enabled": 1,
              "measures": [
                {
                  "selected": true,
                  "uniqueName": "Check Count",
                  "min": null,
                  "max": null,
                  "color_code": 3
                }
              ]
            }
          },
          "hsmeasurelist": [
            "check_count"
          ],
          "highchart_config": {
            "xAxis": [
              {
                "max": null,
                "min": null
              }
            ],
            "yAxis": [
              {
                "max": null,
                "min": null
              }
            ]
          },
          "pivot_config": {
            "dataSource": {
              "type": "json",
              "data": [
                {
                  "Picker Group": {
                    "type": "string"
                  },
                  "Check Count": {
                    "type": "number"
                  }
                }
              ]
            },
            "slice": {
              "rows": [
                {
                  "uniqueName": "Picker Group",
                  "sort": "asc",
                  "sortOrder": [
                    "heavy",
                    "high",
                    "medium",
                    "low",
                    "none"
                  ]
                }
              ],
              "columns": [
                {
                  "uniqueName": "[Measures]"
                }
              ],
              "measures": [
                {
                  "uniqueName": "Check Count",
                  "aggregation": "percentofcolumn",
                  "grandTotalCaption": "Check Count",
                  "format": "check_count"
                }
              ]
            },
            "options": {
              "grid": {
                "showHeaders": false,
                "showTotals": "off",
                "showGrandTotals": "off",
                "grandTotalsPosition": "bottom"
              },
              "chart": {
                "type": "pie",
                "axisShortNumberFormat": true
              },
              "configuratorButton": false,
              "drillThrough": false,
              "datePattern": "MMM d, yyyy",
              "defaultHierarchySortName": "unsorted",
              "showAggregationLabels": false
            },
            "formats": [
              {
                "name": "check_count",
                "thousandsSeparator": ",",
                "decimalSeparator": ".",
                "decimalPlaces": 0,
                "maxDecimalPlaces": -1,
                "maxSymbols": 20,
                "currencySymbol": "",
                "positiveCurrencyFormat": "$1",
                "nullValue": "",
                "infinityValue": "",
                "divideByZeroValue": "",
                "textAlign": "right",
                "isPercent": false
              },
              {
                "name": "",
                "thousandsSeparator": "",
                "decimalSeparator": ".",
                "decimalPlaces": 0,
                "maxDecimalPlaces": -1,
                "maxSymbols": 20,
                "currencySymbol": "",
                "positiveCurrencyFormat": "$1",
                "nullValue": "",
                "infinityValue": "",
                "divideByZeroValue": "",
                "isPercent": false
              }
            ],
            "version": "2.8.1",
            "creationDate": "2020-02-29T14:48:21.252Z"
          }
        }
      },
      {
        "object_id": 5,
        "default_display": "chart",
        "app_glo_fil": 0,
        "edit_content": null,
        "group_name": "v464",
        "card_type": "existing_card",
        "view_name": "Discount_Summary",
        "is_visible": 0,
        "filters": {},
        "run_sales_analysis": false,
        "outline_display_name": null,
        "bookmark_card_id": 5,
        "is_expand": 0,
        "hs_flow_json": {
          "intent": "cherry",
          "todate": "2019-12-31",
          "rawtext": "",
          "fromdate": "2019-10-01",
          "hsdimlist": [
            "picker_group"
          ],
          "object_id": 74,
          "page_count": 0,
          "date_lim_ap": 0,
          "grid_config": {
            "expand_collapse": {
              "is_expand_all": false,
              "headers": []
            },
            "heatmap": {
              "enabled": 1,
              "measures": [
                {
                  "selected": true,
                  "uniqueName": "Discount",
                  "min": null,
                  "max": null,
                  "color_code": 3
                }
              ]
            }
          },
          "hsmeasurelist": [
            "discount"
          ],
          "highchart_config": {
            "xAxis": [
              {
                "max": null,
                "min": null
              }
            ],
            "yAxis": [
              {
                "max": null,
                "min": null
              }
            ]
          },
          "pivot_config": {
            "dataSource": {
              "type": "json",
              "data": [
                {
                  "Picker Group": {
                    "type": "string"
                  },
                  "Discount": {
                    "type": "number"
                  }
                }
              ]
            },
            "slice": {
              "rows": [
                {
                  "uniqueName": "Picker Group",
                  "sort": "asc",
                  "sortOrder": [
                    "heavy",
                    "high",
                    "medium",
                    "low",
                    "none"
                  ]
                }
              ],
              "columns": [
                {
                  "uniqueName": "[Measures]"
                }
              ],
              "measures": [
                {
                  "uniqueName": "Discount",
                  "aggregation": "percentofcolumn",
                  "grandTotalCaption": "Discount",
                  "format": "discount"
                }
              ]
            },
            "options": {
              "grid": {
                "showHeaders": false,
                "showTotals": "off",
                "showGrandTotals": "off",
                "grandTotalsPosition": "bottom"
              },
              "chart": {
                "type": "pie",
                "axisShortNumberFormat": true
              },
              "configuratorButton": false,
              "drillThrough": false,
              "datePattern": "MMM d, yyyy",
              "defaultHierarchySortName": "unsorted",
              "showAggregationLabels": false
            },
            "formats": [
              {
                "name": "discount",
                "thousandsSeparator": ",",
                "decimalSeparator": ".",
                "decimalPlaces": 2,
                "maxDecimalPlaces": -1,
                "maxSymbols": 20,
                "currencySymbol": "$",
                "positiveCurrencyFormat": "$1",
                "nullValue": "",
                "infinityValue": "",
                "divideByZeroValue": "",
                "textAlign": "right",
                "isPercent": false
              },
              {
                "name": "",
                "thousandsSeparator": "",
                "decimalSeparator": ".",
                "decimalPlaces": 0,
                "maxDecimalPlaces": -1,
                "maxSymbols": 20,
                "currencySymbol": "",
                "positiveCurrencyFormat": "$1",
                "nullValue": "",
                "infinityValue": "",
                "divideByZeroValue": "",
                "isPercent": false
              }
            ],
            "version": "2.8.1",
            "creationDate": "2020-02-29T14:48:23.186Z"
          }
        }
      },
      {
        "object_id": 6,
        "default_display": "chart",
        "app_glo_fil": 0,
        "edit_content": null,
        "group_name": "v464",
        "card_type": "existing_card",
        "view_name": "Average Basket Value_Summary",
        "is_visible": 0,
        "filters": {},
        "run_sales_analysis": false,
        "outline_display_name": null,
        "bookmark_card_id": 6,
        "is_expand": 0,
        "hs_flow_json": {
          "intent": "cherry",
          "todate": "2019-12-31",
          "rawtext": "",
          "fromdate": "2019-10-01",
          "hsdimlist": [
            "picker_group"
          ],
          "object_id": 75,
          "page_count": 0,
          "date_lim_ap": 0,
          "grid_config": {
            "expand_collapse": {
              "is_expand_all": false,
              "headers": []
            },
            "heatmap": {
              "enabled": 1,
              "measures": [
                {
                  "selected": true,
                  "uniqueName": "Average Basket Value",
                  "min": null,
                  "max": null,
                  "color_code": 3
                }
              ]
            }
          },
          "hsmeasurelist": [
            "gross_sales",
            "check_count"
          ],
          "highchart_config": {
            "xAxis": [
              {
                "max": null,
                "min": null
              }
            ],
            "yAxis": [
              {
                "max": null,
                "min": null
              }
            ]
          },
          "pivot_config": {
            "dataSource": {
              "type": "json",
              "data": [
                {
                  "Picker Group": {
                    "type": "string"
                  },
                  "Gross Sales": {
                    "type": "number"
                  },
                  "Check Count": {
                    "type": "number"
                  }
                }
              ]
            },
            "slice": {
              "rows": [
                {
                  "uniqueName": "Picker Group",
                  "sort": "asc",
                  "sortOrder": [
                    "heavy",
                    "high",
                    "medium",
                    "low",
                    "none"
                  ]
                }
              ],
              "columns": [
                {
                  "uniqueName": "[Measures]"
                }
              ],
              "measures": [
                {
                  "uniqueName": "Average Basket Value",
                  "formula": "sum(\"Gross Sales\") / sum(\"Check Count\")",
                  "caption": "Average Basket Value",
                  "format": "-wfq6ube07pw00"
                }
              ]
            },
            "options": {
              "grid": {
                "showHeaders": false,
                "showTotals": "off",
                "showGrandTotals": "off",
                "grandTotalsPosition": "bottom"
              },
              "chart": {
                "axisShortNumberFormat": true,
                "type": "column"
              },
              "configuratorButton": false,
              "drillThrough": false,
              "datePattern": "MMM d, yyyy",
              "defaultHierarchySortName": "unsorted",
              "showAggregationLabels": false
            },
            "formats": [
              {
                "name": "",
                "thousandsSeparator": "",
                "decimalSeparator": ".",
                "decimalPlaces": 0,
                "maxDecimalPlaces": -1,
                "maxSymbols": 20,
                "currencySymbol": "",
                "positiveCurrencyFormat": "$1",
                "nullValue": "",
                "infinityValue": "",
                "divideByZeroValue": "",
                "isPercent": false
              },
              {
                "name": "-wfq6ube07pw00",
                "thousandsSeparator": ",",
                "decimalSeparator": ".",
                "decimalPlaces": 2,
                "maxDecimalPlaces": -1,
                "maxSymbols": 20,
                "currencySymbol": "",
                "positiveCurrencyFormat": "$1",
                "nullValue": "",
                "infinityValue": "",
                "divideByZeroValue": "",
                "isPercent": false
              }
            ],
            "version": "2.8.1",
            "creationDate": "2020-02-29T14:48:25.405Z"
          }
        }
      }
    ],
    [
      {
        "object_id": 7,
        "app_glo_fil": 0,
        "edit_content": null,
        "default_display": "grid",
        "group_name": "v464",
        "card_type": "existing_card",
        "view_name": "Cherry Picker segment summary",
        "is_visible": 1,
        "filters": {},
        "run_sales_analysis": false,
        "outline_display_name": null,
        "bookmark_card_id": 7,
        "is_expand": 0,
        "hs_flow_json": {
          "intent": "cherry",
          "todate": "2019-12-31",
          "rawtext": "",
          "fromdate": "2019-10-01",
          "hsdimlist": [
            "picker_group"
          ],
          "object_id": 77,
          "page_count": null,
          "date_lim_ap": 0,
          "grid_config": {
            "expand_collapse": {
              "is_expand_all": false,
              "headers": []
            },
            "heatmap": {
              "enabled": 1,
              "measures": [
                {
                  "selected": true,
                  "uniqueName": "Check Count",
                  "min": null,
                  "max": null,
                  "color_code": 3
                },
                {
                  "selected": true,
                  "uniqueName": "Gross Sales",
                  "min": null,
                  "max": null,
                  "color_code": 3
                },
                {
                  "selected": true,
                  "uniqueName": "Discount",
                  "min": null,
                  "max": null,
                  "color_code": 3
                },
                {
                  "selected": true,
                  "uniqueName": "Item Count",
                  "min": null,
                  "max": null,
                  "color_code": 3
                }
              ]
            }
          },
          "hsmeasurelist": [
            "check_count",
            "gross_sales",
            "discount",
            "item_count"
          ],
          "highchart_config": {
            "xAxis": [
              {
                "max": null,
                "min": null
              }
            ],
            "yAxis": [
              {
                "max": null,
                "min": null
              }
            ]
          },
          "pivot_config": {
            "dataSource": {
              "type": "json",
              "data": [
                {
                  "Picker Group": {
                    "type": "string"
                  },
                  "Check Count": {
                    "type": "number"
                  },
                  "Gross Sales": {
                    "type": "number"
                  },
                  "Discount": {
                    "type": "number"
                  },
                  "Item Count": {
                    "type": "number"
                  }
                }
              ]
            },
            "slice": {
              "rows": [
                {
                  "uniqueName": "Picker Group",
                  "sortOrder": [
                    "heavy",
                    "high",
                    "medium",
                    "low",
                    "none"
                  ]
                }
              ],
              "columns": [
                {
                  "uniqueName": "[Measures]"
                }
              ],
              "measures": [
                {
                  "uniqueName": "Check Count",
                  "aggregation": "sum",
                  "grandTotalCaption": "Check Count",
                  "format": "check_count"
                },
                {
                  "uniqueName": "Gross Sales",
                  "aggregation": "sum",
                  "grandTotalCaption": "Gross Sales",
                  "format": "gross_sales"
                },
                {
                  "uniqueName": "Discount",
                  "aggregation": "sum",
                  "grandTotalCaption": "Discount",
                  "format": "discount"
                },
                {
                  "uniqueName": "Item Count",
                  "aggregation": "sum",
                  "grandTotalCaption": "Item Count",
                  "format": "measureDefaultFormat"
                }
              ],
              "expands": {
                "expandAll": true
              }
            },
            "options": {
              "grid": {
                "type": "classic",
                "showHeaders": false,
                "showTotals": "off",
                "grandTotalsPosition": "bottom"
              },
              "chart": {
                "axisShortNumberFormat": true,
                "type": "column"
              },
              "configuratorButton": false,
              "drillThrough": false,
              "datePattern": "MMM d, yyyy",
              "defaultHierarchySortName": "unsorted",
              "showAggregationLabels": false
            },
            "formats": [
              {
                "name": "check_count",
                "thousandsSeparator": ",",
                "decimalSeparator": ".",
                "decimalPlaces": 0,
                "maxDecimalPlaces": -1,
                "maxSymbols": 20,
                "currencySymbol": "",
                "positiveCurrencyFormat": "$1",
                "nullValue": "",
                "infinityValue": "",
                "divideByZeroValue": "",
                "textAlign": "right",
                "isPercent": false
              },
              {
                "name": "gross_sales",
                "thousandsSeparator": ",",
                "decimalSeparator": ".",
                "decimalPlaces": 2,
                "maxDecimalPlaces": -1,
                "maxSymbols": 20,
                "currencySymbol": "$",
                "positiveCurrencyFormat": "$1",
                "nullValue": "",
                "infinityValue": "",
                "divideByZeroValue": "",
                "textAlign": "right",
                "isPercent": false
              },
              {
                "name": "discount",
                "thousandsSeparator": ",",
                "decimalSeparator": ".",
                "decimalPlaces": 2,
                "maxDecimalPlaces": -1,
                "maxSymbols": 20,
                "currencySymbol": "$",
                "positiveCurrencyFormat": "$1",
                "nullValue": "",
                "infinityValue": "",
                "divideByZeroValue": "",
                "textAlign": "right",
                "isPercent": false
              },
              {
                "name": "measureDefaultFormat",
                "thousandsSeparator": ",",
                "decimalSeparator": ".",
                "decimalPlaces": 2,
                "maxDecimalPlaces": -1,
                "maxSymbols": 20,
                "currencySymbol": "",
                "positiveCurrencyFormat": "$1",
                "nullValue": "",
                "infinityValue": "",
                "divideByZeroValue": "",
                "textAlign": "right",
                "isPercent": false
              },
              {
                "name": "",
                "thousandsSeparator": "",
                "decimalSeparator": ".",
                "decimalPlaces": 0,
                "maxDecimalPlaces": -1,
                "maxSymbols": 20,
                "currencySymbol": "",
                "positiveCurrencyFormat": "$1",
                "nullValue": "",
                "infinityValue": "",
                "divideByZeroValue": "",
                "isPercent": false
              }
            ],
            "version": "2.8.1",
            "creationDate": "2020-02-29T14:49:21.096Z"
          }
        }
      }
    ],
    [
      {
        "object_id": 8,
        "default_display": "chart",
        "app_glo_fil": 0,
        "edit_content": "%3Cp%3EUse%20the%20segment%20filters%20%3C/p%3E",
        "group_name": "v464",
        "card_type": "existing_card",
        "view_name": "% gross sales trend by picker group within the day",
        "is_visible": 1,
        "filters": {},
        "run_sales_analysis": false,
        "outline_display_name": null,
        "bookmark_card_id": 8,
        "is_expand": 0,
        "hs_flow_json": {
          "intent": "cherry",
          "todate": "2019-12-31",
          "rawtext": "",
          "fromdate": "2019-10-01",
          "hsdimlist": [
            "transaction_date",
            "picker_group"
          ],
          "object_id": 43,
          "page_count": 0,
          "date_lim_ap": 0,
          "pivot_config": {
            "dataSource": {
              "type": "json",
              "data": [
                {
                  "Transaction Date": {
                    "type": "date string"
                  },
                  "Picker Group": {
                    "type": "string"
                  },
                  "Gross Sales": {
                    "type": "number"
                  }
                }
              ]
            },
            "slice": {
              "rows": [
                {
                  "uniqueName": "Transaction Date",
                  "sort": "asc"
                }
              ],
              "columns": [
                {
                  "uniqueName": "Picker Group",
                  "sortOrder": [
                    "heavy",
                    "high",
                    "medium",
                    "low",
                    "none"
                  ]
                },
                {
                  "uniqueName": "[Measures]"
                }
              ],
              "measures": [
                {
                  "uniqueName": "Gross Sales",
                  "aggregation": "sum",
                  "grandTotalCaption": "Gross Sales",
                  "format": "gross_sales"
                }
              ]
            },
            "options": {
              "grid": {
                "showHeaders": false,
                "showTotals": "off",
                "showGrandTotals": "off",
                "grandTotalsPosition": "bottom"
              },
              "chart": {
                "type": "line",
                "axisShortNumberFormat": true
              },
              "configuratorButton": false,
              "drillThrough": false,
              "datePattern": "MMM d, yyyy",
              "defaultHierarchySortName": "unsorted",
              "showAggregationLabels": false
            },
            "formats": [
              {
                "name": "gross_sales",
                "thousandsSeparator": ",",
                "decimalSeparator": ".",
                "decimalPlaces": 2,
                "maxDecimalPlaces": -1,
                "maxSymbols": 20,
                "currencySymbol": "$",
                "positiveCurrencyFormat": "$1",
                "nullValue": "",
                "infinityValue": "",
                "divideByZeroValue": "",
                "textAlign": "right",
                "isPercent": false
              },
              {
                "name": "",
                "thousandsSeparator": "",
                "decimalSeparator": ".",
                "decimalPlaces": 0,
                "maxDecimalPlaces": -1,
                "maxSymbols": 20,
                "currencySymbol": "",
                "positiveCurrencyFormat": "$1",
                "nullValue": "",
                "infinityValue": "",
                "divideByZeroValue": "",
                "isPercent": false
              }
            ],
            "version": "2.8.1",
            "creationDate": "2020-02-29T14:47:52.400Z"
          },
          "hsmeasurelist": [
            "gross_sales"
          ],
          "highchart_config": {
            "xAxis": [
              {
                "max": null,
                "min": null
              }
            ],
            "yAxis": [
              {
                "max": null,
                "min": null
              }
            ]
          },
          "grid_config": {
            "heatmap": {
              "enabled": 1,
              "measures": [
                {
                  "selected": true,
                  "uniqueName": "Gross Sales",
                  "min": null,
                  "max": null,
                  "color_code": 3,
                  "columns": [
                    {
                      "name": "high",
                      "minValue": 295.8,
                      "maxValue": 3623.84
                    },
                    {
                      "name": "heavy",
                      "minValue": 324.99,
                      "maxValue": 7696.95
                    },
                    {
                      "name": "medium",
                      "minValue": 4622.65,
                      "maxValue": 16421.7
                    },
                    {
                      "name": "low",
                      "minValue": 13245.46,
                      "maxValue": 53131.7499999995
                    },
                    {
                      "name": "none",
                      "minValue": 108036.299999999,
                      "maxValue": 306645.920000021
                    }
                  ]
                }
              ]
            },
            "expand_collapse": {
              "is_expand_all": false,
              "headers": []
            }
          }
        }
      },
      {
        "object_id": 9,
        "app_glo_fil": 0,
        "default_display": "chart",
        "edit_content": null,
        "group_name": "v464",
        "card_type": "existing_card",
        "view_name": "% traffic trend by picker group ",
        "is_visible": 0,
        "filters": {},
        "run_sales_analysis": false,
        "outline_display_name": null,
        "bookmark_card_id": 9,
        "is_expand": 0,
        "hs_flow_json": {
          "intent": "cherry",
          "todate": "2019-12-31",
          "rawtext": "",
          "fromdate": "2019-10-01",
          "hsdimlist": [
            "transaction_date",
            "picker_group"
          ],
          "page_count": "",
          "hsmeasurelist": [
            "check_count"
          ],
          "highchart_config": {
            "xAxis": [
              {
                "max": null,
                "min": null
              }
            ],
            "yAxis": [
              {
                "max": null,
                "min": null
              }
            ]
          },
          "date_lim_ap": 0,
          "pivot_config": {
            "dataSource": {
              "type": "json",
              "data": [
                {
                  "Transaction Date": {
                    "type": "date string"
                  },
                  "Picker Group": {
                    "type": "string"
                  },
                  "Check Count": {
                    "type": "number"
                  }
                }
              ]
            },
            "slice": {
              "rows": [
                {
                  "uniqueName": "Transaction Date"
                },
                {
                  "uniqueName": "Picker Group",
                  "sortOrder": [
                    "heavy",
                    "high",
                    "medium",
                    "low",
                    "none"
                  ]
                }
              ],
              "columns": [
                {
                  "uniqueName": "[Measures]"
                }
              ],
              "measures": [
                {
                  "uniqueName": "Check Count",
                  "aggregation": "sum",
                  "grandTotalCaption": "Check Count",
                  "format": "check_count"
                }
              ],
              "expands": {
                "expandAll": true
              }
            },
            "options": {
              "grid": {
                "type": "classic",
                "showHeaders": false,
                "showTotals": "off",
                "grandTotalsPosition": "bottom"
              },
              "chart": {
                "axisShortNumberFormat": true,
                "type": "line"
              },
              "configuratorButton": false,
              "drillThrough": false,
              "datePattern": "MMM d, yyyy",
              "defaultHierarchySortName": "unsorted",
              "showAggregationLabels": false
            },
            "formats": [
              {
                "name": "check_count",
                "thousandsSeparator": ",",
                "decimalSeparator": ".",
                "decimalPlaces": 0,
                "maxDecimalPlaces": -1,
                "maxSymbols": 20,
                "currencySymbol": "",
                "positiveCurrencyFormat": "$1",
                "nullValue": "",
                "infinityValue": "",
                "divideByZeroValue": "",
                "textAlign": "right",
                "isPercent": false
              },
              {
                "name": "",
                "thousandsSeparator": "",
                "decimalSeparator": ".",
                "decimalPlaces": 0,
                "maxDecimalPlaces": -1,
                "maxSymbols": 20,
                "currencySymbol": "",
                "positiveCurrencyFormat": "$1",
                "nullValue": "",
                "infinityValue": "",
                "divideByZeroValue": "",
                "isPercent": false
              }
            ],
            "version": "2.8.1",
            "creationDate": "2020-02-29T14:47:38.544Z"
          },
          "grid_config": {
            "expand_collapse": {
              "is_expand_all": false,
              "headers": []
            },
            "heatmap": {
              "enabled": 1,
              "measures": [
                {
                  "selected": true,
                  "uniqueName": "Check Count",
                  "min": null,
                  "max": null,
                  "color_code": 3
                }
              ]
            }
          }
        }
      }
    ],
    [
      {
        "object_id": 10,
        "app_glo_fil": 0,
        "default_display": "grid",
        "edit_content": "%3Cp%3ENeed%20to%20check%20the%20heat%20map%20colors%3C/p%3E",
        "group_name": "v464",
        "card_type": "existing_card",
        "view_name": "% of gross sales by picker group within day",
        "is_visible": 1,
        "filters": {},
        "run_sales_analysis": false,
        "outline_display_name": null,
        "bookmark_card_id": 10,
        "is_expand": 0,
        "hs_flow_json": {
          "intent": "cherry",
          "todate": "2019-12-31",
          "rawtext": "",
          "fromdate": "2019-10-01",
          "hsdimlist": [
            "day_name",
            "picker_group"
          ],
          "object_id": 47,
          "page_count": 0,
          "date_lim_ap": 0,
          "grid_config": {
            "expand_collapse": {
              "is_expand_all": false,
              "headers": []
            },
            "heatmap": {
              "enabled": 1,
              "measures": [
                {
                  "selected": true,
                  "uniqueName": "Gross Sales",
                  "min": null,
                  "max": null,
                  "color_code": 3
                }
              ]
            }
          },
          "pivot_config": {
            "dataSource": {
              "type": "json",
              "data": [
                {
                  "Day Name": {
                    "type": "string"
                  },
                  "Picker Group": {
                    "type": "string"
                  },
                  "Gross Sales": {
                    "type": "number"
                  }
                }
              ]
            },
            "slice": {
              "rows": [
                {
                  "uniqueName": "Day Name",
                  "sortOrder": [
                    "monday",
                    "tuesday",
                    "wednesday",
                    "thursday",
                    "friday",
                    "saturday",
                    "sunday"
                  ]
                },
                {
                  "uniqueName": "Picker Group",
                  "sortOrder": [
                    "heavy",
                    "high",
                    "medium",
                    "low",
                    "none"
                  ]
                }
              ],
              "columns": [
                {
                  "uniqueName": "[Measures]"
                }
              ],
              "measures": [
                {
                  "uniqueName": "Gross Sales",
                  "aggregation": "sum",
                  "grandTotalCaption": "Gross Sales",
                  "format": "gross_sales"
                }
              ],
              "expands": {
                "expandAll": true
              }
            },
            "options": {
              "grid": {
                "type": "classic",
                "showHeaders": false,
                "showTotals": "off",
                "grandTotalsPosition": "bottom"
              },
              "chart": {
                "axisShortNumberFormat": true,
                "type": "line"
              },
              "configuratorButton": false,
              "drillThrough": false,
              "datePattern": "MMM d, yyyy",
              "defaultHierarchySortName": "unsorted",
              "showAggregationLabels": false
            },
            "formats": [
              {
                "name": "gross_sales",
                "thousandsSeparator": ",",
                "decimalSeparator": ".",
                "decimalPlaces": 2,
                "maxDecimalPlaces": -1,
                "maxSymbols": 20,
                "currencySymbol": "$",
                "positiveCurrencyFormat": "$1",
                "nullValue": "",
                "infinityValue": "",
                "divideByZeroValue": "",
                "textAlign": "right",
                "isPercent": false
              },
              {
                "name": "",
                "thousandsSeparator": "",
                "decimalSeparator": ".",
                "decimalPlaces": 0,
                "maxDecimalPlaces": -1,
                "maxSymbols": 20,
                "currencySymbol": "",
                "positiveCurrencyFormat": "$1",
                "nullValue": "",
                "infinityValue": "",
                "divideByZeroValue": "",
                "isPercent": false
              }
            ],
            "version": "2.8.1",
            "creationDate": "2020-02-29T14:49:56.814Z"
          },
          "hsmeasurelist": [
            "gross_sales"
          ],
          "highchart_config": {
            "xAxis": [
              {
                "max": null,
                "min": null
              }
            ],
            "yAxis": [
              {
                "max": null,
                "min": null
              }
            ]
          }
        }
      }
    ],
    [
      {
        "object_id": 11,
        "app_glo_fil": 0,
        "default_display": "grid",
        "edit_content": "",
        "group_name": "v464",
        "card_type": "existing_card",
        "view_name": "% Gross sale by hour",
        "is_visible": 1,
        "filters": {},
        "run_sales_analysis": false,
        "outline_display_name": null,
        "bookmark_card_id": 11,
        "is_expand": 0,
        "hs_flow_json": {
          "intent": "cherry",
          "todate": "2019-12-31",
          "rawtext": "",
          "fromdate": "2019-10-01",
          "hsdimlist": [
            "hours",
            "picker_group"
          ],
          "object_id": 79,
          "page_count": 0,
          "date_lim_ap": 0,
          "grid_config": {
            "heatmap": {
              "enabled": 1,
              "measures": [
                {
                  "max": null,
                  "min": null,
                  "columns": [
                    {
                      "name": "heavy",
                      "maxValue": 1.4881050084322114,
                      "minValue": 0.02829101218620302
                    },
                    {
                      "name": "low",
                      "maxValue": 18.398406210647487,
                      "minValue": 5.937525347898903
                    },
                    {
                      "name": "medium",
                      "maxValue": 5.043946539973687,
                      "minValue": 0.8219441944736218
                    },
                    {
                      "name": "high",
                      "maxValue": 1.0629674816068655,
                      "minValue": 0.015954512210899986
                    },
                    {
                      "name": "none",
                      "maxValue": 92.74795356566582,
                      "minValue": 75.14474777260898
                    }
                  ],
                  "selected": true,
                  "color_code": 0,
                  "uniqueName": "Gross Sales"
                }
              ]
            },
            "expand_collapse": {
              "headers": [],
              "is_expand_all": false
            }
          },
          "hsmeasurelist": [
            "gross_sales"
          ],
          "highchart_config": {
            "xAxis": [
              {
                "max": null,
                "min": null
              }
            ],
            "yAxis": [
              {
                "max": null,
                "min": null
              }
            ]
          },
          "pivot_config": {
            "slice": {
              "rows": [
                {
                  "sort": "asc",
                  "filter": {
                    "exclude": [
                      "hours.[0]",
                      "hours.[1]",
                      "hours.[2]",
                      "hours.[3]",
                      "hours.[4]"
                    ]
                  },
                  "uniqueName": "Hours"
                }
              ],
              "columns": [
                {
                  "sortOrder": [
                    "heavy ",
                    " high ",
                    " medium",
                    " low",
                    " none"
                  ],
                  "uniqueName": "Picker Group"
                },
                {
                  "uniqueName": "[Measures]"
                }
              ],
              "expands": {
                "expandAll": true
              },
              "measures": [
                {
                  "format": "gross_sales",
                  "uniqueName": "Gross Sales",
                  "aggregation": "percentofrow",
                  "grandTotalCaption": "Gross Sales"
                },
                {
                  "active": false,
                  "uniqueName": "Hours",
                  "aggregation": "sum",
                  "grandTotalCaption": "Hours"
                },
                {
                  "active": false,
                  "uniqueName": "Picker Group",
                  "aggregation": "count",
                  "grandTotalCaption": "Picker Group"
                }
              ],
              "flatOrder": [
                "Hours",
                "Picker Group",
                "Gross Sales"
              ]
            },
            "formats": [
              {
                "name": "gross_sales",
                "isPercent": false,
                "nullValue": "",
                "textAlign": "right",
                "maxSymbols": 20,
                "decimalPlaces": 2,
                "infinityValue": "",
                "currencySymbol": "$",
                "decimalSeparator": ".",
                "maxDecimalPlaces": -1,
                "divideByZeroValue": "",
                "thousandsSeparator": ",",
                "positiveCurrencyFormat": "$1"
              }
            ],
            "options": {
              "grid": {
                "showTotals": "off",
                "showHeaders": false,
                "showGrandTotals": "off"
              },
              "chart": {
                "axisShortNumberFormat": true
              },
              "datePattern": "MMM d, yyyy",
              "configuratorButton": false,
              "showAggregationLabels": false,
              "defaultHierarchySortName": "unsorted"
            },
            "version": "2.8.1",
            "dataSource": {
              "data": [
                {
                  "Hours": {
                    "type": "number"
                  },
                  "Gross Sales": {
                    "type": "number"
                  },
                  "Picker Group": {
                    "type": "string"
                  }
                }
              ],
              "type": "json"
            },
            "creationDate": "2020-02-29T13:44:22.140Z"
          }
        }
      }
    ],
    [
      {
        "object_id": 12,
        "app_glo_fil": 0,
        "default_display": "grid",
        "edit_content": "",
        "group_name": "v464",
        "card_type": "existing_card",
        "view_name": "% Gross Sale by hour by day",
        "is_visible": 1,
        "filters": {},
        "run_sales_analysis": false,
        "outline_display_name": null,
        "bookmark_card_id": 12,
        "is_expand": 0,
        "hs_flow_json": {
          "intent": "cherry",
          "todate": "2019-12-31",
          "rawtext": "",
          "fromdate": "2019-10-01",
          "hsdimlist": [
            "hours",
            "picker_group",
            "day_name"
          ],
          "object_id": 82,
          "page_count": 0,
          "date_lim_ap": 0,
          "grid_config": {
            "heatmap": {
              "enabled": 1,
              "measures": [
                {
                  "max": null,
                  "min": null,
                  "columns": [
                    {
                      "name": "Monday",
                      "maxValue": 2.4107005207904377,
                      "minValue": 0.0001518140296354649
                    },
                    {
                      "name": "Tuesday",
                      "maxValue": 2.147515719014396,
                      "minValue": 0.0007135259392866849
                    },
                    {
                      "name": "Sunday",
                      "maxValue": 3.6161190974989927,
                      "minValue": 0.0045544208890639475
                    },
                    {
                      "name": "Friday",
                      "maxValue": 2.191139480430147,
                      "minValue": 0.0045544208890639475
                    },
                    {
                      "name": "Saturday",
                      "maxValue": 2.6750922441020815,
                      "minValue": 0.05521476257841858
                    },
                    {
                      "name": "Thursday",
                      "maxValue": 1.4369501533056024,
                      "minValue": 0.0017003171319172072
                    },
                    {
                      "name": "Wednesday",
                      "maxValue": 2.7562520243452013,
                      "minValue": 0.04054952731563268
                    }
                  ],
                  "selected": true,
                  "color_code": 0,
                  "uniqueName": "Gross Sales"
                }
              ]
            },
            "expand_collapse": {
              "headers": [],
              "is_expand_all": false
            }
          },
          "pivot_config": {
            "slice": {
              "rows": [
                {
                  "sort": "asc",
                  "filter": {
                    "exclude": [
                      "hours.[0]",
                      "hours.[1]",
                      "hours.[2]",
                      "hours.[3]",
                      "hours.[4]"
                    ]
                  },
                  "uniqueName": "Hours"
                }
              ],
              "columns": [
                {
                  "sortOrder": [
                    "monday",
                    "tuesday",
                    "wednesday",
                    "thursday",
                    "friday",
                    "saturday",
                    "sunday"
                  ],
                  "uniqueName": "Day Name"
                },
                {
                  "uniqueName": "[Measures]"
                }
              ],
              "expands": {
                "expandAll": true
              },
              "measures": [
                {
                  "format": "gross_sales",
                  "uniqueName": "Gross Sales",
                  "aggregation": "percent",
                  "grandTotalCaption": "Gross Sales"
                },
                {
                  "active": false,
                  "uniqueName": "Hours",
                  "aggregation": "sum",
                  "grandTotalCaption": "Hours"
                },
                {
                  "active": false,
                  "uniqueName": "Picker Group",
                  "aggregation": "count",
                  "grandTotalCaption": "Picker Group"
                },
                {
                  "active": false,
                  "uniqueName": "Day Name",
                  "aggregation": "count",
                  "grandTotalCaption": "Day Name"
                }
              ],
              "flatOrder": [
                "Hours",
                "Picker Group",
                "Gross Sales"
              ],
              "reportFilters": [
                {
                  "filter": {
                    "members": [
                      "picker group.[heavy]"
                    ]
                  },
                  "sortOrder": [
                    "heavy ",
                    " high ",
                    " medium",
                    " low",
                    " none"
                  ],
                  "uniqueName": "Picker Group"
                }
              ]
            },
            "formats": [
              {
                "name": "gross_sales",
                "isPercent": false,
                "nullValue": "",
                "textAlign": "right",
                "maxSymbols": 20,
                "decimalPlaces": 2,
                "infinityValue": "",
                "currencySymbol": "$",
                "decimalSeparator": ".",
                "maxDecimalPlaces": -1,
                "divideByZeroValue": "",
                "thousandsSeparator": ",",
                "positiveCurrencyFormat": "$1"
              },
              {
                "name": "",
                "isPercent": false,
                "nullValue": "",
                "maxSymbols": 20,
                "decimalPlaces": 0,
                "infinityValue": "",
                "currencySymbol": "",
                "decimalSeparator": ".",
                "maxDecimalPlaces": -1,
                "divideByZeroValue": "",
                "thousandsSeparator": "",
                "positiveCurrencyFormat": "$1"
              }
            ],
            "options": {
              "grid": {
                "type": "compact",
                "showTotals": "off",
                "showHeaders": false,
                "showGrandTotals": "off"
              },
              "chart": {
                "axisShortNumberFormat": true
              },
              "datePattern": "MMM d, yyyy",
              "configuratorButton": false,
              "showAggregationLabels": false,
              "defaultHierarchySortName": "unsorted"
            },
            "version": "2.8.1",
            "dataSource": {
              "data": [
                {
                  "Hours": {
                    "type": "number"
                  },
                  "Day Name": {
                    "type": "string"
                  },
                  "Gross Sales": {
                    "type": "number"
                  },
                  "Picker Group": {
                    "type": "string"
                  }
                }
              ],
              "type": "json"
            },
            "creationDate": "2020-02-29T13:42:03.695Z"
          },
          "hsmeasurelist": [
            "gross_sales"
          ],
          "highchart_config": {
            "xAxis": [
              {
                "max": null,
                "min": null
              }
            ],
            "yAxis": [
              {
                "max": null,
                "min": null
              }
            ]
          }
        }
      }
    ],
    [
      {
        "object_id": 13,
        "app_glo_fil": 0,
        "default_display": "grid",
        "edit_content": null,
        "group_name": "v464",
        "card_type": "existing_card",
        "view_name": "% gross sale by within stores",
        "is_visible": 1,
        "filters": {},
        "run_sales_analysis": false,
        "outline_display_name": null,
        "bookmark_card_id": 13,
        "is_expand": 0,
        "hs_flow_json": {
          "intent": "cherry",
          "todate": "2019-12-31",
          "rawtext": "",
          "fromdate": "2019-10-01",
          "hsdimlist": [
            "store_number",
            "picker_group"
          ],
          "object_id": 66,
          "page_count": null,
          "date_lim_ap": 0,
          "grid_config": {
            "heatmap": {
              "enabled": 1,
              "measures": [
                {
                  "max": null,
                  "min": null,
                  "columns": [
                    {
                      "name": "heavy",
                      "maxValue": 0.8789447819933807,
                      "minValue": 0.6078617014553644
                    },
                    {
                      "name": "high",
                      "maxValue": 0.7772006502298775,
                      "minValue": 0.6316976745086184
                    },
                    {
                      "name": "low",
                      "maxValue": 18.037692574066647,
                      "minValue": 14.07481568894927
                    },
                    {
                      "name": "medium",
                      "maxValue": 4.6179588074567635,
                      "minValue": 3.8160127466536777
                    },
                    {
                      "name": "none",
                      "maxValue": 80.52619816414138,
                      "minValue": 76.2086059038704
                    }
                  ],
                  "selected": true,
                  "color_code": 0,
                  "uniqueName": "Gross Sales"
                }
              ]
            },
            "expand_collapse": {
              "headers": [],
              "is_expand_all": false
            }
          },
          "hsmeasurelist": [
            "gross_sales"
          ],
          "highchart_config": {
            "xAxis": [
              {
                "max": null,
                "min": null
              }
            ],
            "yAxis": [
              {
                "max": null,
                "min": null
              }
            ]
          },
          "pivot_config": {
            "slice": {
              "rows": [
                {
                  "uniqueName": "Store Number"
                }
              ],
              "columns": [
                {
                  "sort": "asc",
                  "uniqueName": "Picker Group"
                },
                {
                  "uniqueName": "[Measures]"
                }
              ],
              "measures": [
                {
                  "format": "gross_sales",
                  "uniqueName": "Gross Sales",
                  "aggregation": "percentofrow",
                  "grandTotalCaption": "Gross Sales"
                },
                {
                  "active": false,
                  "uniqueName": "Store Number",
                  "aggregation": "sum",
                  "grandTotalCaption": "Store Number"
                },
                {
                  "active": false,
                  "uniqueName": "Picker Group",
                  "aggregation": "count",
                  "grandTotalCaption": "Picker Group"
                }
              ]
            },
            "formats": [
              {
                "name": "gross_sales",
                "isPercent": false,
                "nullValue": "",
                "textAlign": "right",
                "maxSymbols": 20,
                "decimalPlaces": 2,
                "infinityValue": "",
                "currencySymbol": "$",
                "decimalSeparator": ".",
                "maxDecimalPlaces": -1,
                "divideByZeroValue": "",
                "thousandsSeparator": ",",
                "positiveCurrencyFormat": "$1"
              }
            ],
            "options": {
              "grid": {
                "type": "classic",
                "showTotals": "off",
                "showHeaders": false,
                "showGrandTotals": "off"
              },
              "chart": {
                "axisShortNumberFormat": true
              },
              "datePattern": "MMM d, yyyy",
              "configuratorButton": false,
              "showAggregationLabels": false,
              "defaultHierarchySortName": "unsorted"
            },
            "version": "2.8.1",
            "dataSource": {
              "data": [
                {
                  "Gross Sales": {
                    "type": "number"
                  },
                  "Picker Group": {
                    "type": "string"
                  },
                  "Store Number": {
                    "type": "number"
                  }
                }
              ],
              "type": "json"
            },
            "creationDate": "2020-02-29T12:48:03.647Z"
          }
        }
      }
    ],
    [
      {
        "object_id": 14,
        "app_glo_fil": 0,
        "edit_content": null,
        "group_name": "v464",
        "default_display": "grid",
        "card_type": "existing_card",
        "view_name": "% Traffic by within stores",
        "is_visible": 1,
        "filters": {},
        "run_sales_analysis": false,
        "outline_display_name": null,
        "bookmark_card_id": 14,
        "is_expand": 0,
        "hs_flow_json": {
          "intent": "cherry",
          "todate": "2019-12-31",
          "rawtext": "",
          "fromdate": "2019-10-01",
          "hsdimlist": [
            "store_number",
            "picker_group"
          ],
          "object_id": 67,
          "page_count": 0,
          "date_lim_ap": 0,
          "grid_config": {
            "heatmap": {
              "enabled": 1,
              "measures": [
                {
                  "max": null,
                  "min": null,
                  "columns": [
                    {
                      "name": "high",
                      "maxValue": 0.859843245735362,
                      "minValue": 0.4687585790369516
                    },
                    {
                      "name": "heavy",
                      "maxValue": 2.00437989857077,
                      "minValue": 1.2827376050074122
                    },
                    {
                      "name": "medium",
                      "maxValue": 5.927846934071001,
                      "minValue": 3.425437874046011
                    },
                    {
                      "name": "low",
                      "maxValue": 12.800829875518671,
                      "minValue": 7.082166584307912
                    },
                    {
                      "name": "none",
                      "maxValue": 87.74089935760172,
                      "minValue": 78.40710004610419
                    }
                  ],
                  "selected": true,
                  "color_code": 0,
                  "uniqueName": "Check Count"
                }
              ]
            },
            "expand_collapse": {
              "headers": [],
              "is_expand_all": false
            }
          },
          "hsmeasurelist": [
            "check_count"
          ],
          "highchart_config": {
            "xAxis": [
              {
                "max": null,
                "min": null
              }
            ],
            "yAxis": [
              {
                "max": null,
                "min": null
              }
            ]
          },
          "pivot_config": {
            "slice": {
              "rows": [
                {
                  "sort": "asc",
                  "uniqueName": "Store Number"
                }
              ],
              "columns": [
                {
                  "sortOrder": [
                    "heavy ",
                    " high ",
                    " medium",
                    " low",
                    " none"
                  ],
                  "uniqueName": "Picker Group"
                },
                {
                  "uniqueName": "[Measures]"
                }
              ],
              "measures": [
                {
                  "format": "-38n33oe4tt3u0",
                  "uniqueName": "Check Count",
                  "aggregation": "percentofrow",
                  "grandTotalCaption": "Check Count"
                },
                {
                  "active": false,
                  "uniqueName": "Store Number",
                  "aggregation": "sum",
                  "grandTotalCaption": "Store Number"
                },
                {
                  "active": false,
                  "uniqueName": "Picker Group",
                  "aggregation": "count",
                  "grandTotalCaption": "Picker Group"
                }
              ]
            },
            "formats": [
              {
                "name": "-38n33oe4tt3u0",
                "isPercent": false,
                "nullValue": "",
                "textAlign": "right",
                "maxSymbols": 20,
                "decimalPlaces": 2,
                "infinityValue": "",
                "currencySymbol": "",
                "decimalSeparator": ".",
                "maxDecimalPlaces": -1,
                "divideByZeroValue": "",
                "thousandsSeparator": ",",
                "positiveCurrencyFormat": "$1"
              }
            ],
            "options": {
              "grid": {
                "type": "classic",
                "showTotals": "off",
                "showHeaders": false,
                "showGrandTotals": "off"
              },
              "chart": {
                "axisShortNumberFormat": true
              },
              "datePattern": "MMM d, yyyy",
              "configuratorButton": false,
              "showAggregationLabels": false,
              "defaultHierarchySortName": "unsorted"
            },
            "version": "2.8.1",
            "dataSource": {
              "data": [
                {
                  "Check Count": {
                    "type": "number"
                  },
                  "Picker Group": {
                    "type": "string"
                  },
                  "Store Number": {
                    "type": "number"
                  }
                }
              ],
              "type": "json"
            },
            "creationDate": "2020-02-29T13:47:06.438Z"
          }
        }
      }
    ],
    [
      {
        "object_id": 15,
        "app_glo_fil": 0,
        "default_display": "grid",
        "edit_content": "%3Cp%3EBy%20category%20%25%20gross%20sales%3C/p%3E",
        "group_name": "v464",
        "card_type": "existing_card",
        "view_name": "What the cherry pickers are buying ?",
        "is_visible": 1,
        "filters": {},
        "run_sales_analysis": false,
        "outline_display_name": null,
        "bookmark_card_id": 15,
        "is_expand": 0,
        "hs_flow_json": {
          "intent": "cherry",
          "todate": "2019-12-31",
          "rawtext": "",
          "fromdate": "2019-10-01",
          "hsdimlist": [
            "level1",
            "picker_group"
          ],
          "object_id": 83,
          "page_count": "",
          "date_lim_ap": 0,
          "grid_config": {
            "heatmap": {
              "enabled": 1,
              "measures": [
                {
                  "max": null,
                  "min": null,
                  "columns": [
                    {
                      "name": "heavy",
                      "maxValue": 69.09796582104481,
                      "minValue": 0.0007590701481773245
                    },
                    {
                      "name": "high",
                      "maxValue": 40.532060566374305,
                      "minValue": 0.027346156699687423
                    },
                    {
                      "name": "medium",
                      "maxValue": 32.07260746357824,
                      "minValue": 0.07250126050599337
                    },
                    {
                      "name": "low",
                      "maxValue": 25.224607748075595,
                      "minValue": 0.055980657882328186
                    },
                    {
                      "name": "none",
                      "maxValue": 24.025118753152732,
                      "minValue": 0.7765525946135394
                    }
                  ],
                  "selected": true,
                  "color_code": 0,
                  "uniqueName": "Gross Sales"
                }
              ]
            },
            "expand_collapse": {
              "headers": [],
              "is_expand_all": true
            }
          },
          "pivot_config": {
            "slice": {
              "rows": [
                {
                  "sort": "asc",
                  "filter": {
                    "exclude": [
                      "dept. group desc.[-]"
                    ]
                  },
                  "uniqueName": "Dept. Group Desc"
                }
              ],
              "columns": [
                {
                  "sortOrder": [
                    "heavy ",
                    " high ",
                    " medium",
                    " low",
                    " none"
                  ],
                  "uniqueName": "Picker Group"
                },
                {
                  "uniqueName": "[Measures]"
                }
              ],
              "expands": {
                "expandAll": true
              },
              "measures": [
                {
                  "format": "gross_sales",
                  "uniqueName": "Gross Sales",
                  "aggregation": "percentofcolumn",
                  "grandTotalCaption": "Gross Sales"
                },
                {
                  "active": false,
                  "uniqueName": "Dept. Group Desc",
                  "aggregation": "count",
                  "grandTotalCaption": "Dept. Group Desc"
                },
                {
                  "active": false,
                  "uniqueName": "Picker Group",
                  "aggregation": "count",
                  "grandTotalCaption": "Picker Group"
                }
              ]
            },
            "formats": [
              {
                "name": "gross_sales",
                "isPercent": false,
                "nullValue": "",
                "textAlign": "right",
                "maxSymbols": 20,
                "decimalPlaces": 2,
                "infinityValue": "",
                "currencySymbol": "$",
                "decimalSeparator": ".",
                "maxDecimalPlaces": -1,
                "divideByZeroValue": "",
                "thousandsSeparator": ",",
                "positiveCurrencyFormat": "$1"
              },
              {
                "name": "",
                "isPercent": false,
                "nullValue": "",
                "maxSymbols": 20,
                "decimalPlaces": 0,
                "infinityValue": "",
                "currencySymbol": "",
                "decimalSeparator": ".",
                "maxDecimalPlaces": -1,
                "divideByZeroValue": "",
                "thousandsSeparator": "",
                "positiveCurrencyFormat": "$1"
              }
            ],
            "options": {
              "grid": {
                "type": "compact",
                "showTotals": "off",
                "showHeaders": false,
                "showGrandTotals": "off"
              },
              "chart": {
                "axisShortNumberFormat": true
              },
              "datePattern": "MMM d, yyyy",
              "configuratorButton": false,
              "showAggregationLabels": false,
              "defaultHierarchySortName": "unsorted"
            },
            "version": "2.8.1",
            "dataSource": {
              "data": [
                {
                  "Gross Sales": {
                    "type": "number"
                  },
                  "Picker Group": {
                    "type": "string"
                  },
                  "Dept. Group Desc": {
                    "type": "string"
                  }
                }
              ],
              "type": "json"
            },
            "creationDate": "2020-02-29T13:54:08.273Z"
          },
          "hsmeasurelist": [
            "gross_sales"
          ],
          "highchart_config": {
            "xAxis": [
              {
                "max": null,
                "min": null
              }
            ],
            "yAxis": [
              {
                "max": null,
                "min": null
              }
            ]
          }
        }
      }
    ],
    [
      {
        "object_id": 16,
        "app_glo_fil": 0,
        "default_display": "grid",
        "edit_content": null,
        "group_name": "v464",
        "card_type": "existing_card",
        "view_name": "What item picker segment are buying ?",
        "is_visible": 1,
        "filters": {},
        "run_sales_analysis": false,
        "outline_display_name": null,
        "bookmark_card_id": 16,
        "is_expand": 0,
        "hs_flow_json": {
          "intent": "cherry",
          "todate": "2019-12-31",
          "rawtext": "",
          "fromdate": "2019-10-01",
          "hsdimlist": [
            "item_description",
            "level1",
            "picker_group",
            "store_number"
          ],
          "page_count": "",
          "grid_config": {
            "expand_collapse": {
              "headers": [],
              "is_expand_all": true
            }
          },
          "hsmeasurelist": [
            "gross_sales",
            "quantity_actl",
            "check_count"
          ],
          "highchart_config": {
            "xAxis": [
              {
                "max": null,
                "min": null
              }
            ],
            "yAxis": [
              {
                "max": null,
                "min": null
              }
            ]
          },
          "date_lim_ap": 0,
          "pivot_config": {
            "slice": {
              "rows": [
                {
                  "uniqueName": "Item Description"
                }
              ],
              "columns": [
                {
                  "uniqueName": "[Measures]"
                }
              ],
              "expands": {
                "expandAll": true
              },
              "sorting": {
                "column": {
                  "type": "desc",
                  "tuple": [],
                  "measure": {
                    "uniqueName": "Gross Sales",
                    "aggregation": "sum"
                  }
                }
              },
              "measures": [
                {
                  "format": "gross_sales",
                  "uniqueName": "Gross Sales",
                  "aggregation": "sum",
                  "grandTotalCaption": "Gross Sales"
                },
                {
                  "format": "quantity_actl",
                  "uniqueName": "Quantity Actl",
                  "aggregation": "sum",
                  "grandTotalCaption": "Quantity Actl"
                },
                {
                  "format": "check_count",
                  "uniqueName": "Check Count",
                  "aggregation": "sum",
                  "grandTotalCaption": "Check Count"
                },
                {
                  "format": "-uou2eypyrf300",
                  "caption": "Average Unit Retail",
                  "formula": "sum(\"Gross Sales\") / sum(\"Quantity Actl\")",
                  "uniqueName": "Average Unit Retail"
                },
                {
                  "active": false,
                  "uniqueName": "Item Description",
                  "aggregation": "count",
                  "grandTotalCaption": "Item Description"
                },
                {
                  "active": false,
                  "uniqueName": "Dept. Group Desc",
                  "aggregation": "count",
                  "grandTotalCaption": "Dept. Group Desc"
                },
                {
                  "active": false,
                  "uniqueName": "Picker Group",
                  "aggregation": "count",
                  "grandTotalCaption": "Picker Group"
                },
                {
                  "active": false,
                  "uniqueName": "Store Number",
                  "aggregation": "sum",
                  "grandTotalCaption": "Store Number"
                }
              ],
              "reportFilters": [
                {
                  "filter": {
                    "members": [
                      "dept. group desc.[meat and seafood]"
                    ]
                  },
                  "uniqueName": "Dept. Group Desc"
                },
                {
                  "sortOrder": [
                    "heavy ",
                    " high ",
                    " medium",
                    " low",
                    " none"
                  ],
                  "uniqueName": "Picker Group"
                },
                {
                  "uniqueName": "Store Number"
                }
              ]
            },
            "formats": [
              {
                "name": "gross_sales",
                "isPercent": false,
                "nullValue": "",
                "textAlign": "right",
                "maxSymbols": 20,
                "decimalPlaces": 2,
                "infinityValue": "",
                "currencySymbol": "$",
                "decimalSeparator": ".",
                "maxDecimalPlaces": -1,
                "divideByZeroValue": "",
                "thousandsSeparator": ",",
                "positiveCurrencyFormat": "$1"
              },
              {
                "name": "check_count",
                "isPercent": false,
                "nullValue": "",
                "textAlign": "right",
                "maxSymbols": 20,
                "decimalPlaces": 0,
                "infinityValue": "",
                "currencySymbol": "",
                "decimalSeparator": ".",
                "maxDecimalPlaces": -1,
                "divideByZeroValue": "",
                "thousandsSeparator": ",",
                "positiveCurrencyFormat": "$1"
              },
              {
                "name": "",
                "isPercent": false,
                "nullValue": "",
                "maxSymbols": 20,
                "decimalPlaces": 0,
                "infinityValue": "",
                "currencySymbol": "",
                "decimalSeparator": ".",
                "maxDecimalPlaces": -1,
                "divideByZeroValue": "",
                "thousandsSeparator": "",
                "positiveCurrencyFormat": "$1"
              },
              {
                "name": "quantity_actl",
                "isPercent": false,
                "nullValue": "",
                "textAlign": "right",
                "maxSymbols": 20,
                "decimalPlaces": 2,
                "infinityValue": "",
                "currencySymbol": "",
                "decimalSeparator": ".",
                "maxDecimalPlaces": -1,
                "divideByZeroValue": "",
                "thousandsSeparator": ",",
                "positiveCurrencyFormat": "$1"
              },
              {
                "name": "-uou2eypyrf300",
                "isPercent": false,
                "nullValue": "",
                "maxSymbols": 20,
                "decimalPlaces": 2,
                "infinityValue": "",
                "currencySymbol": "",
                "decimalSeparator": ".",
                "maxDecimalPlaces": -1,
                "divideByZeroValue": "",
                "thousandsSeparator": ",",
                "positiveCurrencyFormat": "$1"
              }
            ],
            "options": {
              "grid": {
                "type": "compact",
                "showTotals": "off",
                "showHeaders": false,
                "showGrandTotals": "off"
              },
              "chart": {
                "axisShortNumberFormat": true
              },
              "datePattern": "MMM d, yyyy",
              "configuratorButton": false,
              "showAggregationLabels": false,
              "defaultHierarchySortName": "unsorted"
            },
            "version": "2.8.1",
            "dataSource": {
              "data": [
                {
                  "Check Count": {
                    "type": "number"
                  },
                  "Gross Sales": {
                    "type": "number"
                  },
                  "Picker Group": {
                    "type": "string"
                  },
                  "Store Number": {
                    "type": "number"
                  },
                  "Quantity Actl": {
                    "type": "number"
                  },
                  "Dept. Group Desc": {
                    "type": "string"
                  },
                  "Item Description": {
                    "type": "string"
                  }
                }
              ],
              "type": "json"
            },
            "creationDate": "2020-02-29T14:03:04.546Z"
          }
        }
      }
    ]
  ]
}