
<svg width="15px" height="15px" viewBox="0 0 15 15" version="1.1" xmlns="http://www.w3.org/2000/svg" xmlns:xlink="http://www.w3.org/1999/xlink">
    <g id="Page-1" stroke="none" stroke-width="1" fill="none" fill-rule="evenodd">
        <g id="Campaign-Analysis" transform="translate(-125.000000, -429.000000)">
            <rect fill="#FFFFFF" x="0" y="0" width="1440" height="2428"></rect>
            <g id="Group-7" transform="translate(0.000000, 389.000000)" fill="#7F7F7F">
                <g id="More-Info" transform="translate(125.000000, 40.000000)">
                    <g id="Group-12">
                        <path d="M7.3816621,-7.10542736e-14 C9.33976404,-7.10542736e-14 11.2176319,0.778018413 12.6019922,2.16283242 C13.9863524,3.54764643 14.7637555,5.42576913 14.7631201,7.38387097 C14.767029,10.370267 12.9710806,13.0647807 10.2131334,14.210339 C7.45518615,15.3558973 4.27870623,14.7267625 2.16561881,12.6164455 C0.0525313878,10.5061284 -0.580770025,7.3304766 0.561169082,4.57102889 C1.70310819,1.81158118 4.39526351,0.0120993408 7.3816621,0.0120967742 L7.3816621,0.0120967742 Z M7.3816621,1.22177419 C3.98008805,1.2257737 1.22356483,3.98229692 1.21956533,7.38387097 C1.21956533,10.787103 3.97843003,13.5459677 7.3816621,13.5459677 C10.7848942,13.5459677 13.5437589,10.787103 13.5437589,7.38387097 C13.5437589,3.98063889 10.7848942,1.22177419 7.3816621,1.22177419 Z M8.04698468,6.05080645 L8.04698468,10.8895161 L6.82762985,10.8895161 L6.82762985,6.05080645 L8.04698468,6.05080645 Z M8.04698468,3.6 L8.04698468,4.80967742 L6.82762985,4.80967742 L6.82762985,3.6 L8.04698468,3.6 Z" id="Combined-Shape" fill-rule="nonzero"></path>
                    </g>
                </g>
            </g>
        </g>
    </g>
</svg>
