%YAML 1.1
%TAG !u! tag:unity3d.com,2011:
--- !u!114 &11400000
MonoBehaviour:
  m_ObjectHideFlags: 0
  m_CorrespondingSourceObject: {fileID: 0}
  m_PrefabInstance: {fileID: 0}
  m_PrefabAsset: {fileID: 0}
  m_GameObject: {fileID: 0}
  m_Enabled: 1
  m_EditorHideFlags: 0
  m_Script: {fileID: 11500000, guid: 2864df11ed76f6a4eb2702667360b8eb, type: 3}
  m_Name: 1
  m_EditorClassIdentifier: 
  sprite: {fileID: 10913, guid: 0000000000000000f000000000000000, type: 0}
  story: test story
  repeatable: 1
  stateChoices:
  - description: 1a
    nextState: {fileID: 11400000, guid: 86331f754b9c6024680fd0f3c7b7bf45, type: 2}
  - description: 1b
    nextState: {fileID: 11400000, guid: 37806d2a41819814aaa0ba0052942bc7, type: 2}
  statsModifiers:
  - statType: {fileID: 11400000, guid: 64ae80110f4776049a8701c2aad00c3f, type: 2}
    amount: 1
  - statType: {fileID: 11400000, guid: 93ecbc790300ca8499e43f62daf3f71c, type: 2}
    amount: 1
  - statType: {fileID: 11400000, guid: 4913e8512873e6641889552c99310299, type: 2}
    amount: 1
