 {
   "name": "mongo-source",
   "config": {
     "tasks.max":"1",
     "connector.class":"com.mongodb.kafka.connect.MongoSourceConnector",
     "connection.uri":"mongodb+srv://subscription-dev-access:XXXXXXXXX@subscription-pri.r6s0o.mongodb.net/subscription",
     "key.converter": "org.apache.kafka.connect.json.JsonConverter",
     "value.converter": "org.apache.kafka.connect.json.JsonConverter",
     "topic.prefix":"mongo",
     "topic.suffix":"",
     "database":"subscription",
     "collection":"subscription",
     "pipeline":"[]"
   }
 }

