[gd_scene load_steps=16 format=2]

[ext_resource path="res://tiles/simple_tileset.tres" type="TileSet" id=1]
[ext_resource path="res://tools/frog spring/SuperFrog.tscn" type="PackedScene" id=2]
[ext_resource path="res://levels/Level.tscn" type="PackedScene" id=3]
[ext_resource path="res://tools/eagle speed/SuperEagle.tscn" type="PackedScene" id=4]
[ext_resource path="res://obstacles/snek/Snake.tscn" type="PackedScene" id=5]
[ext_resource path="res://tools/bread/Bread.tscn" type="PackedScene" id=6]
[ext_resource path="res://obstacles/gopher/Exit.tscn" type="PackedScene" id=7]
[ext_resource path="res://obstacles/gopher/Gopher.tscn" type="PackedScene" id=8]
[ext_resource path="res://tiles/background/lil bush.png" type="Texture" id=9]
[ext_resource path="res://tiles/background/ferns.png" type="Texture" id=10]
[ext_resource path="res://tiles/background/tree.png" type="Texture" id=11]
[ext_resource path="res://tiles/background/leaves.png" type="Texture" id=12]
[ext_resource path="res://tools/eagle speed/Eagle.tscn" type="PackedScene" id=13]
[ext_resource path="res://obstacles/hazards/KillBox.tscn" type="PackedScene" id=14]

[sub_resource type="RectangleShape2D" id=1]
extents = Vector2( 7328, 10 )

[node name="LevelSuper" instance=ExtResource( 3 )]
showcase_map = true
showcase_time = 12.0
showcase_delay = 2.0

[node name="BGTileMap" parent="." index="1"]
tile_set = ExtResource( 1 )
tile_data = PoolIntArray( -131071, 16, 0, -131070, 16, 0, -131069, 16, 0, -131068, 16, 0, -131067, 16, 0, -131066, 16, 0, -131065, 16, 0, -131064, 16, 0, -131063, 16, 0, -131062, 16, 0, -131061, 16, 0, -131060, 16, 0, -131059, 16, 0, -131058, 16, 0, -131057, 16, 0, -131056, 16, 0, -131055, 16, 0, -131054, 16, 0, -131053, 16, 0, -131052, 16, 0, -131051, 16, 0, -131050, 16, 0, -131049, 16, 0, -131048, 16, 0, -131047, 16, 0, -131046, 16, 0, -131045, 16, 0, -131044, 16, 0, -131043, 16, 0, -131042, 16, 0, -131041, 16, 0, -131040, 16, 0, -131039, 16, 0, -131038, 16, 0, -131037, 16, 0, -131036, 16, 0, -131035, 16, 0, -131034, 16, 0, -131033, 16, 0, -131032, 16, 0, -131031, 16, 0, -131030, 16, 0, -131029, 16, 0, -131028, 16, 0, -131027, 16, 0, -131026, 16, 0, -131025, 16, 0, -131024, 16, 0, -131023, 16, 0, -131022, 16, 0, -131021, 16, 0, -131020, 16, 0, -131019, 16, 0, -131018, 16, 0, -131017, 16, 0, -131016, 16, 0, -131015, 16, 0, -131014, 16, 0, -131013, 16, 0, -131012, 16, 0, -131011, 16, 0, -131010, 16, 0, -131009, 16, 0, -131008, 16, 0, -131007, 16, 0, -131006, 16, 0, -131005, 16, 0, -131004, 16, 0, -131003, 16, 0, -131002, 16, 0, -131001, 16, 0, -131000, 16, 0, -130999, 16, 0, -130998, 16, 0, -130997, 16, 0, -130996, 16, 0, -130995, 16, 0, -130994, 16, 0, -130993, 16, 0, -130992, 16, 0, -130991, 16, 0, -130990, 16, 0, -130989, 16, 0, -130988, 16, 0, -130987, 16, 0, -130986, 16, 0, -130985, 16, 0, -130984, 16, 0, -130983, 16, 0, -130982, 16, 0, -130981, 16, 0, -130980, 16, 0, -130979, 16, 0, -130978, 16, 0, -130977, 16, 0, -130976, 16, 0, -130975, 16, 0, -130974, 16, 0, -130973, 16, 0, -130972, 16, 0, -130971, 16, 0, -130970, 16, 0, -130969, 16, 0, -65535, 16, 0, -65534, 16, 0, -65533, 16, 0, -65532, 16, 0, -65531, 16, 0, -65530, 16, 0, -65529, 16, 0, -65528, 16, 0, -65527, 16, 0, -65526, 16, 0, -65525, 16, 0, -65524, 16, 0, -65523, 16, 0, -65522, 16, 0, -65521, 16, 0, -65520, 16, 0, -65519, 16, 0, -65518, 16, 0, -65517, 16, 0, -65516, 16, 0, -65515, 16, 0, -65514, 16, 0, -65513, 16, 0, -65512, 16, 0, -65511, 16, 0, -65510, 16, 0, -65509, 16, 0, -65508, 16, 0, -65507, 16, 0, -65506, 16, 0, -65505, 16, 0, -65504, 16, 0, -65503, 16, 0, -65502, 16, 0, -65501, 16, 0, -65500, 16, 0, -65499, 16, 0, -65498, 16, 0, -65497, 16, 0, -65496, 16, 0, -65495, 16, 0, -65494, 16, 0, -65493, 16, 0, -65492, 16, 0, -65491, 16, 0, -65490, 16, 0, -65489, 16, 0, -65488, 16, 0, -65487, 16, 0, -65486, 16, 0, -65485, 16, 0, -65484, 16, 0, -65483, 16, 0, -65482, 16, 0, -65481, 16, 0, -65480, 16, 0, -65479, 16, 0, -65478, 16, 0, -65477, 16, 0, -65476, 16, 0, -65475, 16, 0, -65474, 16, 0, -65473, 16, 0, -65472, 16, 0, -65471, 16, 0, -65470, 16, 0, -65469, 16, 0, -65468, 16, 0, -65467, 16, 0, -65466, 16, 0, -65465, 16, 0, -65464, 16, 0, -65463, 16, 0, -65462, 16, 0, -65461, 16, 0, -65460, 16, 0, -65459, 16, 0, -65458, 16, 0, -65457, 16, 0, -65456, 16, 0, -65455, 16, 0, -65454, 16, 0, -65453, 16, 0, -65452, 16, 0, -65451, 16, 0, -65450, 16, 0, -65449, 16, 0, -65448, 16, 0, -65447, 16, 0, -65446, 16, 0, -65445, 16, 0, -65444, 16, 0, -65443, 16, 0, -65442, 16, 0, -65441, 16, 0, -65440, 16, 0, -65439, 16, 0, -65438, 16, 0, -65437, 16, 0, -65436, 16, 0, -65435, 16, 0, -65434, 16, 0, -65433, 16, 0, 1, 16, 0, 2, 16, 0, 3, 16, 0, 4, 16, 0, 5, 16, 0, 6, 16, 0, 7, 16, 0, 8, 16, 0, 9, 16, 0, 10, 16, 0, 11, 16, 0, 12, 16, 0, 13, 16, 0, 14, 16, 0, 15, 16, 0, 16, 16, 0, 17, 16, 0, 18, 16, 0, 19, 16, 0, 20, 16, 0, 21, 16, 0, 22, 16, 0, 23, 16, 0, 24, 16, 0, 25, 16, 0, 26, 16, 0, 27, 16, 0, 28, 16, 0, 29, 16, 0, 30, 16, 0, 31, 16, 0, 32, 16, 0, 33, 16, 0, 34, 16, 0, 35, 16, 0, 36, 16, 0, 37, 16, 0, 38, 16, 0, 39, 16, 0, 40, 16, 0, 41, 16, 0, 42, 16, 0, 43, 16, 0, 44, 16, 0, 45, 16, 0, 46, 16, 0, 47, 16, 0, 48, 16, 0, 49, 16, 0, 50, 16, 0, 51, 16, 0, 52, 16, 0, 53, 16, 0, 54, 16, 0, 55, 16, 0, 56, 16, 0, 57, 16, 0, 58, 16, 0, 59, 16, 0, 60, 16, 0, 61, 16, 0, 62, 16, 0, 63, 16, 0, 64, 16, 0, 65, 16, 0, 66, 16, 0, 67, 16, 0, 68, 16, 0, 69, 16, 0, 70, 16, 0, 71, 16, 0, 72, 16, 0, 73, 16, 0, 74, 16, 0, 75, 16, 0, 76, 16, 0, 77, 16, 0, 78, 16, 0, 79, 16, 0, 80, 16, 0, 81, 16, 0, 82, 16, 0, 83, 16, 0, 84, 16, 0, 85, 16, 0, 86, 16, 0, 87, 16, 0, 88, 16, 0, 89, 16, 0, 90, 16, 0, 91, 16, 0, 92, 16, 0, 93, 16, 0, 94, 16, 0, 95, 16, 0, 96, 16, 0, 97, 16, 0, 98, 16, 0, 99, 16, 0, 100, 16, 0, 101, 16, 0, 102, 16, 0, 103, 16, 0, 65537, 16, 0, 65538, 16, 0, 65539, 16, 0, 65540, 16, 0, 65541, 16, 0, 65542, 16, 0, 65543, 16, 0, 65544, 16, 0, 65545, 16, 0, 65546, 16, 0, 65547, 16, 0, 65548, 16, 0, 65549, 16, 0, 65550, 16, 0, 65551, 16, 0, 65552, 16, 0, 65553, 16, 0, 65554, 16, 0, 65555, 16, 0, 65556, 16, 0, 65557, 16, 0, 65558, 16, 0, 65559, 16, 0, 65560, 16, 0, 65561, 16, 0, 65562, 16, 0, 65563, 16, 0, 65564, 16, 0, 65565, 16, 0, 65566, 16, 0, 65567, 16, 0, 65568, 16, 0, 65569, 16, 0, 65570, 16, 0, 65571, 16, 0, 65572, 16, 0, 65573, 16, 0, 65574, 16, 0, 65575, 16, 0, 65576, 16, 0, 65577, 16, 0, 65578, 16, 0, 65579, 16, 0, 65580, 16, 0, 65581, 16, 0, 65582, 16, 0, 65583, 16, 0, 65584, 16, 0, 65585, 16, 0, 65586, 16, 0, 65587, 16, 0, 65588, 16, 0, 65589, 16, 0, 65590, 16, 0, 65591, 16, 0, 65592, 16, 0, 65593, 16, 0, 65594, 16, 0, 65595, 16, 0, 65596, 16, 0, 65597, 16, 0, 65598, 16, 0, 65599, 16, 0, 65600, 16, 0, 65601, 16, 0, 65602, 16, 0, 65603, 16, 0, 65604, 16, 0, 65605, 16, 0, 65606, 16, 0, 65607, 16, 0, 65608, 16, 0, 65609, 16, 0, 65610, 16, 0, 65611, 16, 0, 65612, 16, 0, 65613, 16, 0, 65614, 16, 0, 65615, 16, 0, 65616, 16, 0, 65617, 16, 0, 65618, 16, 0, 65619, 16, 0, 65620, 16, 0, 65621, 16, 0, 65622, 16, 0, 65623, 16, 0, 65624, 16, 0, 65625, 16, 0, 65626, 16, 0, 65627, 16, 0, 65628, 16, 0, 65629, 16, 0, 65630, 16, 0, 65631, 16, 0, 65632, 16, 0, 65633, 16, 0, 65634, 16, 0, 65635, 16, 0, 65636, 16, 0, 65637, 16, 0, 65638, 16, 0, 65639, 16, 0, 131073, 16, 0, 131074, 16, 0, 131075, 16, 0, 131076, 16, 0, 131077, 16, 0, 131078, 16, 0, 131079, 16, 0, 131080, 16, 0, 131081, 16, 0, 131082, 16, 0, 131083, 16, 0, 131084, 16, 0, 131085, 16, 0, 131086, 16, 0, 131087, 16, 0, 131088, 16, 0, 131089, 16, 0, 131090, 16, 0, 131091, 16, 0, 131092, 16, 0, 131093, 16, 0, 131094, 16, 0, 131095, 16, 0, 131096, 16, 0, 131097, 16, 0, 131098, 16, 0, 131099, 16, 0, 131100, 16, 0, 131101, 16, 0, 131102, 16, 0, 131103, 16, 0, 131104, 16, 0, 131105, 16, 0, 131106, 16, 0, 131107, 16, 0, 131108, 16, 0, 131109, 16, 0, 131110, 16, 0, 131111, 16, 0, 131112, 16, 0, 131113, 16, 0, 131114, 16, 0, 131115, 16, 0, 131116, 16, 0, 131117, 16, 0, 131118, 16, 0, 131119, 16, 0, 131120, 16, 0, 131121, 16, 0, 131122, 16, 0, 131123, 16, 0, 131124, 16, 0, 131125, 16, 0, 131126, 16, 0, 131127, 16, 0, 131128, 16, 0, 131129, 16, 0, 131130, 16, 0, 131131, 16, 0, 131132, 16, 0, 131133, 16, 0, 131134, 16, 0, 131135, 16, 0, 131136, 16, 0, 131137, 16, 0, 131138, 16, 0, 131139, 16, 0, 131140, 16, 0, 131141, 16, 0, 131142, 16, 0, 131143, 16, 0, 131144, 16, 0, 131145, 16, 0, 131146, 16, 0, 131147, 16, 0, 131148, 16, 0, 131149, 16, 0, 131150, 16, 0, 131151, 16, 0, 131152, 16, 0, 131153, 16, 0, 131154, 16, 0, 131155, 16, 0, 131156, 16, 0, 131157, 16, 0, 131158, 16, 0, 131159, 16, 0, 131160, 16, 0, 131161, 16, 0, 131162, 16, 0, 131163, 16, 0, 131164, 16, 0, 131165, 16, 0, 131166, 16, 0, 131167, 16, 0, 131168, 16, 0, 131169, 16, 0, 131170, 16, 0, 131171, 16, 0, 131172, 16, 0, 131173, 16, 0, 131174, 16, 0, 131175, 16, 0, 196609, 16, 0, 196610, 16, 0, 196611, 16, 0, 196612, 16, 0, 196613, 16, 0, 196614, 16, 0, 196615, 16, 0, 196616, 16, 0, 196617, 16, 0, 196618, 16, 0, 196619, 16, 0, 196620, 16, 0, 196621, 16, 0, 196622, 16, 0, 196623, 16, 0, 196624, 16, 0, 196625, 16, 0, 196626, 16, 0, 196627, 16, 0, 196628, 16, 0, 196629, 16, 0, 196630, 16, 0, 196631, 16, 0, 196632, 16, 0, 196633, 16, 0, 196634, 16, 0, 196635, 16, 0, 196636, 16, 0, 196637, 16, 0, 196638, 16, 0, 196639, 16, 0, 196640, 16, 0, 196641, 16, 0, 196642, 16, 0, 196643, 16, 0, 196644, 16, 0, 196645, 16, 0, 196646, 16, 0, 196647, 16, 0, 196648, 16, 0, 196649, 16, 0, 196650, 16, 0, 196651, 16, 0, 196652, 16, 0, 196653, 16, 0, 196654, 16, 0, 196655, 16, 0, 196656, 16, 0, 196657, 16, 0, 196658, 16, 0, 196659, 16, 0, 196660, 16, 0, 196661, 16, 0, 196662, 16, 0, 196663, 16, 0, 196664, 16, 0, 196665, 16, 0, 196666, 16, 0, 196667, 16, 0, 196668, 16, 0, 196669, 16, 0, 196670, 16, 0, 196671, 16, 0, 196672, 16, 0, 196673, 16, 0, 196674, 16, 0, 196675, 16, 0, 196676, 16, 0, 196677, 16, 0, 196678, 16, 0, 196679, 16, 0, 196680, 16, 0, 196681, 16, 0, 196682, 16, 0, 196683, 16, 0, 196684, 16, 0, 196685, 16, 0, 196686, 16, 0, 196687, 16, 0, 196688, 16, 0, 196689, 16, 0, 196690, 16, 0, 196691, 16, 0, 196692, 16, 0, 196693, 16, 0, 196694, 16, 0, 196695, 16, 0, 196696, 16, 0, 196697, 16, 0, 196698, 16, 0, 196699, 16, 0, 196700, 16, 0, 196701, 16, 0, 196702, 16, 0, 196703, 16, 0, 196704, 16, 0, 196705, 16, 0, 196706, 16, 0, 196707, 16, 0, 196708, 16, 0, 196709, 16, 0, 196710, 16, 0, 196711, 16, 0, 262145, 16, 0, 262146, 16, 0, 262147, 16, 0, 262148, 16, 0, 262149, 16, 0, 262150, 16, 0, 262151, 16, 0, 262152, 16, 0, 262153, 16, 0, 262154, 16, 0, 262155, 16, 0, 262156, 16, 0, 262157, 16, 0, 262158, 16, 0, 262159, 16, 0, 262160, 16, 0, 262161, 16, 0, 262162, 16, 0, 262163, 16, 0, 262164, 16, 0, 262165, 16, 0, 262166, 16, 0, 262167, 16, 0, 262168, 16, 0, 262169, 16, 0, 262170, 16, 0, 262171, 16, 0, 262172, 16, 0, 262173, 16, 0, 262174, 16, 0, 262175, 16, 0, 262176, 16, 0, 262177, 16, 0, 262178, 16, 0, 262179, 16, 0, 262180, 16, 0, 262181, 16, 0, 262182, 16, 0, 262183, 16, 0, 262184, 16, 0, 262185, 16, 0, 262186, 16, 0, 262187, 16, 0, 262188, 16, 0, 262189, 16, 0, 262190, 16, 0, 262191, 16, 0, 262192, 16, 0, 262193, 16, 0, 262194, 16, 0, 262195, 16, 0, 262196, 16, 0, 262197, 16, 0, 262198, 16, 0, 262199, 16, 0, 262200, 16, 0, 262201, 16, 0, 262202, 16, 0, 262203, 16, 0, 262204, 16, 0, 262205, 16, 0, 262206, 16, 0, 262207, 16, 0, 262208, 16, 0, 262209, 16, 0, 262210, 16, 0, 262211, 16, 0, 262212, 16, 0, 262213, 16, 0, 262214, 16, 0, 262215, 16, 0, 262216, 16, 0, 262217, 16, 0, 262218, 16, 0, 262219, 16, 0, 262220, 16, 0, 262221, 16, 0, 262222, 16, 0, 262223, 16, 0, 262224, 16, 0, 262225, 16, 0, 262226, 16, 0, 262227, 16, 0, 262228, 16, 0, 262229, 16, 0, 262230, 16, 0, 262231, 16, 0, 262232, 16, 0, 262233, 16, 0, 262234, 16, 0, 262235, 16, 0, 262236, 16, 0, 262237, 16, 0, 262238, 16, 0, 262239, 16, 0, 262240, 16, 0, 262241, 16, 0, 262242, 16, 0, 262243, 16, 0, 262244, 16, 0, 262245, 16, 0, 262246, 16, 0, 262247, 16, 0, 327681, 16, 0, 327682, 16, 0, 327683, 16, 0, 327684, 16, 0, 327685, 16, 0, 327686, 16, 0, 327687, 16, 0, 327688, 16, 0, 327689, 16, 0, 327690, 16, 0, 327691, 16, 0, 327692, 16, 0, 327693, 16, 0, 327694, 16, 0, 327695, 16, 0, 327696, 16, 0, 327697, 16, 0, 327698, 16, 0, 327699, 16, 0, 327700, 16, 0, 327701, 16, 0, 327702, 16, 0, 327703, 16, 0, 327704, 16, 0, 327705, 16, 0, 327706, 16, 0, 327707, 16, 0, 327708, 16, 0, 327709, 16, 0, 327710, 16, 0, 327711, 16, 0, 327712, 16, 0, 327713, 16, 0, 327714, 16, 0, 327715, 16, 0, 327716, 16, 0, 327717, 16, 0, 327718, 16, 0, 327719, 16, 0, 327720, 16, 0, 327721, 16, 0, 327722, 16, 0, 327723, 16, 0, 327724, 16, 0, 327725, 16, 0, 327726, 16, 0, 327727, 16, 0, 327728, 16, 0, 327729, 16, 0, 327730, 16, 0, 327731, 16, 0, 327732, 16, 0, 327733, 16, 0, 327734, 16, 0, 327735, 16, 0, 327736, 16, 0, 327737, 16, 0, 327738, 16, 0, 327739, 16, 0, 327740, 16, 0, 327741, 16, 0, 327742, 16, 0, 327743, 16, 0, 327744, 16, 0, 327745, 16, 0, 327746, 16, 0, 327747, 16, 0, 327748, 16, 0, 327749, 16, 0, 327750, 16, 0, 327751, 16, 0, 327752, 16, 0, 327753, 16, 0, 327754, 16, 0, 327755, 16, 0, 327756, 16, 0, 327757, 16, 0, 327758, 16, 0, 327759, 16, 0, 327760, 16, 0, 327761, 16, 0, 327762, 16, 0, 327763, 16, 0, 327764, 16, 0, 327765, 16, 0, 327766, 16, 0, 327767, 16, 0, 327768, 16, 0, 327769, 16, 0, 327770, 16, 0, 327771, 16, 0, 327772, 16, 0, 327773, 16, 0, 327774, 16, 0, 327775, 16, 0, 327776, 16, 0, 327777, 16, 0, 327778, 16, 0, 327779, 16, 0, 327780, 16, 0, 327781, 16, 0, 327782, 16, 0, 327783, 16, 0, 393217, 16, 0, 393218, 16, 0, 393219, 16, 0, 393220, 16, 0, 393221, 16, 0, 393222, 16, 0, 393223, 16, 0, 393224, 16, 0, 393225, 16, 0, 393226, 16, 0, 393227, 16, 0, 393228, 16, 0, 393229, 16, 0, 393230, 16, 0, 393231, 16, 0, 393232, 16, 0, 393233, 16, 0, 393234, 16, 0, 393235, 16, 0, 393236, 16, 0, 393237, 16, 0, 393238, 16, 0, 393239, 16, 0, 393240, 16, 0, 393241, 16, 0, 393242, 16, 0, 393243, 16, 0, 393244, 16, 0, 393245, 16, 0, 393246, 16, 0, 393247, 16, 0, 393248, 16, 0, 393249, 16, 0, 393250, 16, 0, 393251, 16, 0, 393252, 16, 0, 393253, 16, 0, 393254, 16, 0, 393255, 16, 0, 393256, 16, 0, 393257, 16, 0, 393258, 16, 0, 393259, 16, 0, 393260, 16, 0, 393261, 16, 0, 393262, 16, 0, 393263, 16, 0, 393264, 16, 0, 393265, 16, 0, 393266, 16, 0, 393267, 16, 0, 393268, 16, 0, 393269, 16, 0, 393270, 16, 0, 393271, 16, 0, 393272, 16, 0, 393273, 16, 0, 393274, 16, 0, 393275, 16, 0, 393276, 16, 0, 393277, 16, 0, 393278, 16, 0, 393279, 16, 0, 393280, 16, 0, 393281, 16, 0, 393282, 16, 0, 393283, 16, 0, 393284, 16, 0, 393285, 16, 0, 393286, 16, 0, 393287, 16, 0, 393288, 16, 0, 393289, 16, 0, 393290, 16, 0, 393291, 16, 0, 393292, 16, 0, 393293, 16, 0, 393294, 16, 0, 393295, 16, 0, 393296, 16, 0, 393297, 16, 0, 393298, 16, 0, 393299, 16, 0, 393300, 16, 0, 393301, 16, 0, 393302, 16, 0, 393303, 16, 0, 393304, 16, 0, 393305, 16, 0, 393306, 16, 0, 393307, 16, 0, 393308, 16, 0, 393309, 16, 0, 393310, 16, 0, 393311, 16, 0, 393312, 16, 0, 393313, 16, 0, 393314, 16, 0, 393315, 16, 0, 393316, 16, 0, 393317, 16, 0, 393318, 16, 0, 393319, 16, 0, 458753, 16, 0, 458754, 16, 0, 458755, 16, 0, 458756, 16, 0, 458757, 16, 0, 458758, 16, 0, 458759, 16, 0, 458760, 16, 0, 458761, 16, 0, 458762, 16, 0, 458763, 16, 0, 458764, 16, 0, 458765, 16, 0, 458766, 16, 0, 458767, 16, 0, 458768, 16, 0, 458769, 16, 0, 458770, 16, 0, 458771, 16, 0, 458772, 16, 0, 458773, 16, 0, 458774, 16, 0, 458775, 16, 0, 458776, 16, 0, 458777, 16, 0, 458778, 16, 0, 458779, 16, 0, 458780, 16, 0, 458781, 16, 0, 458782, 16, 0, 458783, 16, 0, 458784, 16, 0, 458785, 16, 0, 458786, 16, 0, 458787, 16, 0, 458788, 16, 0, 458789, 16, 0, 458790, 16, 0, 458791, 16, 0, 458792, 16, 0, 458793, 16, 0, 458794, 16, 0, 458795, 16, 0, 458796, 16, 0, 458797, 16, 0, 458798, 16, 0, 458799, 16, 0, 458800, 16, 0, 458801, 16, 0, 458802, 16, 0, 458803, 16, 0, 458804, 16, 0, 458805, 16, 0, 458806, 16, 0, 458807, 16, 0, 458808, 16, 0, 458809, 16, 0, 458810, 16, 0, 458811, 16, 0, 458812, 16, 0, 458813, 16, 0, 458814, 16, 0, 458815, 16, 0, 458816, 16, 0, 458817, 16, 0, 458818, 16, 0, 458819, 16, 0, 458820, 16, 0, 458821, 16, 0, 458822, 16, 0, 458823, 16, 0, 458824, 16, 0, 458825, 16, 0, 458826, 16, 0, 458827, 16, 0, 458828, 16, 0, 458829, 16, 0, 458830, 16, 0, 458831, 16, 0, 458832, 16, 0, 458833, 16, 0, 458834, 16, 0, 458835, 16, 0, 458836, 16, 0, 458837, 16, 0, 458838, 16, 0, 458839, 16, 0, 458840, 16, 0, 458841, 16, 0, 458842, 16, 0, 458843, 16, 0, 458844, 16, 0, 458845, 16, 0, 458846, 16, 0, 458847, 16, 0, 458848, 16, 0, 458849, 16, 0, 458850, 16, 0, 458851, 16, 0, 458852, 16, 0, 458853, 16, 0, 458854, 16, 0, 458855, 16, 0, 524289, 16, 0, 524290, 16, 0, 524291, 16, 0, 524292, 16, 0, 524293, 16, 0, 524294, 16, 0, 524295, 16, 0, 524296, 16, 0, 524297, 16, 0, 524298, 16, 0, 524299, 16, 0, 524300, 16, 0, 524301, 16, 0, 524302, 16, 0, 524303, 16, 0, 524304, 16, 0, 524305, 16, 0, 524306, 16, 0, 524307, 16, 0, 524308, 16, 0, 524309, 16, 0, 524310, 16, 0, 524311, 16, 0, 524312, 16, 0, 524313, 16, 0, 524314, 16, 0, 524315, 16, 0, 524316, 16, 0, 524317, 16, 0, 524318, 16, 0, 524319, 16, 0, 524320, 16, 0, 524321, 16, 0, 524322, 16, 0, 524323, 16, 0, 524324, 16, 0, 524325, 16, 0, 524326, 16, 0, 524327, 16, 0, 524328, 16, 0, 524329, 16, 0, 524330, 16, 0, 524331, 16, 0, 524332, 16, 0, 524333, 16, 0, 524334, 16, 0, 524335, 16, 0, 524336, 16, 0, 524337, 16, 0, 524338, 16, 0, 524339, 16, 0, 524340, 16, 0, 524341, 16, 0, 524342, 16, 0, 524343, 16, 0, 524344, 16, 0, 524345, 16, 0, 524346, 16, 0, 524347, 16, 0, 524348, 16, 0, 524349, 16, 0, 524350, 16, 0, 524351, 16, 0, 524352, 16, 0, 524353, 16, 0, 524354, 16, 0, 524355, 16, 0, 524356, 16, 0, 524357, 16, 0, 524358, 16, 0, 524359, 16, 0, 524360, 16, 0, 524361, 16, 0, 524362, 16, 0, 524363, 16, 0, 524364, 16, 0, 524365, 16, 0, 524366, 16, 0, 524367, 16, 0, 524368, 16, 0, 524369, 16, 0, 524370, 16, 0, 524371, 16, 0, 524372, 16, 0, 524373, 16, 0, 524374, 16, 0, 524375, 16, 0, 524376, 16, 0, 524377, 16, 0, 524378, 16, 0, 524379, 16, 0, 524380, 16, 0, 524381, 16, 0, 524382, 16, 0, 524383, 16, 0, 524384, 16, 0, 524385, 16, 0, 524386, 16, 0, 524387, 16, 0, 524388, 16, 0, 524389, 16, 0, 524390, 16, 0, 524391, 16, 0, 589825, 16, 0, 589826, 16, 0, 589827, 16, 0, 589828, 16, 0, 589829, 16, 0, 589830, 16, 0, 589831, 16, 0, 589832, 16, 0, 589833, 16, 0, 589834, 16, 0, 589835, 16, 0, 589836, 16, 0, 589837, 16, 0, 589838, 16, 0, 589839, 16, 0, 589840, 16, 0, 589841, 16, 0, 589842, 16, 0, 589843, 16, 0, 589844, 16, 0, 589845, 16, 0, 589846, 16, 0, 589847, 16, 0, 589848, 16, 0, 589849, 16, 0, 589850, 16, 0, 589851, 16, 0, 589852, 16, 0, 589853, 16, 0, 589854, 16, 0, 589855, 16, 0, 589856, 16, 0, 589857, 16, 0, 589858, 16, 0, 589859, 16, 0, 589860, 16, 0, 589861, 16, 0, 589862, 16, 0, 589863, 16, 0, 589864, 16, 0, 589865, 16, 0, 589866, 16, 0, 589867, 16, 0, 589868, 16, 0, 589869, 16, 0, 589870, 16, 0, 589871, 16, 0, 589872, 16, 0, 589873, 16, 0, 589874, 16, 0, 589875, 16, 0, 589876, 16, 0, 589877, 16, 0, 589878, 16, 0, 589879, 16, 0, 589880, 16, 0, 589881, 16, 0, 589882, 16, 0, 589883, 16, 0, 589884, 16, 0, 589885, 16, 0, 589886, 16, 0, 589887, 16, 0, 589888, 16, 0, 589889, 16, 0, 589890, 16, 0, 589891, 16, 0, 589892, 16, 0, 589893, 16, 0, 589894, 16, 0, 589895, 16, 0, 589896, 16, 0, 589897, 16, 0, 589898, 16, 0, 589899, 16, 0, 589900, 16, 0, 589901, 16, 0, 589902, 16, 0, 589903, 16, 0, 589904, 16, 0, 589905, 16, 0, 589906, 16, 0, 589907, 16, 0, 589908, 16, 0, 589909, 16, 0, 589910, 16, 0, 589911, 16, 0, 589912, 16, 0, 589913, 16, 0, 589914, 16, 0, 589915, 16, 0, 589916, 16, 0, 589917, 16, 0, 589918, 16, 0, 589919, 16, 0, 589920, 16, 0, 589921, 16, 0, 589922, 16, 0, 589923, 16, 0, 589924, 16, 0, 589925, 16, 0, 589926, 16, 0, 589927, 16, 0, 655361, 15, 0, 655362, 15, 0, 655363, 15, 0, 655364, 15, 0, 655365, 15, 0, 655366, 15, 0, 655367, 15, 0, 655368, 15, 0, 655369, 15, 0, 655370, 15, 0, 655371, 15, 0, 655372, 15, 0, 655373, 15, 0, 655374, 15, 0, 655375, 15, 0, 655376, 15, 0, 655377, 15, 0, 655378, 15, 0, 655379, 15, 0, 655380, 15, 0, 655381, 15, 0, 655382, 15, 0, 655383, 15, 0, 655384, 15, 0, 655385, 15, 0, 655386, 15, 0, 655387, 15, 0, 655388, 15, 0, 655389, 15, 0, 655390, 15, 0, 655391, 15, 0, 655392, 15, 0, 655393, 15, 0, 655394, 15, 0, 655395, 15, 0, 655396, 15, 0, 655397, 15, 0, 655398, 15, 0, 655399, 15, 0, 655400, 15, 0, 655401, 15, 0, 655402, 15, 0, 655403, 15, 0, 655404, 15, 0, 655405, 15, 0, 655406, 15, 0, 655407, 15, 0, 655408, 15, 0, 655409, 15, 0, 655410, 15, 0, 655411, 15, 0, 655412, 15, 0, 655413, 15, 0, 655414, 15, 0, 655415, 15, 0, 655416, 15, 0, 655417, 15, 0, 655418, 15, 0, 655419, 15, 0, 655420, 15, 0, 655421, 15, 0, 655422, 15, 0, 655423, 15, 0, 655424, 15, 0, 655425, 15, 0, 655426, 15, 0, 655427, 15, 0, 655428, 15, 0, 655429, 15, 0, 655430, 15, 0, 655431, 15, 0, 655432, 15, 0, 655433, 15, 0, 655434, 15, 0, 655435, 15, 0, 655436, 15, 0, 655437, 15, 0, 655438, 15, 0, 655439, 15, 0, 655440, 15, 0, 655441, 15, 0, 655442, 15, 0, 655443, 15, 0, 655444, 15, 0, 655445, 15, 0, 655446, 15, 0, 655447, 15, 0, 655448, 15, 0, 655449, 15, 0, 655450, 15, 0, 655451, 15, 0, 655452, 15, 0, 655453, 15, 0, 655454, 15, 0, 655455, 15, 0, 655456, 15, 0, 655457, 15, 0, 655458, 15, 0, 655459, 15, 0, 655460, 15, 0, 655461, 15, 0, 655462, 15, 0, 655463, 15, 0, 720897, 15, 0, 720898, 15, 0, 720899, 15, 0, 720900, 15, 0, 720901, 15, 0, 720902, 15, 0, 720903, 15, 0, 720904, 15, 0, 720905, 15, 0, 720906, 15, 0, 720907, 15, 0, 720908, 15, 0, 720909, 15, 0, 720910, 15, 0, 720911, 15, 0, 720912, 15, 0, 720913, 15, 0, 720914, 15, 0, 720915, 15, 0, 720916, 15, 0, 720917, 15, 0, 720918, 15, 0, 720919, 15, 0, 720920, 15, 0, 720921, 15, 0, 720922, 15, 0, 720923, 15, 0, 720924, 15, 0, 720925, 15, 0, 720926, 15, 0, 720927, 15, 0, 720928, 15, 0, 720929, 15, 0, 720930, 15, 0, 720931, 15, 0, 720932, 15, 0, 720933, 15, 0, 720934, 15, 0, 720935, 15, 0, 720936, 15, 0, 720937, 15, 0, 720938, 15, 0, 720939, 15, 0, 720940, 15, 0, 720941, 15, 0, 720942, 15, 0, 720943, 15, 0, 720944, 15, 0, 720945, 15, 0, 720946, 15, 0, 720947, 15, 0, 720948, 15, 0, 720949, 15, 0, 720950, 15, 0, 720951, 15, 0, 720952, 15, 0, 720953, 15, 0, 720954, 15, 0, 720955, 15, 0, 720956, 15, 0, 720957, 15, 0, 720958, 15, 0, 720959, 15, 0, 720960, 15, 0, 720961, 15, 0, 720962, 15, 0, 720963, 15, 0, 720964, 15, 0, 720965, 15, 0, 720966, 15, 0, 720967, 15, 0, 720968, 15, 0, 720969, 15, 0, 720970, 15, 0, 720971, 15, 0, 720972, 15, 0, 720973, 15, 0, 720974, 15, 0, 720975, 15, 0, 720976, 15, 0, 720977, 15, 0, 720978, 15, 0, 720979, 15, 0, 720980, 15, 0, 720981, 15, 0, 720982, 15, 0, 720983, 15, 0, 720984, 15, 0, 720985, 15, 0, 720986, 15, 0, 720987, 15, 0, 720988, 15, 0, 720989, 15, 0, 720990, 15, 0, 720991, 15, 0, 720992, 15, 0, 720993, 15, 0, 720994, 15, 0, 720995, 15, 0, 720996, 15, 0, 720997, 15, 0, 720998, 15, 0, 720999, 15, 0, 786433, 15, 0, 786434, 15, 0, 786435, 15, 0, 786436, 15, 0, 786437, 15, 0, 786438, 15, 0, 786439, 15, 0, 786440, 15, 0, 786441, 15, 0, 786442, 15, 0, 786443, 15, 0, 786444, 15, 0, 786445, 15, 0, 786446, 15, 0, 786447, 15, 0, 786448, 15, 0, 786449, 15, 0, 786450, 15, 0, 786451, 15, 0, 786452, 15, 0, 786453, 15, 0, 786454, 15, 0, 786455, 15, 0, 786456, 15, 0, 786457, 15, 0, 786458, 15, 0, 786459, 15, 0, 786460, 15, 0, 786461, 15, 0, 786462, 15, 0, 786463, 15, 0, 786464, 15, 0, 786465, 15, 0, 786466, 15, 0, 786467, 15, 0, 786468, 15, 0, 786469, 15, 0, 786470, 15, 0, 786471, 15, 0, 786472, 15, 0, 786473, 15, 0, 786474, 15, 0, 786475, 15, 0, 786476, 15, 0, 786477, 15, 0, 786478, 15, 0, 786479, 15, 0, 786480, 15, 0, 786481, 15, 0, 786482, 15, 0, 786483, 15, 0, 786484, 15, 0, 786485, 15, 0, 786486, 15, 0, 786487, 15, 0, 786488, 15, 0, 786489, 15, 0, 786490, 15, 0, 786491, 15, 0, 786492, 15, 0, 786493, 15, 0, 786494, 15, 0, 786495, 15, 0, 786496, 15, 0, 786497, 15, 0, 786498, 15, 0, 786499, 15, 0, 786500, 15, 0, 786501, 15, 0, 786502, 15, 0, 786503, 15, 0, 786504, 15, 0, 786505, 15, 0, 786506, 15, 0, 786507, 15, 0, 786508, 15, 0, 786509, 15, 0, 786510, 15, 0, 786511, 15, 0, 786512, 15, 0, 786513, 15, 0, 786514, 15, 0, 786515, 15, 0, 786516, 15, 0, 786517, 15, 0, 786518, 15, 0, 786519, 15, 0, 786520, 15, 0, 786521, 15, 0, 786522, 15, 0, 786523, 15, 0, 786524, 15, 0, 786525, 15, 0, 786526, 15, 0, 786527, 15, 0, 786528, 15, 0, 786529, 15, 0, 786530, 15, 0, 786531, 15, 0, 786532, 15, 0, 786533, 15, 0, 786534, 15, 0, 786535, 15, 0, 851969, 15, 0, 851970, 15, 0, 851971, 15, 0, 851972, 15, 0, 851973, 15, 0, 851974, 15, 0, 851975, 15, 0, 851976, 15, 0, 851977, 15, 0, 851978, 15, 0, 851979, 15, 0, 851980, 15, 0, 851981, 15, 0, 851982, 15, 0, 851983, 15, 0, 851984, 15, 0, 851985, 15, 0, 851986, 15, 0, 851987, 15, 0, 851988, 15, 0, 851989, 15, 0, 851990, 15, 0, 851991, 15, 0, 851992, 15, 0, 851993, 15, 0, 851994, 15, 0, 851995, 15, 0, 851996, 15, 0, 851997, 15, 0, 851998, 15, 0, 851999, 15, 0, 852000, 15, 0, 852001, 15, 0, 852002, 15, 0, 852003, 15, 0, 852004, 15, 0, 852005, 15, 0, 852006, 15, 0, 852007, 15, 0, 852008, 15, 0, 852009, 15, 0, 852010, 15, 0, 852011, 15, 0, 852012, 15, 0, 852013, 15, 0, 852014, 15, 0, 852015, 15, 0, 852016, 15, 0, 852017, 15, 0, 852018, 15, 0, 852019, 15, 0, 852020, 15, 0, 852021, 15, 0, 852022, 15, 0, 852023, 15, 0, 852024, 15, 0, 852025, 15, 0, 852026, 15, 0, 852027, 15, 0, 852028, 15, 0, 852029, 15, 0, 852030, 15, 0, 852031, 15, 0, 852032, 15, 0, 852033, 15, 0, 852034, 15, 0, 852035, 15, 0, 852036, 15, 0, 852037, 15, 0, 852038, 15, 0, 852039, 15, 0, 852040, 15, 0, 852041, 15, 0, 852042, 15, 0, 852043, 15, 0, 852044, 15, 0, 852045, 15, 0, 852046, 15, 0, 852047, 15, 0, 852048, 15, 0, 852049, 15, 0, 852050, 15, 0, 852051, 15, 0, 852052, 15, 0, 852053, 15, 0, 852054, 15, 0, 852055, 15, 0, 852056, 15, 0, 852057, 15, 0, 852058, 15, 0, 852059, 15, 0, 852060, 15, 0, 852061, 15, 0, 852062, 15, 0, 852063, 15, 0, 852064, 15, 0, 852065, 15, 0, 852066, 15, 0, 852067, 15, 0, 852068, 15, 0, 852069, 15, 0, 852070, 15, 0, 852071, 15, 0, 917505, 14, 0, 917506, 14, 0, 917507, 14, 0, 917508, 14, 0, 917509, 14, 0, 917510, 14, 0, 917511, 14, 0, 917512, 14, 0, 917513, 14, 0, 917514, 14, 0, 917515, 14, 0, 917516, 14, 0, 917517, 14, 0, 917518, 14, 0, 917519, 14, 0, 917520, 14, 0, 917521, 14, 0, 917522, 14, 0, 917523, 14, 0, 917524, 14, 0, 917525, 14, 0, 917526, 14, 0, 917527, 14, 0, 917528, 14, 0, 917529, 14, 0, 917530, 14, 0, 917531, 14, 0, 917532, 14, 0, 917533, 14, 0, 917534, 14, 0, 917535, 14, 0, 917536, 14, 0, 917537, 14, 0, 917538, 14, 0, 917539, 14, 0, 917540, 14, 0, 917541, 14, 0, 917542, 14, 0, 917543, 14, 0, 917544, 14, 0, 917545, 14, 0, 917546, 14, 0, 917547, 14, 0, 917548, 14, 0, 917549, 14, 0, 917550, 14, 0, 917551, 14, 0, 917552, 14, 0, 917553, 14, 0, 917554, 14, 0, 917555, 14, 0, 917556, 14, 0, 917557, 14, 0, 917558, 14, 0, 917559, 14, 0, 917560, 14, 0, 917561, 14, 0, 917562, 14, 0, 917563, 14, 0, 917564, 14, 0, 917565, 14, 0, 917566, 14, 0, 917567, 14, 0, 917568, 14, 0, 917569, 14, 0, 917570, 14, 0, 917571, 14, 0, 917572, 14, 0, 917573, 14, 0, 917574, 14, 0, 917575, 14, 0, 917576, 14, 0, 917577, 14, 0, 917578, 14, 0, 917579, 14, 0, 917580, 14, 0, 917581, 14, 0, 917582, 14, 0, 917583, 14, 0, 917584, 14, 0, 917585, 14, 0, 917586, 14, 0, 917587, 14, 0, 917588, 14, 0, 917589, 14, 0, 917590, 14, 0, 917591, 14, 0, 917592, 14, 0, 917593, 14, 0, 917594, 14, 0, 917595, 14, 0, 917596, 14, 0, 917597, 14, 0, 917598, 14, 0, 917599, 14, 0, 917600, 14, 0, 917601, 14, 0, 917602, 14, 0, 917603, 14, 0, 917604, 14, 0, 917605, 14, 0, 917606, 14, 0, 917607, 14, 0, 983041, 14, 0, 983042, 14, 0, 983043, 14, 0, 983044, 14, 0, 983045, 14, 0, 983046, 14, 0, 983047, 14, 0, 983048, 14, 0, 983049, 14, 0, 983050, 14, 0, 983051, 14, 0, 983052, 14, 0, 983053, 14, 0, 983054, 14, 0, 983055, 14, 0, 983056, 14, 0, 983057, 14, 0, 983058, 14, 0, 983059, 14, 0, 983060, 14, 0, 983061, 14, 0, 983062, 14, 0, 983063, 14, 0, 983064, 14, 0, 983065, 14, 0, 983066, 14, 0, 983067, 14, 0, 983068, 14, 0, 983069, 14, 0, 983070, 14, 0, 983071, 14, 0, 983072, 14, 0, 983073, 14, 0, 983074, 14, 0, 983075, 14, 0, 983076, 14, 0, 983077, 14, 0, 983078, 14, 0, 983079, 14, 0, 983080, 14, 0, 983081, 14, 0, 983082, 14, 0, 983083, 14, 0, 983084, 14, 0, 983085, 14, 0, 983086, 14, 0, 983087, 14, 0, 983088, 14, 0, 983089, 14, 0, 983090, 14, 0, 983091, 14, 0, 983092, 14, 0, 983093, 14, 0, 983094, 14, 0, 983095, 14, 0, 983096, 14, 0, 983097, 14, 0, 983098, 14, 0, 983099, 14, 0, 983100, 14, 0, 983101, 14, 0, 983102, 14, 0, 983103, 14, 0, 983104, 14, 0, 983105, 14, 0, 983106, 14, 0, 983107, 14, 0, 983108, 14, 0, 983109, 14, 0, 983110, 14, 0, 983111, 14, 0, 983112, 14, 0, 983113, 14, 0, 983114, 14, 0, 983115, 14, 0, 983116, 14, 0, 983117, 14, 0, 983118, 14, 0, 983119, 14, 0, 983120, 14, 0, 983121, 14, 0, 983122, 14, 0, 983123, 14, 0, 983124, 14, 0, 983125, 14, 0, 983126, 14, 0, 983127, 14, 0, 983128, 14, 0, 983129, 14, 0, 983130, 14, 0, 983131, 14, 0, 983132, 14, 0, 983133, 14, 0, 983134, 14, 0, 983135, 14, 0, 983136, 14, 0, 983137, 14, 0, 983138, 14, 0, 983139, 14, 0, 983140, 14, 0, 983141, 14, 0, 983142, 14, 0, 983143, 14, 0, 1048577, 14, 0, 1048578, 14, 0, 1048579, 14, 0, 1048580, 14, 0, 1048581, 14, 0, 1048582, 14, 0, 1048583, 14, 0, 1048584, 14, 0, 1048585, 14, 0, 1048586, 14, 0, 1048587, 14, 0, 1048588, 14, 0, 1048589, 14, 0, 1048590, 14, 0, 1048591, 14, 0, 1048592, 14, 0, 1048593, 14, 0, 1048594, 14, 0, 1048595, 14, 0, 1048596, 14, 0, 1048597, 14, 0, 1048598, 14, 0, 1048599, 14, 0, 1048600, 14, 0, 1048601, 14, 0, 1048602, 14, 0, 1048603, 14, 0, 1048604, 14, 0, 1048605, 14, 0, 1048606, 14, 0, 1048607, 14, 0, 1048608, 14, 0, 1048609, 14, 0, 1048610, 14, 0, 1048611, 14, 0, 1048612, 14, 0, 1048613, 14, 0, 1048614, 14, 0, 1048615, 14, 0, 1048616, 14, 0, 1048617, 14, 0, 1048618, 14, 0, 1048619, 14, 0, 1048620, 14, 0, 1048621, 14, 0, 1048622, 14, 0, 1048623, 14, 0, 1048624, 14, 0, 1048625, 14, 0, 1048626, 14, 0, 1048627, 14, 0, 1048628, 14, 0, 1048629, 14, 0, 1048630, 14, 0, 1048631, 14, 0, 1048632, 14, 0, 1048633, 14, 0, 1048634, 14, 0, 1048635, 14, 0, 1048636, 14, 0, 1048637, 14, 0, 1048638, 14, 0, 1048639, 14, 0, 1048640, 14, 0, 1048641, 14, 0, 1048642, 14, 0, 1048643, 14, 0, 1048644, 14, 0, 1048645, 14, 0, 1048646, 14, 0, 1048647, 14, 0, 1048648, 14, 0, 1048649, 14, 0, 1048650, 14, 0, 1048651, 14, 0, 1048652, 14, 0, 1048653, 14, 0, 1048654, 14, 0, 1048655, 14, 0, 1048656, 14, 0, 1048657, 14, 0, 1048658, 14, 0, 1048659, 14, 0, 1048660, 14, 0, 1048661, 14, 0, 1048662, 14, 0, 1048663, 14, 0, 1048664, 14, 0, 1048665, 14, 0, 1048666, 14, 0, 1048667, 14, 0, 1048668, 14, 0, 1048669, 14, 0, 1048670, 14, 0, 1048671, 14, 0, 1048672, 14, 0, 1048673, 14, 0, 1048674, 14, 0, 1048675, 14, 0, 1048676, 14, 0, 1048677, 14, 0, 1048678, 14, 0, 1048679, 14, 0, 1114113, 14, 0, 1114114, 14, 0, 1114115, 14, 0, 1114116, 14, 0, 1114117, 14, 0, 1114118, 14, 0, 1114119, 14, 0, 1114120, 14, 0, 1114121, 14, 0, 1114122, 14, 0, 1114123, 14, 0, 1114124, 14, 0, 1114125, 14, 0, 1114126, 14, 0, 1114127, 14, 0, 1114128, 14, 0, 1114129, 14, 0, 1114130, 14, 0, 1114131, 14, 0, 1114132, 14, 0, 1114133, 14, 0, 1114134, 14, 0, 1114135, 14, 0, 1114136, 14, 0, 1114137, 14, 0, 1114138, 14, 0, 1114139, 14, 0, 1114140, 14, 0, 1114141, 14, 0, 1114142, 14, 0, 1114143, 14, 0, 1114144, 14, 0, 1114145, 14, 0, 1114146, 14, 0, 1114147, 14, 0, 1114148, 14, 0, 1114149, 14, 0, 1114150, 14, 0, 1114151, 14, 0, 1114152, 14, 0, 1114153, 14, 0, 1114154, 14, 0, 1114155, 14, 0, 1114156, 14, 0, 1114157, 14, 0, 1114158, 14, 0, 1114159, 14, 0, 1114160, 14, 0, 1114161, 14, 0, 1114162, 14, 0, 1114163, 14, 0, 1114164, 14, 0, 1114165, 14, 0, 1114166, 14, 0, 1114167, 14, 0, 1114168, 14, 0, 1114169, 14, 0, 1114170, 14, 0, 1114171, 14, 0, 1114172, 14, 0, 1114173, 14, 0, 1114174, 14, 0, 1114175, 14, 0, 1114176, 14, 0, 1114177, 14, 0, 1114178, 14, 0, 1114179, 14, 0, 1114180, 14, 0, 1114181, 14, 0, 1114182, 14, 0, 1114183, 14, 0, 1114184, 14, 0, 1114185, 14, 0, 1114186, 14, 0, 1114187, 14, 0, 1114188, 14, 0, 1114189, 14, 0, 1114190, 14, 0, 1114191, 14, 0, 1114192, 14, 0, 1114193, 14, 0, 1114194, 14, 0, 1114195, 14, 0, 1114196, 14, 0, 1114197, 14, 0, 1114198, 14, 0, 1114199, 14, 0, 1114200, 14, 0, 1114201, 14, 0, 1114202, 14, 0, 1114203, 14, 0, 1114204, 14, 0, 1114205, 14, 0, 1114206, 14, 0, 1114207, 14, 0, 1114208, 14, 0, 1114209, 14, 0, 1114210, 14, 0, 1114211, 14, 0, 1114212, 14, 0, 1114213, 14, 0, 1114214, 14, 0, 1114215, 14, 0, 1179649, 14, 0, 1179650, 14, 0, 1179651, 14, 0, 1179652, 14, 0, 1179653, 14, 0, 1179654, 14, 0, 1179655, 14, 0, 1179656, 14, 0, 1179657, 14, 0, 1179658, 14, 0, 1179659, 14, 0, 1179660, 14, 0, 1179661, 14, 0, 1179662, 14, 0, 1179663, 14, 0, 1179664, 14, 0, 1179665, 14, 0, 1179666, 14, 0, 1179667, 14, 0, 1179668, 14, 0, 1179669, 14, 0, 1179670, 14, 0, 1179671, 14, 0, 1179672, 14, 0, 1179673, 14, 0, 1179674, 14, 0, 1179675, 14, 0, 1179676, 14, 0, 1179677, 14, 0, 1179678, 14, 0, 1179679, 14, 0, 1179680, 14, 0, 1179681, 14, 0, 1179682, 14, 0, 1179683, 14, 0, 1179684, 14, 0, 1179685, 14, 0, 1179686, 14, 0, 1179687, 14, 0, 1179688, 14, 0, 1179689, 14, 0, 1179690, 14, 0, 1179691, 14, 0, 1179692, 14, 0, 1179693, 14, 0, 1179694, 14, 0, 1179695, 14, 0, 1179696, 14, 0, 1179697, 14, 0, 1179698, 14, 0, 1179699, 14, 0, 1179700, 14, 0, 1179701, 14, 0, 1179702, 14, 0, 1179703, 14, 0, 1179704, 14, 0, 1179705, 14, 0, 1179706, 14, 0, 1179707, 14, 0, 1179708, 14, 0, 1179709, 14, 0, 1179710, 14, 0, 1179711, 14, 0, 1179712, 14, 0, 1179713, 14, 0, 1179714, 14, 0, 1179715, 14, 0, 1179716, 14, 0, 1179717, 14, 0, 1179718, 14, 0, 1179719, 14, 0, 1179720, 14, 0, 1179721, 14, 0, 1179722, 14, 0, 1179723, 14, 0, 1179724, 14, 0, 1179725, 14, 0, 1179726, 14, 0, 1179727, 14, 0, 1179728, 14, 0, 1179729, 14, 0, 1179730, 14, 0, 1179731, 14, 0, 1179732, 14, 0, 1179733, 14, 0, 1179734, 14, 0, 1179735, 14, 0, 1179736, 14, 0, 1179737, 14, 0, 1179738, 14, 0, 1179739, 14, 0, 1179740, 14, 0, 1179741, 14, 0, 1179742, 14, 0, 1179743, 14, 0, 1179744, 14, 0, 1179745, 14, 0, 1179746, 14, 0, 1179747, 14, 0, 1179748, 14, 0, 1179749, 14, 0, 1179750, 14, 0, 1179751, 14, 0, 1245185, 14, 0, 1245186, 14, 0, 1245187, 14, 0, 1245188, 14, 0, 1245189, 14, 0, 1245190, 14, 0, 1245191, 14, 0, 1245192, 14, 0, 1245193, 14, 0, 1245194, 14, 0, 1245195, 14, 0, 1245196, 14, 0, 1245197, 14, 0, 1245198, 14, 0, 1245199, 14, 0, 1245200, 14, 0, 1245201, 14, 0, 1245202, 14, 0, 1245203, 14, 0, 1245204, 14, 0, 1245205, 14, 0, 1245206, 14, 0, 1245207, 14, 0, 1245208, 14, 0, 1245209, 14, 0, 1245210, 14, 0, 1245211, 14, 0, 1245212, 14, 0, 1245213, 14, 0, 1245214, 14, 0, 1245215, 14, 0, 1245216, 14, 0, 1245217, 14, 0, 1245218, 14, 0, 1245219, 14, 0, 1245220, 14, 0, 1245221, 14, 0, 1245222, 14, 0, 1245223, 14, 0, 1245224, 14, 0, 1245225, 14, 0, 1245226, 14, 0, 1245227, 14, 0, 1245228, 14, 0, 1245229, 14, 0, 1245230, 14, 0, 1245231, 14, 0, 1245232, 14, 0, 1245233, 14, 0, 1245234, 14, 0, 1245235, 14, 0, 1245236, 14, 0, 1245237, 14, 0, 1245238, 14, 0, 1245239, 14, 0, 1245240, 14, 0, 1245241, 14, 0, 1245242, 14, 0, 1245243, 14, 0, 1245244, 14, 0, 1245245, 14, 0, 1245246, 14, 0, 1245247, 14, 0, 1245248, 14, 0, 1245249, 14, 0, 1245250, 14, 0, 1245251, 14, 0, 1245252, 14, 0, 1245253, 14, 0, 1245254, 14, 0, 1245255, 14, 0, 1245256, 14, 0, 1245257, 14, 0, 1245258, 14, 0, 1245259, 14, 0, 1245260, 14, 0, 1245261, 14, 0, 1245262, 14, 0, 1245263, 14, 0, 1245264, 14, 0, 1245265, 14, 0, 1245266, 14, 0, 1245267, 14, 0, 1245268, 14, 0, 1245269, 14, 0, 1245270, 14, 0, 1245271, 14, 0, 1245272, 14, 0, 1245273, 14, 0, 1245274, 14, 0, 1245275, 14, 0, 1245276, 14, 0, 1245277, 14, 0, 1245278, 14, 0, 1245279, 14, 0, 1245280, 14, 0, 1245281, 14, 0, 1245282, 14, 0, 1245283, 14, 0, 1245284, 14, 0, 1245285, 14, 0, 1245286, 14, 0, 1245287, 14, 0, 1310721, 14, 0, 1310722, 14, 0, 1310723, 14, 0, 1310724, 14, 0, 1310725, 14, 0, 1310726, 14, 0, 1310727, 14, 0, 1310728, 14, 0, 1310729, 14, 0, 1310730, 14, 0, 1310731, 14, 0, 1310732, 14, 0, 1310733, 14, 0, 1310734, 14, 0, 1310735, 14, 0, 1310736, 14, 0, 1310737, 14, 0, 1310738, 14, 0, 1310739, 14, 0, 1310740, 14, 0, 1310741, 14, 0, 1310742, 14, 0, 1310743, 14, 0, 1310744, 14, 0, 1310745, 14, 0, 1310746, 14, 0, 1310747, 14, 0, 1310748, 14, 0, 1310749, 14, 0, 1310750, 14, 0, 1310751, 14, 0, 1310752, 14, 0, 1310753, 14, 0, 1310754, 14, 0, 1310755, 14, 0, 1310756, 14, 0, 1310757, 14, 0, 1310758, 14, 0, 1310759, 14, 0, 1310760, 14, 0, 1310761, 14, 0, 1310762, 14, 0, 1310763, 14, 0, 1310764, 14, 0, 1310765, 14, 0, 1310766, 14, 0, 1310767, 14, 0, 1310768, 14, 0, 1310769, 14, 0, 1310770, 14, 0, 1310771, 14, 0, 1310772, 14, 0, 1310773, 14, 0, 1310774, 14, 0, 1310775, 14, 0, 1310776, 14, 0, 1310777, 14, 0, 1310778, 14, 0, 1310779, 14, 0, 1310780, 14, 0, 1310781, 14, 0, 1310782, 14, 0, 1310783, 14, 0, 1310784, 14, 0, 1310785, 14, 0, 1310786, 14, 0, 1310787, 14, 0, 1310788, 14, 0, 1310789, 14, 0, 1310790, 14, 0, 1310791, 14, 0, 1310792, 14, 0, 1310793, 14, 0, 1310794, 14, 0, 1310795, 14, 0, 1310796, 14, 0, 1310797, 14, 0, 1310798, 14, 0, 1310799, 14, 0, 1310800, 14, 0, 1310801, 14, 0, 1310802, 14, 0, 1310803, 14, 0, 1310804, 14, 0, 1310805, 14, 0, 1310806, 14, 0, 1310807, 14, 0, 1310808, 14, 0, 1310809, 14, 0, 1310810, 14, 0, 1310811, 14, 0, 1310812, 14, 0, 1310813, 14, 0, 1310814, 14, 0, 1310815, 14, 0, 1310816, 14, 0, 1310817, 14, 0, 1310818, 14, 0, 1310819, 14, 0, 1310820, 14, 0, 1310821, 14, 0, 1310822, 14, 0, 1310823, 14, 0 )

[node name="leafers" type="Node" parent="BGTileMap" index="0"]

[node name="Sprite" type="Sprite" parent="BGTileMap/leafers" index="0"]
position = Vector2( 2576, -64 )
texture = ExtResource( 12 )

[node name="Sprite2" type="Sprite" parent="BGTileMap/leafers" index="1"]
position = Vector2( 2768, -64 )
texture = ExtResource( 12 )

[node name="Sprite3" type="Sprite" parent="BGTileMap/leafers" index="2"]
position = Vector2( 2384, -64 )
texture = ExtResource( 12 )

[node name="Sprite4" type="Sprite" parent="BGTileMap/leafers" index="3"]
position = Vector2( 2192, -64 )
texture = ExtResource( 12 )

[node name="Sprite8" type="Sprite" parent="BGTileMap/leafers" index="4"]
position = Vector2( 3344, -64 )
texture = ExtResource( 12 )

[node name="Sprite7" type="Sprite" parent="BGTileMap/leafers" index="5"]
position = Vector2( 3536, -64 )
texture = ExtResource( 12 )

[node name="Sprite6" type="Sprite" parent="BGTileMap/leafers" index="6"]
position = Vector2( 3152, -64 )
texture = ExtResource( 12 )

[node name="Sprite5" type="Sprite" parent="BGTileMap/leafers" index="7"]
position = Vector2( 2960, -64 )
texture = ExtResource( 12 )

[node name="Sprite16" type="Sprite" parent="BGTileMap/leafers" index="8"]
position = Vector2( 1040, -64 )
texture = ExtResource( 12 )

[node name="Sprite15" type="Sprite" parent="BGTileMap/leafers" index="9"]
position = Vector2( 1232, -64 )
texture = ExtResource( 12 )

[node name="Sprite14" type="Sprite" parent="BGTileMap/leafers" index="10"]
position = Vector2( 848, -64 )
texture = ExtResource( 12 )

[node name="Sprite13" type="Sprite" parent="BGTileMap/leafers" index="11"]
position = Vector2( 656, -64 )
texture = ExtResource( 12 )

[node name="Sprite12" type="Sprite" parent="BGTileMap/leafers" index="12"]
position = Vector2( 1808, -64 )
texture = ExtResource( 12 )

[node name="Sprite11" type="Sprite" parent="BGTileMap/leafers" index="13"]
position = Vector2( 2000, -64 )
texture = ExtResource( 12 )

[node name="Sprite10" type="Sprite" parent="BGTileMap/leafers" index="14"]
position = Vector2( 1616, -64 )
texture = ExtResource( 12 )

[node name="Sprite9" type="Sprite" parent="BGTileMap/leafers" index="15"]
position = Vector2( 1424, -64 )
texture = ExtResource( 12 )

[node name="Sprite20" type="Sprite" parent="BGTileMap/leafers" index="16"]
position = Vector2( 272, -64 )
texture = ExtResource( 12 )

[node name="Sprite19" type="Sprite" parent="BGTileMap/leafers" index="17"]
position = Vector2( 464, -64 )
texture = ExtResource( 12 )

[node name="Sprite18" type="Sprite" parent="BGTileMap/leafers" index="18"]
position = Vector2( 80, -64 )
texture = ExtResource( 12 )

[node name="Sprite32" type="Sprite" parent="BGTileMap/leafers" index="19"]
position = Vector2( 4112, -64 )
texture = ExtResource( 12 )

[node name="Sprite33" type="Sprite" parent="BGTileMap/leafers" index="20"]
position = Vector2( 5264, -64 )
texture = ExtResource( 12 )

[node name="Sprite31" type="Sprite" parent="BGTileMap/leafers" index="21"]
position = Vector2( 4304, -64 )
texture = ExtResource( 12 )

[node name="Sprite30" type="Sprite" parent="BGTileMap/leafers" index="22"]
position = Vector2( 3920, -64 )
texture = ExtResource( 12 )

[node name="Sprite29" type="Sprite" parent="BGTileMap/leafers" index="23"]
position = Vector2( 3728, -64 )
texture = ExtResource( 12 )

[node name="Sprite28" type="Sprite" parent="BGTileMap/leafers" index="24"]
position = Vector2( 4880, -64 )
texture = ExtResource( 12 )

[node name="Sprite27" type="Sprite" parent="BGTileMap/leafers" index="25"]
position = Vector2( 5072, -64 )
texture = ExtResource( 12 )

[node name="Sprite26" type="Sprite" parent="BGTileMap/leafers" index="26"]
position = Vector2( 4688, -64 )
texture = ExtResource( 12 )

[node name="Sprite25" type="Sprite" parent="BGTileMap/leafers" index="27"]
position = Vector2( 4496, -64 )
texture = ExtResource( 12 )

[node name="Sprite42" type="Sprite" parent="BGTileMap/leafers" index="28"]
position = Vector2( 5840, -64 )
texture = ExtResource( 12 )

[node name="Sprite41" type="Sprite" parent="BGTileMap/leafers" index="29"]
position = Vector2( 6992, -64 )
texture = ExtResource( 12 )

[node name="Sprite40" type="Sprite" parent="BGTileMap/leafers" index="30"]
position = Vector2( 6032, -64 )
texture = ExtResource( 12 )

[node name="Sprite39" type="Sprite" parent="BGTileMap/leafers" index="31"]
position = Vector2( 5648, -64 )
texture = ExtResource( 12 )

[node name="Sprite38" type="Sprite" parent="BGTileMap/leafers" index="32"]
position = Vector2( 5456, -64 )
texture = ExtResource( 12 )

[node name="Sprite37" type="Sprite" parent="BGTileMap/leafers" index="33"]
position = Vector2( 6608, -64 )
texture = ExtResource( 12 )

[node name="Sprite36" type="Sprite" parent="BGTileMap/leafers" index="34"]
position = Vector2( 6800, -64 )
texture = ExtResource( 12 )

[node name="Sprite35" type="Sprite" parent="BGTileMap/leafers" index="35"]
position = Vector2( 6416, -64 )
texture = ExtResource( 12 )

[node name="Sprite34" type="Sprite" parent="BGTileMap/leafers" index="36"]
position = Vector2( 6224, -64 )
texture = ExtResource( 12 )

[node name="Sprite" type="Sprite" parent="BGTileMap" index="1"]
position = Vector2( 760, -88 )
texture = ExtResource( 11 )

[node name="Sprite2" type="Sprite" parent="BGTileMap" index="2"]
position = Vector2( 2360, 200 )
texture = ExtResource( 11 )

[node name="Sprite3" type="Sprite" parent="BGTileMap" index="3"]
position = Vector2( 4512, 48 )
texture = ExtResource( 11 )
flip_h = true

[node name="fern" type="Sprite" parent="BGTileMap" index="4"]
position = Vector2( 1928, 440 )
texture = ExtResource( 10 )

[node name="fern5" type="Sprite" parent="BGTileMap" index="5"]
position = Vector2( 1368, 672 )
texture = ExtResource( 10 )

[node name="fern6" type="Sprite" parent="BGTileMap" index="6"]
position = Vector2( 3080, 104 )
scale = Vector2( 0.3, 0.3 )
texture = ExtResource( 10 )

[node name="fern4" type="Sprite" parent="BGTileMap" index="7"]
position = Vector2( 5960, 1240 )
texture = ExtResource( 10 )

[node name="fern3" type="Sprite" parent="BGTileMap" index="8"]
position = Vector2( 3696, 1080 )
scale = Vector2( 1.3, 1.3 )
texture = ExtResource( 10 )

[node name="fern2" type="Sprite" parent="BGTileMap" index="9"]
position = Vector2( 824, 104 )
scale = Vector2( 0.7, 0.7 )
texture = ExtResource( 10 )

[node name="bush2" type="Sprite" parent="BGTileMap" index="10"]
position = Vector2( 4976, 664 )
scale = Vector2( 0.7, 0.7 )
texture = ExtResource( 9 )

[node name="bush5" type="Sprite" parent="BGTileMap" index="11"]
position = Vector2( 2544, 672 )
scale = Vector2( 0.7, 0.7 )
texture = ExtResource( 9 )

[node name="bush6" type="Sprite" parent="BGTileMap" index="12"]
position = Vector2( 1640, 960 )
scale = Vector2( 0.7, 0.7 )
texture = ExtResource( 9 )

[node name="bush3" type="Sprite" parent="BGTileMap" index="13"]
position = Vector2( 4592, 256 )
scale = Vector2( 0.7, 0.7 )
texture = ExtResource( 9 )

[node name="bush4" type="Sprite" parent="BGTileMap" index="14"]
position = Vector2( 232, 240 )
scale = Vector2( 0.5, 0.5 )
texture = ExtResource( 9 )

[node name="TileMap" parent="." index="2"]
tile_set = ExtResource( 1 )
tile_data = PoolIntArray( 1, 7, 0, 39, 9, 0, 40, 10, 0, 41, 10, 0, 42, 10, 0, 43, 10, 0, 44, 11, 0, 65537, 2, 0, 131073, 2, 0, 131101, 9, 0, 131102, 10, 0, 131103, 10, 0, 131104, 10, 0, 131105, 10, 0, 131106, 10, 0, 131107, 11, 0, 196609, 2, 0, 262145, 2, 0, 327681, 2, 0, 327700, 9, 0, 327701, 10, 0, 327702, 10, 0, 327703, 10, 0, 327704, 10, 0, 327705, 11, 0, 393217, 2, 0, 393269, 9, 0, 393270, 10, 0, 393271, 10, 0, 393272, 10, 0, 393273, 10, 0, 393274, 11, 0, 458753, 2, 0, 458766, 9, 0, 458767, 10, 0, 458768, 10, 0, 458769, 10, 0, 458770, 11, 0, 524289, 2, 0, 589825, 2, 0, 589826, 5, 0, 589827, 5, 0, 589828, 5, 0, 589829, 5, 0, 589830, 5, 0, 589831, 5, 0, 589832, 5, 0, 589833, 5, 0, 589834, 5, 0, 589835, 5, 0, 589836, 5, 0, 589837, 5, 0, 589838, 17, 0, 589839, 17, 0, 589840, 17, 0, 589841, 17, 0, 589842, 17, 0, 589843, 17, 0, 589844, 17, 0, 589845, 17, 0, 589846, 17, 0, 589847, 17, 0, 589848, 17, 0, 589849, 17, 0, 589850, 17, 0, 589851, 17, 0, 589852, 17, 0, 589853, 17, 0, 589854, 17, 0, 589855, 17, 0, 589856, 17, 0, 589857, 17, 0, 589858, 17, 0, 589859, 17, 0, 589860, 17, 0, 589861, 17, 0, 589862, 17, 0, 589863, 17, 0, 589864, 17, 0, 589865, 17, 0, 589866, 17, 0, 589867, 17, 0, 589868, 17, 0, 589869, 17, 0, 589870, 17, 0, 589871, 17, 0, 589872, 17, 0, 589873, 17, 0, 589874, 17, 0, 589875, 17, 0, 589876, 17, 0, 589877, 17, 0, 589878, 17, 0, 589879, 17, 0, 589880, 17, 0, 589881, 17, 0, 589882, 17, 0, 589883, 17, 0, 589884, 17, 0, 589885, 17, 0, 589886, 17, 0, 589887, 17, 0, 589888, 17, 0, 589889, 17, 0, 589890, 17, 0, 589891, 17, 0, 589892, 17, 0, 589893, 17, 0, 589894, 17, 0, 589895, 17, 0, 589896, 17, 0, 589897, 17, 0, 589898, 17, 0, 589899, 17, 0, 589900, 17, 0, 589901, 17, 0, 589902, 17, 0, 589903, 17, 0, 589904, 17, 0, 589905, 7, 0, 589906, 17, 0, 589907, 17, 0, 589908, 17, 0, 589909, 17, 0, 589910, 17, 0, 589911, 17, 0, 589912, 17, 0, 589913, 17, 0, 589914, 17, 0, 589915, 17, 0, 589916, 17, 0, 589917, 17, 0, 589918, 17, 0, 589919, 17, 0, 589920, 17, 0, 589921, 17, 0, 589922, 17, 0, 589923, 17, 0, 589924, 17, 0, 589925, 17, 0, 589926, 17, 0, 589927, 17, 0, 655361, 2, 0, 655362, 12, 0, 655363, 12, 0, 655364, 12, 0, 655365, 12, 0, 655366, 12, 0, 655367, 12, 0, 655368, 12, 0, 655369, 12, 0, 655370, 12, 0, 655371, 12, 0, 655372, 12, 0, 655373, 12, 0, 655424, 9, 0, 655425, 10, 0, 655426, 10, 0, 655427, 10, 0, 655428, 11, 0, 655441, 6, 0, 720977, 6, 0, 786513, 6, 0, 852049, 6, 0, 917585, 6, 0, 983121, 6, 0, 1048657, 6, 0, 1114182, 8, 0, 1114184, 9, 0, 1114185, 10, 0, 1114186, 10, 0, 1114187, 10, 0, 1114188, 10, 0, 1114189, 10, 0, 1114190, 10, 0, 1114191, 10, 0, 1114192, 11, 0, 1114193, 6, 0, 1179718, 12, 0, 1245185, 13, 0, 1245186, 13, 0, 1245187, 13, 0, 1245188, 13, 0, 1245189, 13, 0, 1245190, 13, 0, 1245191, 13, 0, 1245192, 13, 0, 1245193, 13, 0, 1245194, 13, 0, 1245195, 13, 0, 1245196, 13, 0, 1245197, 13, 0, 1245198, 13, 0, 1245199, 13, 0, 1245200, 13, 0, 1245201, 13, 0, 1245202, 13, 0, 1245203, 13, 0, 1245204, 13, 0, 1245205, 13, 0, 1245206, 13, 0, 1245207, 13, 0, 1245208, 13, 0, 1245209, 13, 0, 1245210, 13, 0, 1245211, 13, 0, 1245212, 13, 0, 1245213, 13, 0, 1245214, 13, 0, 1245215, 13, 0, 1245216, 13, 0, 1245217, 13, 0, 1245218, 13, 0, 1245219, 13, 0, 1245220, 13, 0, 1245221, 13, 0, 1245222, 13, 0, 1245223, 13, 0, 1245224, 13, 0, 1245225, 13, 0, 1245226, 13, 0, 1245227, 13, 0, 1245228, 13, 0, 1245229, 13, 0, 1245230, 13, 0, 1245231, 13, 0, 1245232, 13, 0, 1245233, 13, 0, 1245234, 13, 0, 1245235, 13, 0, 1245236, 13, 0, 1245237, 13, 0, 1245238, 13, 0, 1245239, 13, 0, 1245240, 13, 0, 1245241, 13, 0, 1245242, 13, 0, 1245243, 13, 0, 1245244, 13, 0, 1245245, 13, 0, 1245246, 13, 0, 1245247, 5, 0, 1245254, 12, 0, 1310721, 0, 0, 1310722, 0, 0, 1310723, 0, 0, 1310724, 0, 0, 1310725, 0, 0, 1310726, 0, 0, 1310727, 0, 0, 1310728, 0, 0, 1310729, 0, 0, 1310730, 0, 0, 1310731, 0, 0, 1310732, 0, 0, 1310733, 0, 0, 1310734, 0, 0, 1310735, 0, 0, 1310736, 0, 0, 1310737, 0, 0, 1310738, 0, 0, 1310739, 0, 0, 1310740, 0, 0, 1310741, 0, 0, 1310742, 0, 0, 1310743, 0, 0, 1310744, 0, 0, 1310745, 0, 0, 1310746, 0, 0, 1310747, 0, 0, 1310748, 0, 0, 1310749, 0, 0, 1310750, 0, 0, 1310751, 0, 0, 1310752, 0, 0, 1310753, 0, 0, 1310754, 0, 0, 1310755, 0, 0, 1310756, 0, 0, 1310757, 0, 0, 1310758, 0, 0, 1310759, 0, 0, 1310760, 0, 0, 1310761, 0, 0, 1310762, 0, 0, 1310763, 0, 0, 1310764, 0, 0, 1310765, 0, 0, 1310766, 0, 0, 1310767, 0, 0, 1310768, 0, 0, 1310769, 0, 0, 1310770, 0, 0, 1310771, 0, 0, 1310772, 0, 0, 1310773, 0, 0, 1310774, 0, 0, 1310775, 0, 0, 1310776, 0, 0, 1310777, 0, 0, 1310778, 0, 0, 1310779, 0, 0, 1310780, 0, 0, 1310781, 0, 0, 1310782, 0, 0, 1310783, 12, 0, 1310784, 5, 0, 1310785, 5, 0, 1310786, 5, 0, 1310787, 5, 0, 1310788, 5, 0, 1310789, 5, 0, 1310790, 12, 0, 1310791, 5, 0, 1310792, 5, 0, 1310793, 5, 0, 1310794, 5, 0, 1310795, 5, 0, 1310796, 5, 0, 1310797, 5, 0, 1310798, 5, 0, 1310799, 5, 0, 1310800, 5, 0, 1310801, 5, 0, 1310802, 5, 0, 1310803, 5, 0, 1310804, 5, 0, 1310805, 5, 0, 1310806, 5, 0, 1310807, 5, 0, 1310808, 5, 0, 1310809, 5, 0, 1310810, 5, 0, 1310811, 5, 0, 1310812, 5, 0, 1310813, 5, 0, 1310814, 5, 0, 1310815, 5, 0, 1310816, 5, 0, 1310817, 5, 0, 1310818, 5, 0, 1310819, 5, 0, 1310820, 5, 0, 1310821, 5, 0, 1310822, 5, 0, 1310823, 5, 0 )

[node name="Snake" parent="TileMap/Obstacles" index="0" instance=ExtResource( 5 )]
position = Vector2( 4293.23, 599.505 )

[node name="Snake2" parent="TileMap/Obstacles" index="1" instance=ExtResource( 5 )]
position = Vector2( 5667.2, 1237.61 )

[node name="Gopher" parent="TileMap/Obstacles" index="2" instance=ExtResource( 8 )]
position = Vector2( 4384.21, 1244.39 )

[node name="Exit" parent="TileMap/Obstacles/Gopher" index="6" instance=ExtResource( 7 )]
position = Vector2( 224.199, 31.3499 )

[node name="KillBox" parent="TileMap/Obstacles" index="3" instance=ExtResource( 14 )]
position = Vector2( 1760, 1344 )
shape = SubResource( 1 )

[node name="SuperFrog" parent="TileMap/Tools" index="0" instance=ExtResource( 2 )]
position = Vector2( 1632.76, 285.365 )

[node name="SuperFrog2" parent="TileMap/Tools" index="1" instance=ExtResource( 2 )]
position = Vector2( 2276.22, 97.2502 )

[node name="SuperFrog3" parent="TileMap/Tools" index="2" instance=ExtResource( 2 )]
position = Vector2( 5027.61, 1053.65 )

[node name="SuperEagle" parent="TileMap/Tools" index="3" instance=ExtResource( 4 )]
position = Vector2( 3736.67, 355.717 )

[node name="SuperEagle2" parent="TileMap/Tools" index="4" instance=ExtResource( 4 )]
position = Vector2( 5335.61, 1247.29 )

[node name="Bread" parent="TileMap/Tools" index="5" instance=ExtResource( 6 )]
position = Vector2( 4124.89, 1243.12 )

[node name="Eagle" parent="TileMap/Tools" index="6" instance=ExtResource( 13 )]
position = Vector2( 3424, 352 )

[node name="Start" parent="TileMap" index="4"]
position = Vector2( 224.845, 577.407 )

[node name="Goal" parent="TileMap" index="5"]
position = Vector2( 6491.86, 1282.18 )

[node name="Node2D" type="Node2D" parent="TileMap/Waypoints" index="0"]
position = Vector2( 4608, 1280 )

[node name="Node2D2" type="Node2D" parent="TileMap/Waypoints" index="1"]
position = Vector2( 4608, 544 )

[node name="Node2D3" type="Node2D" parent="TileMap/Waypoints" index="2"]
position = Vector2( 3400, 544 )

[node name="Node2D4" type="Node2D" parent="TileMap/Waypoints" index="3"]
position = Vector2( 2688, 200 )

[node name="Node2D5" type="Node2D" parent="TileMap/Waypoints" index="4"]
position = Vector2( 1384, 584 )

[node name="bush" type="Sprite" parent="TileMap/Foreground" index="0"]
position = Vector2( 6024, 1224 )
texture = ExtResource( 9 )

[node name="HBoxContainer" parent="CanvasLayer/UI/Hotbar/Container" index="0"]
margin_left = 498.0
margin_right = 782.0

[node name="Frog" parent="CanvasLayer/UI/Hotbar/Container/HBoxContainer" index="0"]
quantity = 3

[node name="SuperFrog" parent="CanvasLayer/UI/Hotbar/Container/HBoxContainer" index="1"]
visible = false

[node name="Eagle" parent="CanvasLayer/UI/Hotbar/Container/HBoxContainer" index="2"]
visible = false
margin_left = 96.0
margin_right = 188.0

[node name="SuperEagle" parent="CanvasLayer/UI/Hotbar/Container/HBoxContainer" index="3"]
visible = false
margin_left = 192.0
margin_right = 284.0

[node name="Blocker" parent="CanvasLayer/UI/Hotbar/Container/HBoxContainer" index="4"]
margin_left = 96.0
margin_right = 188.0
quantity = 1

[node name="Umbrella" parent="CanvasLayer/UI/Hotbar/Container/HBoxContainer" index="5"]
margin_left = 192.0
margin_right = 284.0
quantity = 2

[editable path="CanvasLayer/UI/Hotbar"]
