[gd_scene load_steps=7 format=2]

[ext_resource path="res://tools/Tool.tscn" type="PackedScene" id=1]
[ext_resource path="res://assets/bread.png" type="Texture" id=2]
[ext_resource path="res://tools/bread/Bread.gd" type="Script" id=3]
[ext_resource path="res://tools/bread/sfx/god the breead.wav" type="AudioStream" id=4]

[sub_resource type="RectangleShape2D" id=1]
extents = Vector2( 17.5373, 17.8757 )

[sub_resource type="Animation" id=2]
loop = true
tracks/0/type = "bezier"
tracks/0/path = NodePath("Sprite:position:x")
tracks/0/interp = 1
tracks/0/loop_wrap = true
tracks/0/imported = false
tracks/0/enabled = true
tracks/0/keys = {
"points": PoolRealArray( 0, -0.25, 0, 0.25, 0, 0, -0.25, 0, 0.25, 0, 0, -0.25, 0, 0.25, 0 ),
"times": PoolRealArray( 0, 0.5, 1 )
}
tracks/1/type = "bezier"
tracks/1/path = NodePath("Sprite:position:y")
tracks/1/interp = 1
tracks/1/loop_wrap = true
tracks/1/imported = false
tracks/1/enabled = true
tracks/1/keys = {
"points": PoolRealArray( 0, -0.25, 0, 0.25, 0, -5.813, -0.25, 0, 0.25, 0, 0, -0.25, 0, 0.25, 0 ),
"times": PoolRealArray( 0, 0.5, 1 )
}

[node name="Bread" instance=ExtResource( 1 )]
script = ExtResource( 3 )
ignore_tiles = true
is_flying = true
always_face = false

[node name="Sprite" parent="." index="0"]
position = Vector2( 0, 0 )
texture = ExtResource( 2 )

[node name="CollisionShape2D" parent="ActiveArea" index="0"]
shape = SubResource( 1 )

[node name="got" type="AudioStreamPlayer" parent="TriggerPlayers" index="0"]
stream = ExtResource( 4 )

[node name="AnimationPlayer" type="AnimationPlayer" parent="." index="4"]
autoplay = "float"
anims/float = SubResource( 2 )
