[gd_scene load_steps=18 format=2]

[ext_resource path="res://levels/Level.tscn" type="PackedScene" id=1]
[ext_resource path="res://tiles/simple_tileset.tres" type="TileSet" id=2]
[ext_resource path="res://obstacles/tiger/Tiger.tscn" type="PackedScene" id=3]
[ext_resource path="res://obstacles/snek/Snake.tscn" type="PackedScene" id=4]
[ext_resource path="res://tools/blocker/Blocker.tscn" type="PackedScene" id=5]
[ext_resource path="res://obstacles/spider/Spider.tscn" type="PackedScene" id=6]
[ext_resource path="res://tiles/background/branch base.png" type="Texture" id=7]
[ext_resource path="res://tiles/background/branch2usb.png" type="Texture" id=8]
[ext_resource path="res://obstacles/hazards/Fire.tscn" type="PackedScene" id=9]
[ext_resource path="res://tiles/background/leaves.png" type="Texture" id=10]
[ext_resource path="res://tiles/background/tree.png" type="Texture" id=11]
[ext_resource path="res://tiles/background/ferns.png" type="Texture" id=12]
[ext_resource path="res://tiles/background/lil bush.png" type="Texture" id=13]
[ext_resource path="res://tiles/background/branch.png" type="Texture" id=14]
[ext_resource path="res://obstacles/hazards/KillBox.tscn" type="PackedScene" id=15]
[ext_resource path="res://tools/bread/Bread.tscn" type="PackedScene" id=16]

[sub_resource type="RectangleShape2D" id=1]
extents = Vector2( 4128, 10 )

[node name="LevelTwo" instance=ExtResource( 1 )]
showcase_map = true
showcase_time = 7.0
showcase_delay = 2.0

[node name="BGTileMap" parent="." index="1"]
tile_set = ExtResource( 2 )
tile_data = PoolIntArray( 0, 16, 0, 1, 16, 0, 2, 16, 0, 3, 16, 0, 4, 16, 0, 5, 16, 0, 6, 16, 0, 7, 16, 0, 8, 16, 0, 9, 16, 0, 10, 16, 0, 11, 16, 0, 12, 16, 0, 13, 16, 0, 14, 16, 0, 15, 16, 0, 16, 16, 0, 17, 16, 0, 18, 16, 0, 19, 16, 0, 20, 16, 0, 21, 16, 0, 22, 16, 0, 23, 16, 0, 24, 16, 0, 25, 16, 0, 26, 16, 0, 27, 16, 0, 28, 16, 0, 29, 16, 0, 30, 16, 0, 31, 16, 0, 32, 16, 0, 33, 16, 0, 34, 16, 0, 35, 16, 0, 36, 16, 0, 37, 16, 0, 38, 16, 0, 39, 16, 0, 40, 16, 0, 41, 16, 0, 42, 16, 0, 43, 16, 0, 44, 16, 0, 45, 16, 0, 46, 16, 0, 47, 16, 0, 48, 16, 0, 49, 16, 0, 50, 16, 0, 51, 16, 0, 52, 16, 0, 53, 16, 0, 54, 16, 0, 55, 16, 0, 56, 16, 0, 57, 16, 0, 58, 16, 0, 59, 16, 0, 60, 16, 0, 61, 16, 0, 62, 16, 0, 63, 16, 0, 64, 16, 0, 65, 16, 0, 66, 16, 0, 67, 16, 0, 65536, 16, 0, 65537, 16, 0, 65538, 16, 0, 65539, 16, 0, 65540, 16, 0, 65541, 16, 0, 65542, 16, 0, 65543, 16, 0, 65544, 16, 0, 65545, 16, 0, 65546, 16, 0, 65547, 16, 0, 65548, 16, 0, 65549, 16, 0, 65550, 16, 0, 65551, 16, 0, 65552, 16, 0, 65553, 16, 0, 65554, 16, 0, 65555, 16, 0, 65556, 16, 0, 65557, 16, 0, 65558, 16, 0, 65559, 16, 0, 65560, 16, 0, 65561, 16, 0, 65562, 16, 0, 65563, 16, 0, 65564, 16, 0, 65565, 16, 0, 65566, 16, 0, 65567, 16, 0, 65568, 16, 0, 65569, 16, 0, 65570, 16, 0, 65571, 16, 0, 65572, 16, 0, 65573, 16, 0, 65574, 16, 0, 65575, 16, 0, 65576, 16, 0, 65577, 16, 0, 65578, 16, 0, 65579, 16, 0, 65580, 16, 0, 65581, 16, 0, 65582, 16, 0, 65583, 16, 0, 65584, 16, 0, 65585, 16, 0, 65586, 16, 0, 65587, 16, 0, 65588, 16, 0, 65589, 16, 0, 65590, 16, 0, 65591, 16, 0, 65592, 16, 0, 65593, 16, 0, 65594, 16, 0, 65595, 16, 0, 65596, 16, 0, 65597, 16, 0, 65598, 16, 0, 65599, 16, 0, 65600, 16, 0, 65601, 16, 0, 65602, 16, 0, 65603, 16, 0, 131072, 16, 0, 131073, 16, 0, 131074, 16, 0, 131075, 16, 0, 131076, 16, 0, 131077, 16, 0, 131078, 16, 0, 131079, 16, 0, 131080, 16, 0, 131081, 16, 0, 131082, 16, 0, 131083, 16, 0, 131084, 16, 0, 131085, 16, 0, 131086, 16, 0, 131087, 16, 0, 131088, 16, 0, 131089, 16, 0, 131090, 16, 0, 131091, 16, 0, 131092, 16, 0, 131093, 16, 0, 131094, 16, 0, 131095, 16, 0, 131096, 16, 0, 131097, 16, 0, 131098, 16, 0, 131099, 16, 0, 131100, 16, 0, 131101, 16, 0, 131102, 16, 0, 131103, 16, 0, 131104, 16, 0, 131105, 16, 0, 131106, 16, 0, 131107, 16, 0, 131108, 16, 0, 131109, 16, 0, 131110, 16, 0, 131111, 16, 0, 131112, 16, 0, 131113, 16, 0, 131114, 16, 0, 131115, 16, 0, 131116, 16, 0, 131117, 16, 0, 131118, 16, 0, 131119, 16, 0, 131120, 16, 0, 131121, 16, 0, 131122, 16, 0, 131123, 16, 0, 131124, 16, 0, 131125, 16, 0, 131126, 16, 0, 131127, 16, 0, 131128, 16, 0, 131129, 16, 0, 131130, 16, 0, 131131, 16, 0, 131132, 16, 0, 131133, 16, 0, 131134, 16, 0, 131135, 16, 0, 131136, 16, 0, 131137, 16, 0, 131138, 16, 0, 131139, 16, 0, 196608, 16, 0, 196609, 16, 0, 196610, 16, 0, 196611, 16, 0, 196612, 16, 0, 196613, 16, 0, 196614, 16, 0, 196615, 16, 0, 196616, 16, 0, 196617, 16, 0, 196618, 16, 0, 196619, 16, 0, 196620, 16, 0, 196621, 16, 0, 196622, 16, 0, 196623, 16, 0, 196624, 16, 0, 196625, 16, 0, 196626, 16, 0, 196627, 16, 0, 196628, 16, 0, 196629, 16, 0, 196630, 16, 0, 196631, 16, 0, 196632, 16, 0, 196633, 16, 0, 196634, 16, 0, 196635, 16, 0, 196636, 16, 0, 196637, 16, 0, 196638, 16, 0, 196639, 16, 0, 196640, 16, 0, 196641, 16, 0, 196642, 16, 0, 196643, 16, 0, 196644, 16, 0, 196645, 16, 0, 196646, 16, 0, 196647, 16, 0, 196648, 16, 0, 196649, 16, 0, 196650, 16, 0, 196651, 16, 0, 196652, 16, 0, 196653, 16, 0, 196654, 16, 0, 196655, 16, 0, 196656, 16, 0, 196657, 16, 0, 196658, 16, 0, 196659, 16, 0, 196660, 16, 0, 196661, 16, 0, 196662, 16, 0, 196663, 16, 0, 196664, 16, 0, 196665, 16, 0, 196666, 16, 0, 196667, 16, 0, 196668, 16, 0, 196669, 16, 0, 196670, 16, 0, 196671, 16, 0, 196672, 16, 0, 196673, 16, 0, 196674, 16, 0, 196675, 16, 0, 262144, 16, 0, 262145, 16, 0, 262146, 16, 0, 262147, 16, 0, 262148, 16, 0, 262149, 16, 0, 262150, 16, 0, 262151, 16, 0, 262152, 16, 0, 262153, 16, 0, 262154, 16, 0, 262155, 16, 0, 262156, 16, 0, 262157, 16, 0, 262158, 16, 0, 262159, 16, 0, 262160, 16, 0, 262161, 16, 0, 262162, 16, 0, 262163, 16, 0, 262164, 16, 0, 262165, 16, 0, 262166, 16, 0, 262167, 16, 0, 262168, 16, 0, 262169, 16, 0, 262170, 16, 0, 262171, 16, 0, 262172, 16, 0, 262173, 16, 0, 262174, 16, 0, 262175, 16, 0, 262176, 16, 0, 262177, 16, 0, 262178, 16, 0, 262179, 16, 0, 262180, 16, 0, 262181, 16, 0, 262182, 16, 0, 262183, 16, 0, 262184, 16, 0, 262185, 16, 0, 262186, 16, 0, 262187, 16, 0, 262188, 16, 0, 262189, 16, 0, 262190, 16, 0, 262191, 16, 0, 262192, 16, 0, 262193, 16, 0, 262194, 16, 0, 262195, 16, 0, 262196, 16, 0, 262197, 16, 0, 262198, 16, 0, 262199, 16, 0, 262200, 16, 0, 262201, 16, 0, 262202, 16, 0, 262203, 16, 0, 262204, 16, 0, 262205, 16, 0, 262206, 16, 0, 262207, 16, 0, 262208, 16, 0, 262209, 16, 0, 262210, 16, 0, 262211, 16, 0, 327680, 16, 0, 327681, 16, 0, 327682, 16, 0, 327683, 16, 0, 327684, 16, 0, 327685, 16, 0, 327686, 16, 0, 327687, 16, 0, 327688, 16, 0, 327689, 16, 0, 327690, 16, 0, 327691, 16, 0, 327692, 16, 0, 327693, 16, 0, 327694, 16, 0, 327695, 16, 0, 327696, 16, 0, 327697, 16, 0, 327698, 16, 0, 327699, 16, 0, 327700, 16, 0, 327701, 16, 0, 327702, 16, 0, 327703, 16, 0, 327704, 16, 0, 327705, 16, 0, 327706, 16, 0, 327707, 16, 0, 327708, 16, 0, 327709, 16, 0, 327710, 16, 0, 327711, 16, 0, 327712, 16, 0, 327713, 16, 0, 327714, 16, 0, 327715, 16, 0, 327716, 16, 0, 327717, 16, 0, 327718, 16, 0, 327719, 16, 0, 327720, 16, 0, 327721, 16, 0, 327722, 16, 0, 327723, 16, 0, 327724, 16, 0, 327725, 16, 0, 327726, 16, 0, 327727, 16, 0, 327728, 16, 0, 327729, 16, 0, 327730, 16, 0, 327731, 16, 0, 327732, 16, 0, 327733, 16, 0, 327734, 16, 0, 327735, 16, 0, 327736, 16, 0, 327737, 16, 0, 327738, 16, 0, 327739, 16, 0, 327740, 16, 0, 327741, 16, 0, 327742, 16, 0, 327743, 16, 0, 327744, 16, 0, 327745, 16, 0, 327746, 16, 0, 327747, 16, 0, 393216, 16, 0, 393217, 16, 0, 393218, 16, 0, 393219, 16, 0, 393220, 16, 0, 393221, 16, 0, 393222, 16, 0, 393223, 16, 0, 393224, 16, 0, 393225, 16, 0, 393226, 16, 0, 393227, 16, 0, 393228, 16, 0, 393229, 16, 0, 393230, 16, 0, 393231, 16, 0, 393232, 16, 0, 393233, 16, 0, 393234, 16, 0, 393235, 16, 0, 393236, 16, 0, 393237, 16, 0, 393238, 16, 0, 393239, 16, 0, 393240, 16, 0, 393241, 16, 0, 393242, 16, 0, 393243, 16, 0, 393244, 16, 0, 393245, 16, 0, 393246, 16, 0, 393247, 16, 0, 393248, 16, 0, 393249, 16, 0, 393250, 16, 0, 393251, 16, 0, 393252, 16, 0, 393253, 16, 0, 393254, 16, 0, 393255, 16, 0, 393256, 16, 0, 393257, 16, 0, 393258, 16, 0, 393259, 16, 0, 393260, 16, 0, 393261, 16, 0, 393262, 16, 0, 393263, 16, 0, 393264, 16, 0, 393265, 16, 0, 393266, 16, 0, 393267, 16, 0, 393268, 16, 0, 393269, 16, 0, 393270, 16, 0, 393271, 16, 0, 393272, 16, 0, 393273, 16, 0, 393274, 16, 0, 393275, 16, 0, 393276, 16, 0, 393277, 16, 0, 393278, 16, 0, 393279, 16, 0, 393280, 16, 0, 393281, 16, 0, 393282, 16, 0, 393283, 16, 0, 458752, 16, 0, 458753, 16, 0, 458754, 16, 0, 458755, 16, 0, 458756, 16, 0, 458757, 16, 0, 458758, 16, 0, 458759, 16, 0, 458760, 16, 0, 458761, 16, 0, 458762, 16, 0, 458763, 16, 0, 458764, 16, 0, 458765, 16, 0, 458766, 16, 0, 458767, 16, 0, 458768, 16, 0, 458769, 16, 0, 458770, 16, 0, 458771, 16, 0, 458772, 16, 0, 458773, 16, 0, 458774, 16, 0, 458775, 16, 0, 458776, 16, 0, 458777, 16, 0, 458778, 16, 0, 458779, 16, 0, 458780, 16, 0, 458781, 16, 0, 458782, 16, 0, 458783, 16, 0, 458784, 16, 0, 458785, 16, 0, 458786, 16, 0, 458787, 16, 0, 458788, 16, 0, 458789, 16, 0, 458790, 16, 0, 458791, 16, 0, 458792, 16, 0, 458793, 16, 0, 458794, 16, 0, 458795, 16, 0, 458796, 16, 0, 458797, 16, 0, 458798, 16, 0, 458799, 16, 0, 458800, 16, 0, 458801, 16, 0, 458802, 16, 0, 458803, 16, 0, 458804, 16, 0, 458805, 16, 0, 458806, 16, 0, 458807, 16, 0, 458808, 16, 0, 458809, 16, 0, 458810, 16, 0, 458811, 16, 0, 458812, 16, 0, 458813, 16, 0, 458814, 16, 0, 458815, 16, 0, 458816, 16, 0, 458817, 16, 0, 458818, 16, 0, 458819, 16, 0, 524288, 16, 0, 524289, 16, 0, 524290, 16, 0, 524291, 16, 0, 524292, 16, 0, 524293, 16, 0, 524294, 16, 0, 524295, 16, 0, 524296, 16, 0, 524297, 16, 0, 524298, 16, 0, 524299, 16, 0, 524300, 16, 0, 524301, 16, 0, 524302, 16, 0, 524303, 16, 0, 524304, 16, 0, 524305, 16, 0, 524306, 16, 0, 524307, 16, 0, 524308, 16, 0, 524309, 16, 0, 524310, 16, 0, 524311, 16, 0, 524312, 16, 0, 524313, 16, 0, 524314, 16, 0, 524315, 16, 0, 524316, 16, 0, 524317, 16, 0, 524318, 16, 0, 524319, 16, 0, 524320, 16, 0, 524321, 16, 0, 524322, 16, 0, 524323, 16, 0, 524324, 16, 0, 524325, 16, 0, 524326, 16, 0, 524327, 16, 0, 524328, 16, 0, 524329, 16, 0, 524330, 16, 0, 524331, 16, 0, 524332, 16, 0, 524333, 16, 0, 524334, 16, 0, 524335, 16, 0, 524336, 16, 0, 524337, 16, 0, 524338, 16, 0, 524339, 16, 0, 524340, 16, 0, 524341, 16, 0, 524342, 16, 0, 524343, 16, 0, 524344, 16, 0, 524345, 16, 0, 524346, 16, 0, 524347, 16, 0, 524348, 16, 0, 524349, 16, 0, 524350, 16, 0, 524351, 16, 0, 524352, 16, 0, 524353, 16, 0, 524354, 16, 0, 524355, 16, 0, 589824, 14, 0, 589825, 14, 0, 589826, 14, 0, 589827, 14, 0, 589828, 14, 0, 589829, 14, 0, 589830, 14, 0, 589831, 14, 0, 589832, 14, 0, 589833, 14, 0, 589834, 14, 0, 589835, 14, 0, 589836, 14, 0, 589837, 14, 0, 589838, 14, 0, 589839, 14, 0, 589840, 14, 0, 589841, 14, 0, 589842, 14, 0, 589843, 14, 0, 589844, 14, 0, 589845, 14, 0, 589846, 14, 0, 589847, 14, 0, 589848, 14, 0, 589849, 14, 0, 589850, 14, 0, 589851, 14, 0, 589852, 14, 0, 589853, 16, 0, 589854, 16, 0, 589855, 16, 0, 589856, 16, 0, 589857, 16, 0, 589858, 16, 0, 589859, 16, 0, 589860, 16, 0, 589861, 16, 0, 589862, 16, 0, 589863, 16, 0, 589864, 16, 0, 589865, 16, 0, 589866, 16, 0, 589867, 16, 0, 589868, 16, 0, 589869, 16, 0, 589870, 16, 0, 589871, 16, 0, 589872, 16, 0, 589873, 16, 0, 589874, 16, 0, 589875, 16, 0, 589876, 16, 0, 589877, 16, 0, 589878, 16, 0, 589879, 16, 0, 589880, 16, 0, 589881, 16, 0, 589882, 16, 0, 589883, 16, 0, 589884, 16, 0, 589885, 16, 0, 589886, 16, 0, 589887, 16, 0, 589888, 16, 0, 589889, 16, 0, 589890, 16, 0, 589891, 16, 0, 655360, 14, 0, 655361, 14, 0, 655362, 14, 0, 655363, 14, 0, 655364, 14, 0, 655365, 14, 0, 655366, 14, 0, 655367, 14, 0, 655368, 14, 0, 655369, 14, 0, 655370, 14, 0, 655371, 14, 0, 655372, 14, 0, 655373, 14, 0, 655374, 14, 0, 655375, 14, 0, 655376, 14, 0, 655377, 14, 0, 655378, 14, 0, 655379, 14, 0, 655380, 14, 0, 655381, 14, 0, 655382, 14, 0, 655383, 14, 0, 655384, 14, 0, 655385, 16, 0, 655386, 16, 0, 655387, 16, 0, 655388, 14, 0, 655389, 16, 0, 655390, 16, 0, 655391, 16, 0, 655392, 16, 0, 655393, 16, 0, 655394, 16, 0, 655395, 16, 0, 655396, 16, 0, 655397, 16, 0, 655398, 16, 0, 655399, 16, 0, 655400, 16, 0, 655401, 16, 0, 655402, 16, 0, 655403, 16, 0, 655404, 16, 0, 655405, 16, 0, 655406, 16, 0, 655407, 16, 0, 655408, 16, 0, 655409, 16, 0, 655410, 16, 0, 655411, 16, 0, 655412, 16, 0, 655413, 16, 0, 655414, 16, 0, 655415, 16, 0, 655416, 16, 0, 655417, 16, 0, 655418, 16, 0, 655419, 16, 0, 655420, 16, 0, 655421, 16, 0, 655422, 16, 0, 655423, 16, 0, 655424, 16, 0, 655425, 16, 0, 655426, 16, 0, 655427, 16, 0, 720896, 15, 0, 720897, 15, 0, 720898, 15, 0, 720899, 15, 0, 720900, 15, 0, 720901, 15, 0, 720902, 15, 0, 720903, 15, 0, 720904, 15, 0, 720905, 15, 0, 720906, 15, 0, 720907, 15, 0, 720908, 15, 0, 720909, 15, 0, 720910, 15, 0, 720911, 15, 0, 720912, 15, 0, 720913, 15, 0, 720914, 15, 0, 720915, 15, 0, 720916, 15, 0, 720917, 15, 0, 720918, 15, 0, 720919, 15, 0, 720920, 15, 0, 720921, 15, 0, 720922, 15, 0, 720923, 15, 0, 720924, 15, 0, 720925, 15, 0, 720926, 15, 0, 720927, 15, 0, 720928, 15, 0, 720929, 15, 0, 720930, 15, 0, 720931, 15, 0, 720932, 15, 0, 720933, 15, 0, 720934, 15, 0, 720935, 15, 0, 720936, 15, 0, 720937, 15, 0, 720938, 15, 0, 720939, 15, 0, 720940, 15, 0, 720941, 15, 0, 720942, 15, 0, 720943, 15, 0, 720944, 15, 0, 720945, 15, 0, 720946, 15, 0, 720947, 15, 0, 720948, 15, 0, 720949, 15, 0, 720950, 15, 0, 720951, 15, 0, 720952, 15, 0, 720953, 15, 0, 720954, 15, 0, 720955, 15, 0, 720956, 15, 0, 720957, 15, 0, 720958, 15, 0, 720959, 15, 0, 720960, 15, 0, 720961, 15, 0, 720962, 15, 0, 720963, 15, 0, 786432, 15, 0, 786433, 15, 0, 786434, 15, 0, 786435, 15, 0, 786436, 15, 0, 786437, 15, 0, 786438, 15, 0, 786439, 15, 0, 786440, 15, 0, 786441, 15, 0, 786442, 15, 0, 786443, 15, 0, 786444, 15, 0, 786445, 15, 0, 786446, 15, 0, 786447, 15, 0, 786448, 15, 0, 786449, 15, 0, 786450, 15, 0, 786451, 15, 0, 786452, 15, 0, 786453, 15, 0, 786454, 15, 0, 786455, 15, 0, 786456, 15, 0, 786457, 15, 0, 786458, 15, 0, 786459, 15, 0, 786460, 15, 0, 786461, 15, 0, 786462, 15, 0, 786463, 15, 0, 786464, 15, 0, 786465, 15, 0, 786466, 15, 0, 786467, 15, 0, 786468, 15, 0, 786469, 15, 0, 786470, 15, 0, 786471, 15, 0, 786472, 15, 0, 786473, 15, 0, 786474, 15, 0, 786475, 15, 0, 786476, 15, 0, 786477, 15, 0, 786478, 15, 0, 786479, 15, 0, 786480, 15, 0, 786481, 15, 0, 786482, 15, 0, 786483, 15, 0, 786484, 15, 0, 786485, 15, 0, 786486, 15, 0, 786487, 15, 0, 786488, 15, 0, 786489, 15, 0, 786490, 15, 0, 786491, 15, 0, 786492, 15, 0, 786493, 15, 0, 786494, 15, 0, 786495, 15, 0, 786496, 15, 0, 786497, 15, 0, 786498, 15, 0, 786499, 15, 0, 851968, 15, 0, 851969, 15, 0, 851970, 15, 0, 851971, 15, 0, 851972, 15, 0, 851973, 15, 0, 851974, 15, 0, 851975, 15, 0, 851976, 15, 0, 851977, 15, 0, 851978, 15, 0, 851979, 15, 0, 851980, 15, 0, 851981, 15, 0, 851982, 15, 0, 851983, 15, 0, 851984, 15, 0, 851985, 15, 0, 851986, 15, 0, 851987, 15, 0, 851988, 15, 0, 851989, 15, 0, 851990, 15, 0, 851991, 15, 0, 851992, 15, 0, 851993, 15, 0, 851994, 15, 0, 851995, 15, 0, 851996, 15, 0, 851997, 15, 0, 851998, 15, 0, 851999, 15, 0, 852000, 15, 0, 852001, 15, 0, 852002, 15, 0, 852003, 15, 0, 852004, 15, 0, 852005, 15, 0, 852006, 15, 0, 852007, 15, 0, 852008, 15, 0, 852009, 15, 0, 852010, 15, 0, 852011, 15, 0, 852012, 15, 0, 852013, 15, 0, 852014, 15, 0, 852015, 15, 0, 852016, 15, 0, 852017, 15, 0, 852018, 15, 0, 852019, 15, 0, 852020, 15, 0, 852021, 15, 0, 852022, 15, 0, 852023, 15, 0, 852024, 15, 0, 852025, 15, 0, 852026, 15, 0, 852027, 15, 0, 852028, 15, 0, 852029, 15, 0, 852030, 15, 0, 852031, 15, 0, 852032, 15, 0, 852033, 15, 0, 852034, 15, 0, 852035, 15, 0, 917504, 16, 0, 917505, 16, 0, 917506, 16, 0, 917507, 16, 0, 917508, 16, 0, 917509, 16, 0, 917510, 16, 0, 917511, 16, 0, 917512, 16, 0, 917513, 16, 0, 917514, 16, 0, 917515, 16, 0, 917516, 16, 0, 917517, 16, 0, 917518, 16, 0, 917519, 16, 0, 917520, 16, 0, 917521, 16, 0, 917522, 16, 0, 917523, 16, 0, 917524, 16, 0, 917525, 16, 0, 917526, 16, 0, 917527, 16, 0, 917528, 16, 0, 917529, 16, 0, 917530, 16, 0, 917531, 16, 0, 917532, 16, 0, 917533, 16, 0, 917534, 16, 0, 917535, 16, 0, 917536, 16, 0, 917537, 16, 0, 917538, 16, 0, 917539, 14, 0, 917540, 14, 0, 917541, 14, 0, 917542, 14, 0, 917543, 14, 0, 917544, 14, 0, 917545, 14, 0, 917546, 14, 0, 917547, 14, 0, 917548, 14, 0, 917549, 14, 0, 917550, 14, 0, 917551, 14, 0, 917552, 14, 0, 917553, 14, 0, 917554, 14, 0, 917555, 14, 0, 917556, 14, 0, 917557, 14, 0, 917558, 14, 0, 917559, 14, 0, 917560, 14, 0, 917561, 14, 0, 917562, 14, 0, 917563, 14, 0, 917564, 14, 0, 917565, 14, 0, 917566, 14, 0, 917567, 14, 0, 917568, 14, 0, 917569, 14, 0, 917570, 14, 0, 917571, 14, 0, 983040, 16, 0, 983041, 16, 0, 983042, 16, 0, 983043, 16, 0, 983044, 16, 0, 983045, 16, 0, 983046, 16, 0, 983047, 16, 0, 983048, 16, 0, 983049, 16, 0, 983050, 16, 0, 983051, 16, 0, 983052, 16, 0, 983053, 16, 0, 983054, 16, 0, 983055, 16, 0, 983056, 16, 0, 983057, 16, 0, 983058, 16, 0, 983059, 16, 0, 983060, 16, 0, 983061, 16, 0, 983062, 16, 0, 983063, 16, 0, 983064, 16, 0, 983065, 16, 0, 983066, 16, 0, 983067, 16, 0, 983068, 16, 0, 983069, 16, 0, 983070, 16, 0, 983071, 16, 0, 983072, 16, 0, 983073, 16, 0, 983074, 16, 0, 983075, 14, 0, 983076, 14, 0, 983077, 14, 0, 983078, 14, 0, 983079, 14, 0, 983080, 14, 0, 983081, 14, 0, 983082, 14, 0, 983083, 14, 0, 983084, 14, 0, 983085, 14, 0, 983086, 14, 0, 983087, 14, 0, 983088, 14, 0, 983089, 14, 0, 983090, 14, 0, 983091, 14, 0, 983092, 14, 0, 983093, 14, 0, 983094, 14, 0, 983095, 14, 0, 983096, 14, 0, 983097, 14, 0, 983098, 14, 0, 983099, 14, 0, 983100, 14, 0, 983101, 14, 0, 983102, 14, 0, 983103, 14, 0, 983104, 14, 0, 983105, 14, 0, 983106, 14, 0, 983107, 14, 0, 1048576, 16, 0, 1048577, 16, 0, 1048578, 16, 0, 1048579, 16, 0, 1048580, 16, 0, 1048581, 16, 0, 1048582, 16, 0, 1048583, 16, 0, 1048584, 16, 0, 1048585, 16, 0, 1048586, 16, 0, 1048587, 16, 0, 1048588, 16, 0, 1048589, 16, 0, 1048590, 16, 0, 1048591, 16, 0, 1048592, 16, 0, 1048593, 16, 0, 1048594, 16, 0, 1048595, 16, 0, 1048596, 16, 0, 1048597, 16, 0, 1048598, 16, 0, 1048599, 16, 0, 1048600, 16, 0, 1048601, 16, 0, 1048602, 16, 0, 1048603, 16, 0, 1048604, 16, 0, 1048605, 16, 0, 1048606, 16, 0, 1048607, 16, 0, 1048608, 16, 0, 1048609, 16, 0, 1048610, 16, 0, 1048611, 16, 0, 1048612, 16, 0, 1048613, 16, 0, 1048614, 16, 0, 1048615, 16, 0, 1048616, 16, 0, 1048617, 16, 0, 1048618, 16, 0, 1048619, 14, 0, 1048620, 14, 0, 1048621, 14, 0, 1048622, 14, 0, 1048623, 14, 0, 1048624, 14, 0, 1048625, 14, 0, 1048626, 14, 0, 1048627, 14, 0, 1048628, 14, 0, 1048629, 14, 0, 1048630, 14, 0, 1048631, 14, 0, 1048632, 14, 0, 1048633, 14, 0, 1048634, 14, 0, 1048635, 14, 0, 1048636, 14, 0, 1048637, 14, 0, 1048638, 14, 0, 1048639, 14, 0, 1048640, 14, 0, 1048641, 14, 0, 1048642, 14, 0, 1048643, 14, 0, 1114112, 16, 0, 1114113, 16, 0, 1114114, 16, 0, 1114115, 16, 0, 1114116, 16, 0, 1114117, 16, 0, 1114118, 16, 0, 1114119, 16, 0, 1114120, 16, 0, 1114121, 16, 0, 1114122, 16, 0, 1114123, 16, 0, 1114124, 16, 0, 1114125, 16, 0, 1114126, 16, 0, 1114127, 16, 0, 1114128, 16, 0, 1114129, 16, 0, 1114130, 16, 0, 1114131, 16, 0, 1114132, 16, 0, 1114133, 16, 0, 1114134, 16, 0, 1114135, 16, 0, 1114136, 16, 0, 1114137, 16, 0, 1114138, 16, 0, 1114139, 16, 0, 1114140, 16, 0, 1114141, 16, 0, 1114142, 16, 0, 1114143, 16, 0, 1114144, 16, 0, 1114145, 16, 0, 1114146, 16, 0, 1114147, 16, 0, 1114148, 16, 0, 1114149, 16, 0, 1114150, 16, 0, 1114151, 16, 0, 1114152, 16, 0, 1114153, 16, 0, 1114154, 16, 0, 1114155, 14, 0, 1114156, 14, 0, 1114157, 14, 0, 1114158, 14, 0, 1114159, 14, 0, 1114160, 14, 0, 1114161, 14, 0, 1114162, 14, 0, 1114163, 14, 0, 1114164, 14, 0, 1114165, 14, 0, 1114166, 14, 0, 1114167, 14, 0, 1114168, 14, 0, 1114169, 14, 0, 1114170, 14, 0, 1114171, 14, 0, 1114172, 14, 0, 1114173, 14, 0, 1114174, 14, 0, 1114175, 14, 0, 1114176, 14, 0, 1114177, 14, 0, 1114178, 14, 0, 1114179, 14, 0, 1179648, 16, 0, 1179649, 16, 0, 1179650, 16, 0, 1179651, 16, 0, 1179652, 16, 0, 1179653, 16, 0, 1179654, 16, 0, 1179655, 16, 0, 1179656, 16, 0, 1179657, 16, 0, 1179658, 16, 0, 1179659, 16, 0, 1179660, 16, 0, 1179661, 16, 0, 1179662, 16, 0, 1179663, 16, 0, 1179664, 16, 0, 1179665, 16, 0, 1179666, 16, 0, 1179667, 16, 0, 1179668, 16, 0, 1179669, 16, 0, 1179670, 16, 0, 1179671, 16, 0, 1179672, 16, 0, 1179673, 16, 0, 1179674, 16, 0, 1179675, 16, 0, 1179676, 16, 0, 1179677, 16, 0, 1179678, 16, 0, 1179679, 16, 0, 1179680, 16, 0, 1179681, 16, 0, 1179682, 16, 0, 1179683, 16, 0, 1179684, 16, 0, 1179685, 16, 0, 1179686, 16, 0, 1179687, 16, 0, 1179688, 16, 0, 1179689, 16, 0, 1179690, 16, 0, 1179691, 14, 0, 1179692, 14, 0, 1179693, 14, 0, 1179694, 14, 0, 1179695, 14, 0, 1179696, 14, 0, 1179697, 14, 0, 1179698, 14, 0, 1179699, 14, 0, 1179700, 14, 0, 1179701, 14, 0, 1179702, 14, 0, 1179703, 14, 0, 1179704, 14, 0, 1179705, 14, 0, 1179706, 14, 0, 1179707, 14, 0, 1179708, 14, 0, 1179709, 14, 0, 1179710, 14, 0, 1179711, 14, 0, 1179712, 14, 0, 1179713, 14, 0, 1179714, 14, 0, 1179715, 14, 0, 1245184, 16, 0, 1245185, 16, 0, 1245186, 16, 0, 1245187, 16, 0, 1245188, 16, 0, 1245189, 16, 0, 1245190, 16, 0, 1245191, 16, 0, 1245192, 16, 0, 1245193, 16, 0, 1245194, 16, 0, 1245195, 16, 0, 1245196, 16, 0, 1245197, 16, 0, 1245198, 16, 0, 1245199, 16, 0, 1245200, 16, 0, 1245201, 16, 0, 1245202, 16, 0, 1245203, 16, 0, 1245204, 16, 0, 1245205, 16, 0, 1245206, 16, 0, 1245207, 16, 0, 1245208, 16, 0, 1245209, 16, 0, 1245210, 16, 0, 1245211, 16, 0, 1245212, 16, 0, 1245213, 16, 0, 1245214, 16, 0, 1245215, 16, 0, 1245216, 16, 0, 1245217, 16, 0, 1245218, 16, 0, 1245219, 16, 0, 1245220, 16, 0, 1245221, 16, 0, 1245222, 16, 0, 1245223, 16, 0, 1245224, 16, 0, 1245225, 16, 0, 1245226, 16, 0, 1245227, 14, 0, 1245228, 14, 0, 1245229, 14, 0, 1245230, 14, 0, 1245231, 14, 0, 1245232, 14, 0, 1245233, 14, 0, 1245234, 14, 0, 1245235, 14, 0, 1245236, 14, 0, 1245237, 14, 0, 1245238, 14, 0, 1245239, 14, 0, 1245240, 14, 0, 1245241, 14, 0, 1245242, 14, 0, 1245243, 14, 0, 1245244, 14, 0, 1245245, 14, 0, 1245246, 14, 0, 1245247, 14, 0, 1245248, 14, 0, 1245249, 14, 0, 1245250, 14, 0, 1245251, 14, 0, 1310720, 16, 0, 1310721, 16, 0, 1310722, 16, 0, 1310723, 16, 0, 1310724, 16, 0, 1310725, 16, 0, 1310726, 16, 0, 1310727, 16, 0, 1310728, 16, 0, 1310729, 16, 0, 1310730, 16, 0, 1310731, 16, 0, 1310732, 16, 0, 1310733, 16, 0, 1310734, 16, 0, 1310735, 16, 0, 1310736, 16, 0, 1310737, 16, 0, 1310738, 16, 0, 1310739, 16, 0, 1310740, 16, 0, 1310741, 16, 0, 1310742, 16, 0, 1310743, 16, 0, 1310744, 16, 0, 1310745, 16, 0, 1310746, 16, 0, 1310747, 16, 0, 1310748, 16, 0, 1310749, 16, 0, 1310750, 16, 0, 1310751, 16, 0, 1310752, 16, 0, 1310753, 16, 0, 1310754, 16, 0, 1310755, 16, 0, 1310756, 16, 0, 1310757, 16, 0, 1310758, 16, 0, 1310759, 16, 0, 1310760, 16, 0, 1310761, 16, 0, 1310762, 16, 0, 1310763, 16, 0, 1310764, 16, 0, 1310765, 16, 0, 1310766, 16, 0, 1310767, 16, 0, 1310768, 16, 0, 1310769, 16, 0, 1310770, 16, 0, 1310771, 16, 0, 1310772, 16, 0, 1310773, 16, 0, 1310774, 16, 0, 1310775, 16, 0, 1310776, 16, 0, 1310777, 16, 0, 1310778, 16, 0, 1310779, 16, 0, 1310780, 16, 0, 1310781, 16, 0, 1310782, 16, 0, 1310783, 16, 0, 1310784, 16, 0, 1310785, 16, 0, 1310786, 16, 0, 1310787, 16, 0, 1376256, 16, 0, 1376257, 16, 0, 1376258, 16, 0, 1376259, 16, 0, 1376260, 16, 0, 1376261, 16, 0, 1376262, 16, 0, 1376263, 16, 0, 1376264, 16, 0, 1376265, 16, 0, 1376266, 16, 0, 1376267, 16, 0, 1376268, 16, 0, 1376269, 16, 0, 1376270, 16, 0, 1376271, 16, 0, 1376272, 16, 0, 1376273, 16, 0, 1376274, 16, 0, 1376275, 16, 0, 1376276, 16, 0, 1376277, 16, 0, 1376278, 16, 0, 1376279, 16, 0, 1376280, 16, 0, 1376281, 16, 0, 1376282, 16, 0, 1376283, 16, 0, 1376284, 16, 0, 1376285, 16, 0, 1376286, 16, 0, 1376287, 16, 0, 1376288, 16, 0, 1376289, 16, 0, 1376290, 16, 0, 1376291, 16, 0, 1376292, 16, 0, 1376293, 16, 0, 1376294, 16, 0, 1376295, 16, 0, 1376296, 16, 0, 1376297, 16, 0, 1376298, 16, 0, 1376299, 16, 0, 1376300, 16, 0, 1376301, 16, 0, 1376302, 16, 0, 1376303, 16, 0, 1376304, 16, 0, 1376305, 16, 0, 1376306, 16, 0, 1376307, 16, 0, 1376308, 16, 0, 1376309, 16, 0, 1376310, 16, 0, 1376311, 16, 0, 1376312, 16, 0, 1376313, 16, 0, 1376314, 16, 0, 1376315, 16, 0, 1376316, 16, 0, 1376317, 16, 0, 1376318, 16, 0, 1376319, 16, 0, 1376320, 16, 0, 1376321, 16, 0, 1376322, 16, 0, 1376323, 16, 0, 1441792, 16, 0, 1441793, 16, 0, 1441794, 16, 0, 1441795, 16, 0, 1441796, 16, 0, 1441797, 16, 0, 1441798, 16, 0, 1441799, 16, 0, 1441800, 16, 0, 1441801, 16, 0, 1441802, 16, 0, 1441803, 16, 0, 1441804, 16, 0, 1441805, 16, 0, 1441806, 16, 0, 1441807, 16, 0, 1441808, 16, 0, 1441809, 16, 0, 1441810, 16, 0, 1441811, 16, 0, 1441812, 16, 0, 1441813, 16, 0, 1441814, 16, 0, 1441815, 16, 0, 1441816, 16, 0, 1441817, 16, 0, 1441818, 16, 0, 1441819, 16, 0, 1441820, 16, 0, 1441821, 16, 0, 1441822, 16, 0, 1441823, 16, 0, 1441824, 16, 0, 1441825, 16, 0, 1441826, 16, 0, 1441827, 16, 0, 1441828, 16, 0, 1441829, 16, 0, 1441830, 16, 0, 1441831, 16, 0, 1441832, 16, 0, 1441833, 16, 0, 1441834, 16, 0, 1441835, 16, 0, 1441836, 16, 0, 1441837, 16, 0, 1441838, 16, 0, 1441839, 16, 0, 1441840, 16, 0, 1441841, 16, 0, 1441842, 16, 0, 1441843, 16, 0, 1441844, 16, 0, 1441845, 16, 0, 1441846, 16, 0, 1441847, 16, 0, 1441848, 16, 0, 1441849, 16, 0, 1441850, 16, 0, 1441851, 16, 0, 1441852, 16, 0, 1441853, 16, 0, 1441854, 16, 0, 1441855, 16, 0, 1441856, 16, 0, 1441857, 16, 0, 1441858, 16, 0, 1441859, 16, 0 )

[node name="Sprite2" type="Sprite" parent="." index="2"]
position = Vector2( 256, 344 )
texture = ExtResource( 11 )

[node name="Sprite3" type="Sprite" parent="." index="3"]
position = Vector2( 1496, 320 )
texture = ExtResource( 11 )

[node name="TileMap" parent="." index="4"]
tile_set = ExtResource( 2 )
tile_data = PoolIntArray( 0, 16, 0, 1, 16, 0, 2, 16, 0, 3, 16, 0, 4, 16, 0, 5, 16, 0, 6, 16, 0, 7, 16, 0, 8, 16, 0, 9, 16, 0, 10, 16, 0, 11, 16, 0, 12, 16, 0, 13, 16, 0, 14, 16, 0, 15, 16, 0, 16, 16, 0, 17, 16, 0, 18, 16, 0, 19, 16, 0, 20, 16, 0, 21, 16, 0, 22, 16, 0, 23, 16, 0, 24, 16, 0, 25, 16, 0, 26, 16, 0, 27, 16, 0, 28, 7, 0, 65564, 6, 0, 131100, 6, 0, 196636, 6, 0, 262144, 9, 0, 262145, 10, 0, 262146, 10, 0, 262147, 10, 0, 262148, 10, 0, 262149, 10, 0, 262150, 10, 0, 262151, 10, 0, 262152, 10, 0, 262153, 10, 0, 262154, 10, 0, 262155, 10, 0, 262156, 10, 0, 262157, 10, 0, 262158, 10, 0, 262159, 10, 0, 262160, 11, 0, 262163, 8, 0, 262164, 5, 0, 262165, 5, 0, 262166, 5, 0, 262167, 5, 0, 262168, 4, 0, 262172, 6, 0, 327699, 12, 0, 327700, 12, 0, 327701, 12, 0, 327702, 12, 0, 327703, 12, 0, 327704, 12, 0, 327708, 6, 0, 393235, 12, 0, 393236, 12, 0, 393237, 12, 0, 393238, 12, 0, 393239, 12, 0, 393240, 12, 0, 393244, 6, 0, 458771, 12, 0, 458772, 12, 0, 458773, 12, 0, 458774, 12, 0, 458775, 12, 0, 458776, 12, 0, 458780, 6, 0, 524288, 5, 0, 524289, 5, 0, 524290, 5, 0, 524291, 5, 0, 524292, 5, 0, 524293, 5, 0, 524294, 5, 0, 524295, 5, 0, 524296, 5, 0, 524297, 5, 0, 524298, 5, 0, 524299, 5, 0, 524300, 5, 0, 524301, 5, 0, 524302, 5, 0, 524303, 5, 0, 524304, 5, 0, 524305, 5, 0, 524306, 5, 0, 524307, 12, 0, 524308, 12, 0, 524309, 12, 0, 524310, 12, 0, 524311, 12, 0, 524312, 12, 0, 524316, 6, 0, 589824, 12, 0, 589825, 12, 0, 589826, 12, 0, 589827, 12, 0, 589828, 12, 0, 589829, 12, 0, 589830, 12, 0, 589831, 12, 0, 589832, 12, 0, 589833, 12, 0, 589834, 12, 0, 589835, 12, 0, 589836, 12, 0, 589837, 12, 0, 589838, 12, 0, 589839, 12, 0, 589840, 12, 0, 589841, 12, 0, 589842, 12, 0, 589843, 12, 0, 589844, 12, 0, 589845, 12, 0, 589846, 12, 0, 589847, 12, 0, 589848, 12, 0, 589849, 16, 0, 589850, 16, 0, 589851, 16, 0, 589852, 6, 0, 655360, 12, 0, 655361, 12, 0, 655362, 12, 0, 655363, 12, 0, 655364, 12, 0, 655365, 12, 0, 655366, 12, 0, 655367, 12, 0, 655368, 12, 0, 655369, 12, 0, 655370, 12, 0, 655371, 12, 0, 655372, 12, 0, 655373, 12, 0, 655374, 12, 0, 655375, 12, 0, 655376, 12, 0, 655377, 12, 0, 655378, 12, 0, 655379, 12, 0, 655380, 12, 0, 655381, 12, 0, 655382, 12, 0, 655383, 12, 0, 655384, 12, 0, 655385, 17, 0, 655386, 17, 0, 655387, 17, 0, 655388, 6, 0, 655389, 17, 0, 655390, 17, 0, 655391, 17, 0, 655392, 17, 0, 655393, 17, 0, 655394, 17, 0, 655395, 17, 0, 655396, 17, 0, 655397, 17, 0, 655398, 17, 0, 655399, 17, 0, 655400, 17, 0, 655401, 17, 0, 655402, 17, 0, 655403, 17, 0, 655404, 17, 0, 655405, 17, 0, 655406, 17, 0, 655407, 17, 0, 655408, 17, 0, 655409, 17, 0, 655410, 17, 0, 655411, 17, 0, 655412, 17, 0, 655413, 17, 0, 655414, 17, 0, 655415, 17, 0, 655416, 17, 0, 655417, 17, 0, 655418, 17, 0, 655419, 17, 0, 655420, 17, 0, 655421, 17, 0, 655422, 17, 0, 655423, 17, 0, 655424, 17, 0, 655425, 17, 0, 655426, 17, 0, 655427, 17, 0, 720930, 7, 0, 786447, 5, 0, 786448, 5, 0, 786449, 5, 0, 786450, 5, 0, 786451, 5, 0, 786452, 5, 0, 786453, 5, 0, 786454, 5, 0, 786455, 5, 0, 786456, 5, 0, 786457, 5, 0, 786458, 5, 0, 786459, 5, 0, 786460, 5, 0, 786461, 5, 0, 786462, 5, 0, 786463, 5, 0, 786464, 5, 0, 786465, 5, 0, 786466, 4, 0, 786468, 9, 0, 786469, 10, 0, 786470, 11, 0, 851983, 12, 0, 851984, 12, 0, 851985, 12, 0, 851986, 12, 0, 851987, 12, 0, 851988, 12, 0, 851989, 12, 0, 851990, 12, 0, 851991, 12, 0, 851992, 12, 0, 851993, 12, 0, 851994, 12, 0, 851995, 12, 0, 851996, 12, 0, 851997, 12, 0, 851998, 12, 0, 851999, 12, 0, 852000, 12, 0, 852001, 12, 0, 852002, 12, 0, 852007, 9, 0, 852008, 10, 0, 852009, 10, 0, 852010, 11, 0, 917519, 12, 0, 917520, 12, 0, 917521, 12, 0, 917522, 12, 0, 917523, 12, 0, 917524, 12, 0, 917525, 12, 0, 917526, 12, 0, 917527, 12, 0, 917528, 12, 0, 917529, 12, 0, 917530, 12, 0, 917531, 12, 0, 917532, 12, 0, 917533, 12, 0, 917534, 12, 0, 917535, 12, 0, 917536, 12, 0, 917537, 12, 0, 917538, 12, 0, 983055, 12, 0, 983056, 12, 0, 983057, 12, 0, 983058, 12, 0, 983059, 12, 0, 983060, 12, 0, 983061, 12, 0, 983062, 12, 0, 983063, 12, 0, 983064, 12, 0, 983065, 12, 0, 983066, 12, 0, 983067, 12, 0, 983068, 12, 0, 983069, 12, 0, 983070, 12, 0, 983071, 12, 0, 983072, 12, 0, 983073, 12, 0, 983074, 12, 0, 983075, 13, 0, 983076, 13, 0, 983077, 13, 0, 983078, 13, 0, 983079, 13, 0, 983080, 13, 0, 983081, 13, 0, 983082, 13, 0, 983083, 8, 0, 983084, 5, 0, 983085, 5, 0, 983086, 5, 0, 983087, 5, 0, 983088, 4, 0, 1048591, 12, 0, 1048592, 12, 0, 1048593, 12, 0, 1048594, 12, 0, 1048595, 12, 0, 1048596, 12, 0, 1048597, 12, 0, 1048598, 12, 0, 1048599, 12, 0, 1048600, 12, 0, 1048601, 12, 0, 1048602, 12, 0, 1048603, 12, 0, 1048604, 12, 0, 1048605, 12, 0, 1048606, 12, 0, 1048607, 12, 0, 1048608, 12, 0, 1048609, 12, 0, 1048610, 12, 0, 1048611, 0, 0, 1048612, 0, 0, 1048613, 0, 0, 1048614, 0, 0, 1048615, 0, 0, 1048616, 0, 0, 1048617, 0, 0, 1048618, 0, 0, 1048619, 12, 0, 1048620, 12, 0, 1048621, 12, 0, 1048622, 12, 0, 1048623, 12, 0, 1048624, 12, 0, 1114127, 12, 0, 1114128, 12, 0, 1114129, 12, 0, 1114130, 12, 0, 1114131, 12, 0, 1114132, 12, 0, 1114133, 12, 0, 1114134, 12, 0, 1114135, 12, 0, 1114136, 12, 0, 1114137, 12, 0, 1114138, 12, 0, 1114139, 12, 0, 1114140, 12, 0, 1114141, 12, 0, 1114142, 12, 0, 1114143, 12, 0, 1114144, 12, 0, 1114145, 12, 0, 1114146, 12, 0, 1114147, 0, 0, 1114148, 0, 0, 1114149, 0, 0, 1114150, 0, 0, 1114151, 0, 0, 1114152, 0, 0, 1114153, 0, 0, 1114154, 0, 0, 1114155, 12, 0, 1114156, 12, 0, 1114157, 12, 0, 1114158, 12, 0, 1114159, 12, 0, 1114160, 12, 0, 1114173, 8, 0, 1114174, 5, 0, 1114175, 5, 0, 1114176, 5, 0, 1114177, 5, 0, 1114178, 5, 0, 1114179, 5, 0, 1179663, 12, 0, 1179664, 12, 0, 1179665, 12, 0, 1179666, 12, 0, 1179667, 12, 0, 1179668, 12, 0, 1179669, 12, 0, 1179670, 12, 0, 1179671, 12, 0, 1179672, 12, 0, 1179673, 12, 0, 1179674, 12, 0, 1179675, 12, 0, 1179676, 12, 0, 1179677, 12, 0, 1179678, 12, 0, 1179679, 12, 0, 1179680, 12, 0, 1179681, 12, 0, 1179682, 12, 0, 1179683, 0, 0, 1179684, 0, 0, 1179685, 0, 0, 1179686, 0, 0, 1179687, 0, 0, 1179688, 0, 0, 1179689, 0, 0, 1179690, 0, 0, 1179691, 12, 0, 1179692, 12, 0, 1179693, 12, 0, 1179694, 12, 0, 1179695, 12, 0, 1179696, 12, 0, 1179707, 7, 0, 1179710, 12, 0, 1179711, 12, 0, 1179712, 12, 0, 1179713, 12, 0, 1179714, 12, 0, 1179715, 12, 0, 1245199, 12, 0, 1245200, 12, 0, 1245201, 12, 0, 1245202, 12, 0, 1245203, 12, 0, 1245204, 12, 0, 1245205, 12, 0, 1245206, 12, 0, 1245207, 12, 0, 1245208, 12, 0, 1245209, 12, 0, 1245210, 12, 0, 1245211, 12, 0, 1245212, 12, 0, 1245213, 12, 0, 1245214, 12, 0, 1245215, 12, 0, 1245216, 12, 0, 1245217, 12, 0, 1245218, 12, 0, 1245219, 0, 0, 1245220, 0, 0, 1245221, 0, 0, 1245222, 0, 0, 1245223, 0, 0, 1245224, 0, 0, 1245225, 0, 0, 1245226, 0, 0, 1245227, 12, 0, 1245228, 12, 0, 1245229, 12, 0, 1245230, 12, 0, 1245231, 12, 0, 1245232, 12, 0, 1245243, 2, 0, 1245246, 12, 0, 1245247, 12, 0, 1245248, 12, 0, 1245249, 12, 0, 1245250, 12, 0, 1245251, 12, 0, 1310735, 12, 0, 1310736, 12, 0, 1310737, 12, 0, 1310738, 12, 0, 1310739, 12, 0, 1310740, 12, 0, 1310741, 12, 0, 1310742, 12, 0, 1310743, 12, 0, 1310744, 12, 0, 1310745, 12, 0, 1310746, 12, 0, 1310747, 12, 0, 1310748, 12, 0, 1310749, 12, 0, 1310750, 12, 0, 1310751, 12, 0, 1310752, 12, 0, 1310753, 12, 0, 1310754, 12, 0, 1310755, 0, 0, 1310756, 0, 0, 1310757, 0, 0, 1310758, 0, 0, 1310759, 0, 0, 1310760, 0, 0, 1310761, 0, 0, 1310762, 0, 0, 1310763, 12, 0, 1310764, 12, 0, 1310765, 12, 0, 1310766, 12, 0, 1310767, 12, 0, 1310768, 12, 0, 1310769, 5, 0, 1310770, 5, 0, 1310771, 5, 0, 1310772, 5, 0, 1310773, 5, 0, 1310774, 5, 0, 1310775, 5, 0, 1310776, 5, 0, 1310777, 5, 0, 1310778, 5, 0, 1310779, 12, 0, 1310780, 5, 0, 1310781, 5, 0, 1310782, 12, 0, 1310783, 12, 0, 1310784, 12, 0, 1310785, 12, 0, 1310786, 12, 0, 1310787, 12, 0, 1376271, 12, 0, 1376272, 12, 0, 1376273, 12, 0, 1376274, 12, 0, 1376275, 12, 0, 1376276, 12, 0, 1376277, 12, 0, 1376278, 12, 0, 1376279, 12, 0, 1376280, 12, 0, 1376281, 12, 0, 1376282, 12, 0, 1376283, 12, 0, 1376284, 12, 0, 1376285, 12, 0, 1376286, 12, 0, 1376287, 12, 0, 1376288, 12, 0, 1376289, 12, 0, 1376290, 12, 0, 1376291, 0, 0, 1376292, 0, 0, 1376293, 0, 0, 1376294, 0, 0, 1376295, 0, 0, 1376296, 0, 0, 1376297, 0, 0, 1376298, 0, 0, 1376299, 12, 0, 1376300, 12, 0, 1376301, 12, 0, 1376302, 12, 0, 1376303, 12, 0, 1376304, 12, 0, 1376305, 12, 0, 1376306, 12, 0, 1376307, 12, 0, 1376308, 12, 0, 1376309, 12, 0, 1376310, 12, 0, 1376311, 12, 0, 1376312, 12, 0, 1376313, 12, 0, 1376314, 12, 0, 1376315, 12, 0, 1376316, 12, 0, 1376317, 12, 0, 1376318, 12, 0, 1376319, 12, 0, 1376320, 12, 0, 1376321, 12, 0, 1376322, 12, 0, 1376323, 12, 0, 1441807, 12, 0, 1441808, 12, 0, 1441809, 12, 0, 1441810, 12, 0, 1441811, 12, 0, 1441812, 12, 0, 1441813, 12, 0, 1441814, 12, 0, 1441815, 12, 0, 1441816, 12, 0, 1441817, 12, 0, 1441818, 12, 0, 1441819, 12, 0, 1441820, 12, 0, 1441821, 12, 0, 1441822, 12, 0, 1441823, 12, 0, 1441824, 12, 0, 1441825, 12, 0, 1441826, 12, 0, 1441827, 0, 0, 1441828, 0, 0, 1441829, 0, 0, 1441830, 0, 0, 1441831, 0, 0, 1441832, 0, 0, 1441833, 0, 0, 1441834, 0, 0, 1441835, 12, 0, 1441836, 12, 0, 1441837, 12, 0, 1441838, 12, 0, 1441839, 12, 0, 1441840, 12, 0, 1441841, 12, 0, 1441842, 12, 0, 1441843, 12, 0, 1441844, 12, 0, 1441845, 12, 0, 1441846, 12, 0, 1441847, 12, 0, 1441848, 12, 0, 1441849, 12, 0, 1441850, 12, 0, 1441851, 12, 0, 1441852, 12, 0, 1441853, 12, 0, 1441854, 12, 0, 1441855, 12, 0, 1441856, 12, 0, 1441857, 12, 0, 1441858, 12, 0, 1441859, 12, 0 )

[node name="Sprite" type="Sprite" parent="TileMap/Background" index="0"]
position = Vector2( 1952, 704 )
texture = ExtResource( 7 )

[node name="Sprite" type="Sprite" parent="TileMap/Background/Sprite" index="0"]
position = Vector2( 56, -24 )
texture = ExtResource( 8 )

[node name="Sprite2" type="Sprite" parent="TileMap/Background" index="1"]
position = Vector2( 352, 112 )
texture = ExtResource( 14 )

[node name="Sprite3" type="Sprite" parent="TileMap/Background" index="2"]
position = Vector2( 1408, 136 )
texture = ExtResource( 8 )
flip_h = true

[node name="Sprite4" type="Sprite" parent="TileMap/Background" index="3"]
position = Vector2( 1664, 704 )
texture = ExtResource( 13 )

[node name="Sprite5" type="Sprite" parent="TileMap/Background" index="4"]
position = Vector2( 2840, 648 )
texture = ExtResource( 13 )

[node name="Sprite6" type="Sprite" parent="TileMap/Background" index="5"]
position = Vector2( 3880, 776 )
texture = ExtResource( 13 )

[node name="Sprite7" type="Sprite" parent="TileMap/Background" index="6"]
position = Vector2( 3200, 808 )
texture = ExtResource( 12 )

[node name="Sprite8" type="Sprite" parent="TileMap/Background" index="7"]
position = Vector2( 3944, 832 )
texture = ExtResource( 12 )

[node name="Sprite9" type="Sprite" parent="TileMap/Background" index="8"]
position = Vector2( 3896, 1232 )
texture = ExtResource( 12 )

[node name="Snake" parent="TileMap/Obstacles" index="0" instance=ExtResource( 4 )]
position = Vector2( 156.442, 470.687 )

[node name="Snake2" parent="TileMap/Obstacles" index="1" instance=ExtResource( 4 )]
position = Vector2( 3320, 1240 )

[node name="Tiger" parent="TileMap/Obstacles" index="2" instance=ExtResource( 3 )]
position = Vector2( 542.787, 478.849 )

[node name="Tiger2" parent="TileMap/Obstacles" index="3" instance=ExtResource( 3 )]
position = Vector2( 3896, 1248 )

[node name="Blocker" parent="TileMap/Obstacles" index="4" instance=ExtResource( 5 )]
position = Vector2( 1302.69, 734.055 )

[node name="Spider" parent="TileMap/Obstacles" index="5" instance=ExtResource( 6 )]
position = Vector2( 1984, 680 )

[node name="Fire" parent="TileMap/Obstacles" index="6" instance=ExtResource( 9 )]
position = Vector2( 1184, 736 )

[node name="Fire2" parent="TileMap/Obstacles" index="7" instance=ExtResource( 9 )]
position = Vector2( 1120, 736 )

[node name="KillBox" parent="TileMap/Obstacles" index="8" instance=ExtResource( 15 )]
position = Vector2( 1088, 1344 )
shape = SubResource( 1 )

[node name="Bread" parent="TileMap/Tools" index="0" instance=ExtResource( 16 )]
position = Vector2( 2082.03, 682.461 )

[node name="Start" parent="TileMap" index="4"]
position = Vector2( 63.4013, 261.987 )

[node name="Goal" parent="TileMap" index="5"]
position = Vector2( 4192, 1088 )

[node name="Node2D" type="Node2D" parent="TileMap/Waypoints" index="0"]
position = Vector2( 3960, 1088 )

[node name="Node2D2" type="Node2D" parent="TileMap/Waypoints" index="1"]
position = Vector2( 3264, 1088 )

[node name="Node2D3" type="Node2D" parent="TileMap/Waypoints" index="2"]
position = Vector2( 2728, 688 )

[node name="Node2D4" type="Node2D" parent="TileMap/Waypoints" index="3"]
position = Vector2( 1688, 688 )

[node name="Node2D5" type="Node2D" parent="TileMap/Waypoints" index="4"]
position = Vector2( 1688, 256 )

[node name="Node2D6" type="Node2D" parent="TileMap/Waypoints" index="5"]
position = Vector2( 520, 256 )

[node name="Leaves" type="Node" parent="TileMap/Foreground" index="0"]

[node name="Sprite" type="Sprite" parent="TileMap/Foreground/Leaves" index="0"]
position = Vector2( 96, 64 )
texture = ExtResource( 10 )

[node name="Sprite2" type="Sprite" parent="TileMap/Foreground/Leaves" index="1"]
position = Vector2( 288, 64 )
texture = ExtResource( 10 )

[node name="Sprite4" type="Sprite" parent="TileMap/Foreground/Leaves" index="2"]
position = Vector2( 480, 64 )
texture = ExtResource( 10 )

[node name="Sprite3" type="Sprite" parent="TileMap/Foreground/Leaves" index="3"]
position = Vector2( 672, 64 )
texture = ExtResource( 10 )

[node name="Sprite8" type="Sprite" parent="TileMap/Foreground/Leaves" index="4"]
position = Vector2( 864, 64 )
texture = ExtResource( 10 )

[node name="Sprite7" type="Sprite" parent="TileMap/Foreground/Leaves" index="5"]
position = Vector2( 1056, 64 )
texture = ExtResource( 10 )

[node name="Sprite6" type="Sprite" parent="TileMap/Foreground/Leaves" index="6"]
position = Vector2( 1248, 64 )
texture = ExtResource( 10 )

[node name="Sprite5" type="Sprite" parent="TileMap/Foreground/Leaves" index="7"]
position = Vector2( 1440, 64 )
texture = ExtResource( 10 )

[node name="Sprite16" type="Sprite" parent="TileMap/Foreground/Leaves" index="8"]
position = Vector2( 1632, 64 )
texture = ExtResource( 10 )

[node name="Sprite15" type="Sprite" parent="TileMap/Foreground/Leaves" index="9"]
position = Vector2( 1824, 64 )
texture = ExtResource( 10 )

[node name="Sprite14" type="Sprite" parent="TileMap/Foreground/Leaves" index="10"]
position = Vector2( 2016, 64 )
texture = ExtResource( 10 )

[node name="Sprite13" type="Sprite" parent="TileMap/Foreground/Leaves" index="11"]
position = Vector2( 2208, 64 )
texture = ExtResource( 10 )

[node name="Sprite12" type="Sprite" parent="TileMap/Foreground/Leaves" index="12"]
position = Vector2( 2400, 64 )
texture = ExtResource( 10 )

[node name="Sprite11" type="Sprite" parent="TileMap/Foreground/Leaves" index="13"]
position = Vector2( 2592, 64 )
texture = ExtResource( 10 )

[node name="Sprite10" type="Sprite" parent="TileMap/Foreground/Leaves" index="14"]
position = Vector2( 2784, 64 )
texture = ExtResource( 10 )

[node name="Sprite9" type="Sprite" parent="TileMap/Foreground/Leaves" index="15"]
position = Vector2( 2976, 64 )
texture = ExtResource( 10 )

[node name="Sprite23" type="Sprite" parent="TileMap/Foreground/Leaves" index="16"]
position = Vector2( 3168, 64 )
texture = ExtResource( 10 )

[node name="Sprite22" type="Sprite" parent="TileMap/Foreground/Leaves" index="17"]
position = Vector2( 3360, 64 )
texture = ExtResource( 10 )

[node name="Sprite21" type="Sprite" parent="TileMap/Foreground/Leaves" index="18"]
position = Vector2( 3552, 64 )
texture = ExtResource( 10 )

[node name="Sprite20" type="Sprite" parent="TileMap/Foreground/Leaves" index="19"]
position = Vector2( 3744, 64 )
texture = ExtResource( 10 )

[node name="Sprite19" type="Sprite" parent="TileMap/Foreground/Leaves" index="20"]
position = Vector2( 3936, 64 )
texture = ExtResource( 10 )

[node name="Sprite18" type="Sprite" parent="TileMap/Foreground/Leaves" index="21"]
position = Vector2( 4128, 64 )
texture = ExtResource( 10 )

[node name="Sprite17" type="Sprite" parent="TileMap/Foreground/Leaves" index="22"]
position = Vector2( 4320, 64 )
texture = ExtResource( 10 )

[node name="HBoxContainer" parent="CanvasLayer/UI/Hotbar/Container" index="0"]
margin_left = 498.0
margin_right = 782.0

[node name="Frog" parent="CanvasLayer/UI/Hotbar/Container/HBoxContainer" index="0"]
quantity = 7

[node name="SuperFrog" parent="CanvasLayer/UI/Hotbar/Container/HBoxContainer" index="1"]
visible = false

[node name="Eagle" parent="CanvasLayer/UI/Hotbar/Container/HBoxContainer" index="2"]
margin_left = 96.0
margin_right = 188.0
quantity = 2

[node name="SuperEagle" parent="CanvasLayer/UI/Hotbar/Container/HBoxContainer" index="3"]
visible = false
margin_left = 192.0
margin_right = 284.0

[node name="Blocker" parent="CanvasLayer/UI/Hotbar/Container/HBoxContainer" index="4"]
visible = false
margin_left = 192.0
margin_right = 284.0

[node name="Umbrella" parent="CanvasLayer/UI/Hotbar/Container/HBoxContainer" index="5"]
margin_left = 192.0
margin_right = 284.0
quantity = 1

[editable path="CanvasLayer/UI/Hotbar"]
