[gd_scene load_steps=4 format=2]

[ext_resource path="res://tiles/simple_tileset.tres" type="TileSet" id=1]
[ext_resource path="res://levels/Level.tscn" type="PackedScene" id=2]
[ext_resource path="res://obstacles/hazards/Fire.tscn" type="PackedScene" id=3]

[node name="Level3" instance=ExtResource( 2 )]
showcase_time = 2.0

[node name="TileMap" parent="." index="2"]
tile_set = ExtResource( 1 )
tile_data = PoolIntArray( -589824, 2, 0, -589823, 2, 0, -589822, 2, 0, -589821, 2, 0, -589820, 2, 0, -589819, 2, 0, -589818, 2, 0, -589817, 2, 0, -589816, 2, 0, -589815, 2, 0, -589814, 2, 0, -589813, 2, 0, -589812, 2, 0, -589811, 2, 0, -589810, 2, 0, -589809, 2, 0, -589808, 2, 0, -589807, 2, 0, -589806, 2, 0, -589805, 2, 0, -589804, 2, 0, -589803, 2, 0, -589802, 2, 0, -589801, 2, 0, -589800, 2, 0, -589799, 2, 0, -589798, 2, 0, -589797, 2, 0, -589796, 2, 0, -589795, 2, 0, -589794, 2, 0, -589793, 2, 0, -589792, 2, 0, -589791, 2, 0, -589790, 2, 0, -589789, 2, 0, -589788, 2, 0, -589787, 2, 0, -589786, 2, 0, -589785, 2, 0, -589784, 2, 0, -589783, 2, 0, -589782, 2, 0, -589781, 2, 0, -524288, 2, 0, -524287, 3, 0, -524286, 3, 0, -524285, 3, 0, -524284, 3, 0, -524283, 3, 0, -524282, 3, 0, -524281, 3, 0, -524280, 3, 0, -524279, 3, 0, -524278, 3, 0, -524277, 3, 0, -524276, 3, 0, -524275, 3, 0, -524274, 3, 0, -524273, 3, 0, -524272, 3, 0, -524271, 3, 0, -524270, 3, 0, -524269, 3, 0, -524268, 3, 0, -524267, 3, 0, -524266, 3, 0, -524265, 3, 0, -524264, 3, 0, -524263, 3, 0, -524262, 3, 0, -524261, 3, 0, -524260, 3, 0, -524259, 3, 0, -524258, 3, 0, -524257, 3, 0, -524256, 3, 0, -524255, 3, 0, -524254, 3, 0, -524253, 3, 0, -524252, 3, 0, -524251, 3, 0, -524250, 3, 0, -524249, 3, 0, -524248, 3, 0, -524247, 3, 0, -524246, 3, 0, -524245, 2, 0, -458752, 2, 0, -458751, 3, 0, -458750, 3, 0, -458749, 3, 0, -458748, 3, 0, -458747, 3, 0, -458746, 3, 0, -458745, 3, 0, -458744, 3, 0, -458743, 3, 0, -458742, 3, 0, -458741, 3, 0, -458740, 3, 0, -458739, 3, 0, -458738, 3, 0, -458737, 3, 0, -458736, 3, 0, -458735, 3, 0, -458734, 3, 0, -458733, 3, 0, -458732, 3, 0, -458731, 3, 0, -458730, 3, 0, -458729, 3, 0, -458728, 3, 0, -458727, 3, 0, -458726, 3, 0, -458725, 3, 0, -458724, 3, 0, -458723, 3, 0, -458722, 3, 0, -458721, 3, 0, -458720, 3, 0, -458719, 3, 0, -458718, 3, 0, -458717, 3, 0, -458716, 3, 0, -458715, 3, 0, -458714, 3, 0, -458713, 3, 0, -458712, 3, 0, -458711, 3, 0, -458710, 3, 0, -458709, 2, 0, -393216, 2, 0, -393215, 3, 0, -393214, 3, 0, -393213, 3, 0, -393212, 3, 0, -393211, 3, 0, -393210, 3, 0, -393209, 3, 0, -393208, 3, 0, -393207, 3, 0, -393206, 3, 0, -393205, 3, 0, -393204, 3, 0, -393203, 3, 0, -393202, 3, 0, -393201, 3, 0, -393200, 3, 0, -393199, 3, 0, -393198, 3, 0, -393197, 3, 0, -393196, 3, 0, -393195, 3, 0, -393194, 3, 0, -393193, 3, 0, -393192, 3, 0, -393191, 3, 0, -393190, 3, 0, -393189, 3, 0, -393188, 3, 0, -393187, 3, 0, -393186, 3, 0, -393185, 2, 0, -393184, 2, 0, -393183, 2, 0, -393182, 2, 0, -393181, 2, 0, -393180, 2, 0, -393179, 3, 0, -393178, 2, 0, -393177, 2, 0, -393176, 2, 0, -393175, 2, 0, -393174, 2, 0, -393173, 2, 0, -327680, 2, 0, -327679, 3, 0, -327678, 3, 0, -327677, 3, 0, -327676, 3, 0, -327675, 3, 0, -327674, 3, 0, -327673, 3, 0, -327672, 3, 0, -327671, 3, 0, -327670, 3, 0, -327669, 3, 0, -327668, 3, 0, -327667, 3, 0, -327666, 3, 0, -327665, 3, 0, -327664, 3, 0, -327663, 3, 0, -327662, 3, 0, -327661, 3, 0, -327660, 3, 0, -327659, 3, 0, -327658, 3, 0, -327657, 3, 0, -327656, 3, 0, -327655, 3, 0, -327654, 3, 0, -327653, 2, 0, -327652, 2, 0, -327651, 2, 0, -327650, 3, 0, -327649, 3, 0, -327648, 3, 0, -327647, 3, 0, -327646, 3, 0, -327645, 3, 0, -327644, 3, 0, -327643, 3, 0, -327642, 3, 0, -327641, 3, 0, -327640, 3, 0, -327639, 3, 0, -327638, 3, 0, -327637, 2, 0, -262144, 2, 0, -262143, 3, 0, -262142, 3, 0, -262141, 3, 0, -262140, 3, 0, -262139, 3, 0, -262138, 3, 0, -262137, 3, 0, -262136, 3, 0, -262135, 3, 0, -262134, 3, 0, -262133, 3, 0, -262132, 3, 0, -262131, 3, 0, -262130, 3, 0, -262129, 3, 0, -262128, 3, 0, -262127, 3, 0, -262126, 3, 0, -262125, 3, 0, -262124, 3, 0, -262123, 3, 0, -262122, 3, 0, -262121, 3, 0, -262120, 3, 0, -262119, 3, 0, -262118, 3, 0, -262117, 3, 0, -262116, 3, 0, -262115, 3, 0, -262114, 3, 0, -262113, 3, 0, -262112, 3, 0, -262111, 3, 0, -262110, 3, 0, -262109, 3, 0, -262108, 3, 0, -262107, 3, 0, -262106, 3, 0, -262105, 3, 0, -262104, 3, 0, -262103, 3, 0, -262102, 3, 0, -262101, 2, 0, -196608, 2, 0, -196607, 3, 0, -196606, 3, 0, -196605, 3, 0, -196604, 3, 0, -196603, 3, 0, -196602, 3, 0, -196601, 3, 0, -196600, 3, 0, -196599, 3, 0, -196598, 3, 0, -196597, 3, 0, -196596, 3, 0, -196595, 3, 0, -196594, 3, 0, -196593, 3, 0, -196592, 3, 0, -196591, 3, 0, -196590, 3, 0, -196589, 3, 0, -196588, 3, 0, -196587, 3, 0, -196586, 3, 0, -196585, 2, 0, -196584, 2, 0, -196583, 2, 0, -196582, 3, 0, -196581, 3, 0, -196580, 3, 0, -196579, 3, 0, -196578, 3, 0, -196577, 3, 0, -196576, 3, 0, -196575, 3, 0, -196574, 3, 0, -196573, 3, 0, -196572, 3, 0, -196571, 3, 0, -196570, 3, 0, -196569, 3, 0, -196568, 3, 0, -196567, 3, 0, -196566, 3, 0, -196565, 2, 0, -131072, 2, 0, -131071, 3, 0, -131070, 3, 0, -131069, 3, 0, -131068, 3, 0, -131067, 3, 0, -131066, 3, 0, -131065, 3, 0, -131064, 3, 0, -131063, 3, 0, -131062, 3, 0, -131061, 3, 0, -131060, 3, 0, -131059, 3, 0, -131058, 3, 0, -131057, 3, 0, -131056, 3, 0, -131055, 3, 0, -131054, 3, 0, -131053, 3, 0, -131052, 3, 0, -131051, 3, 0, -131050, 3, 0, -131049, 3, 0, -131048, 3, 0, -131047, 3, 0, -131046, 3, 0, -131045, 3, 0, -131044, 3, 0, -131043, 3, 0, -131042, 3, 0, -131041, 3, 0, -131040, 3, 0, -131039, 3, 0, -131038, 3, 0, -131037, 3, 0, -131036, 3, 0, -131035, 3, 0, -131034, 3, 0, -131033, 3, 0, -131032, 3, 0, -131031, 3, 0, -131030, 3, 0, -131029, 2, 0, -65536, 2, 0, -65535, 3, 0, -65534, 3, 0, -65533, 3, 0, -65532, 3, 0, -65531, 3, 0, -65530, 3, 0, -65529, 3, 0, -65528, 3, 0, -65527, 3, 0, -65526, 3, 0, -65525, 3, 0, -65524, 3, 0, -65523, 3, 0, -65522, 3, 0, -65521, 3, 0, -65520, 3, 0, -65519, 3, 0, -65518, 3, 0, -65517, 2, 0, -65516, 2, 0, -65515, 2, 0, -65514, 3, 0, -65513, 3, 0, -65512, 3, 0, -65511, 3, 0, -65510, 3, 0, -65509, 3, 0, -65508, 3, 0, -65507, 3, 0, -65506, 3, 0, -65505, 3, 0, -65504, 3, 0, -65503, 3, 0, -65502, 3, 0, -65501, 3, 0, -65500, 3, 0, -65499, 3, 0, -65498, 3, 0, -65497, 3, 0, -65496, 3, 0, -65495, 3, 0, -65494, 3, 0, -65493, 2, 0, 0, 2, 0, 1, 3, 0, 2, 3, 0, 3, 3, 0, 4, 3, 0, 5, 3, 0, 6, 3, 0, 7, 3, 0, 8, 3, 0, 9, 3, 0, 10, 3, 0, 11, 3, 0, 12, 3, 0, 13, 3, 0, 14, 3, 0, 15, 3, 0, 16, 3, 0, 17, 3, 0, 18, 3, 0, 19, 3, 0, 20, 3, 0, 21, 3, 0, 22, 3, 0, 23, 3, 0, 24, 3, 0, 25, 3, 0, 26, 3, 0, 27, 3, 0, 28, 3, 0, 29, 3, 0, 30, 3, 0, 31, 3, 0, 32, 3, 0, 33, 3, 0, 34, 3, 0, 35, 3, 0, 36, 3, 0, 37, 3, 0, 38, 3, 0, 39, 3, 0, 40, 3, 0, 41, 3, 0, 42, 3, 0, 43, 2, 0, 65536, 2, 0, 65537, 3, 0, 65538, 3, 0, 65539, 3, 0, 65540, 3, 0, 65541, 3, 0, 65542, 3, 0, 65543, 3, 0, 65544, 3, 0, 65545, 3, 0, 65546, 3, 0, 65547, 3, 0, 65548, 3, 0, 65549, 3, 0, 65550, 3, 0, 65551, 2, 0, 65552, 2, 0, 65553, 2, 0, 65554, 3, 0, 65555, 3, 0, 65556, 3, 0, 65557, 3, 0, 65558, 3, 0, 65559, 3, 0, 65560, 3, 0, 65561, 3, 0, 65562, 3, 0, 65563, 3, 0, 65564, 3, 0, 65565, 3, 0, 65566, 3, 0, 65567, 3, 0, 65568, 3, 0, 65569, 3, 0, 65570, 3, 0, 65571, 3, 0, 65572, 3, 0, 65573, 3, 0, 65574, 3, 0, 65575, 3, 0, 65576, 3, 0, 65577, 3, 0, 65578, 3, 0, 65579, 2, 0, 131072, 2, 0, 131073, 3, 0, 131074, 3, 0, 131075, 3, 0, 131076, 3, 0, 131077, 3, 0, 131078, 3, 0, 131079, 3, 0, 131080, 3, 0, 131081, 3, 0, 131082, 3, 0, 131083, 3, 0, 131084, 3, 0, 131085, 3, 0, 131086, 3, 0, 131087, 3, 0, 131088, 3, 0, 131089, 3, 0, 131090, 3, 0, 131091, 3, 0, 131092, 3, 0, 131093, 3, 0, 131094, 3, 0, 131095, 3, 0, 131096, 3, 0, 131097, 3, 0, 131098, 3, 0, 131099, 3, 0, 131100, 3, 0, 131101, 3, 0, 131102, 3, 0, 131103, 3, 0, 131104, 3, 0, 131105, 3, 0, 131106, 3, 0, 131107, 3, 0, 131108, 3, 0, 131109, 3, 0, 131110, 3, 0, 131111, 3, 0, 131112, 3, 0, 131113, 3, 0, 131114, 3, 0, 131115, 2, 0, 196608, 2, 0, 196609, 3, 0, 196610, 3, 0, 196611, 3, 0, 196612, 3, 0, 196613, 3, 0, 196614, 3, 0, 196615, 3, 0, 196616, 3, 0, 196617, 3, 0, 196618, 3, 0, 196619, 2, 0, 196620, 2, 0, 196621, 2, 0, 196622, 3, 0, 196623, 3, 0, 196624, 3, 0, 196625, 3, 0, 196626, 3, 0, 196627, 3, 0, 196628, 3, 0, 196629, 3, 0, 196630, 3, 0, 196631, 3, 0, 196632, 3, 0, 196633, 3, 0, 196634, 3, 0, 196635, 3, 0, 196636, 3, 0, 196637, 3, 0, 196638, 3, 0, 196639, 3, 0, 196640, 3, 0, 196641, 3, 0, 196642, 3, 0, 196643, 3, 0, 196644, 3, 0, 196645, 3, 0, 196646, 3, 0, 196647, 3, 0, 196648, 3, 0, 196649, 3, 0, 196650, 3, 0, 196651, 2, 0, 262144, 2, 0, 262145, 3, 0, 262146, 3, 0, 262147, 3, 0, 262148, 3, 0, 262149, 3, 0, 262150, 3, 0, 262151, 3, 0, 262152, 3, 0, 262153, 3, 0, 262154, 3, 0, 262155, 3, 0, 262156, 3, 0, 262157, 3, 0, 262158, 3, 0, 262159, 3, 0, 262160, 3, 0, 262161, 3, 0, 262162, 3, 0, 262163, 3, 0, 262164, 3, 0, 262165, 3, 0, 262166, 3, 0, 262167, 3, 0, 262168, 3, 0, 262169, 3, 0, 262170, 3, 0, 262171, 3, 0, 262172, 3, 0, 262173, 3, 0, 262174, 3, 0, 262175, 3, 0, 262176, 3, 0, 262177, 3, 0, 262178, 3, 0, 262179, 3, 0, 262180, 3, 0, 262181, 3, 0, 262182, 3, 0, 262183, 3, 0, 262184, 3, 0, 262185, 3, 0, 262186, 3, 0, 262187, 2, 0, 327680, 2, 0, 327681, 3, 0, 327682, 3, 0, 327683, 3, 0, 327684, 3, 0, 327685, 3, 0, 327686, 3, 0, 327687, 2, 0, 327688, 2, 0, 327689, 2, 0, 327690, 3, 0, 327691, 3, 0, 327692, 3, 0, 327693, 3, 0, 327694, 3, 0, 327695, 3, 0, 327696, 3, 0, 327697, 3, 0, 327698, 3, 0, 327699, 3, 0, 327700, 3, 0, 327701, 3, 0, 327702, 3, 0, 327703, 3, 0, 327704, 3, 0, 327705, 3, 0, 327706, 3, 0, 327707, 3, 0, 327708, 3, 0, 327709, 3, 0, 327710, 3, 0, 327711, 3, 0, 327712, 3, 0, 327713, 3, 0, 327714, 3, 0, 327715, 3, 0, 327716, 3, 0, 327717, 3, 0, 327718, 3, 0, 327719, 3, 0, 327720, 3, 0, 327721, 3, 0, 327722, 3, 0, 327723, 2, 0, 393216, 2, 0, 393217, 3, 0, 393218, 3, 0, 393219, 3, 0, 393220, 3, 0, 393221, 3, 0, 393222, 3, 0, 393223, 3, 0, 393224, 3, 0, 393225, 3, 0, 393226, 3, 0, 393227, 3, 0, 393228, 3, 0, 393229, 3, 0, 393230, 3, 0, 393231, 3, 0, 393232, 3, 0, 393233, 3, 0, 393234, 3, 0, 393235, 3, 0, 393236, 3, 0, 393237, 3, 0, 393238, 3, 0, 393239, 3, 0, 393240, 3, 0, 393241, 3, 0, 393242, 3, 0, 393243, 3, 0, 393244, 3, 0, 393245, 3, 0, 393246, 3, 0, 393247, 3, 0, 393248, 3, 0, 393249, 3, 0, 393250, 3, 0, 393251, 3, 0, 393252, 3, 0, 393253, 3, 0, 393254, 3, 0, 393255, 3, 0, 393256, 3, 0, 393257, 3, 0, 393258, 3, 0, 393259, 2, 0, 458752, 2, 0, 458753, 3, 0, 458754, 3, 0, 458755, 3, 0, 458756, 3, 0, 458757, 3, 0, 458758, 3, 0, 458759, 3, 0, 458760, 3, 0, 458761, 3, 0, 458762, 3, 0, 458763, 3, 0, 458764, 3, 0, 458765, 3, 0, 458766, 3, 0, 458767, 3, 0, 458768, 3, 0, 458769, 3, 0, 458770, 3, 0, 458771, 3, 0, 458772, 3, 0, 458773, 3, 0, 458774, 3, 0, 458775, 3, 0, 458776, 3, 0, 458777, 3, 0, 458778, 3, 0, 458779, 3, 0, 458780, 3, 0, 458781, 3, 0, 458782, 3, 0, 458783, 3, 0, 458784, 3, 0, 458785, 3, 0, 458786, 3, 0, 458787, 3, 0, 458788, 3, 0, 458789, 3, 0, 458790, 3, 0, 458791, 3, 0, 458792, 3, 0, 458793, 3, 0, 458794, 3, 0, 458795, 2, 0, 524288, 2, 0, 524289, 1, 0, 524290, 1, 0, 524291, 1, 0, 524292, 1, 0, 524293, 1, 0, 524294, 1, 0, 524295, 1, 0, 524296, 1, 0, 524297, 1, 0, 524298, 1, 0, 524299, 1, 0, 524300, 1, 0, 524301, 1, 0, 524302, 1, 0, 524303, 1, 0, 524304, 1, 0, 524305, 1, 0, 524306, 1, 0, 524307, 1, 0, 524308, 1, 0, 524309, 1, 0, 524310, 1, 0, 524311, 1, 0, 524312, 1, 0, 524313, 1, 0, 524314, 1, 0, 524315, 1, 0, 524316, 1, 0, 524317, 1, 0, 524318, 1, 0, 524319, 1, 0, 524320, 1, 0, 524321, 1, 0, 524322, 1, 0, 524323, 1, 0, 524324, 1, 0, 524325, 1, 0, 524326, 1, 0, 524327, 1, 0, 524328, 1, 0, 524329, 1, 0, 524330, 1, 0, 524331, 2, 0 )

[node name="Fire" parent="TileMap/Obstacles" index="0" instance=ExtResource( 3 )]
position = Vector2( 2016, -416 )

[node name="Start" parent="TileMap" index="4"]
position = Vector2( 96, 512 )

[node name="Goal" parent="TileMap" index="5"]
position = Vector2( 2688, -384 )
