[gd_scene load_steps=4 format=2]

[ext_resource path="res://tiles/simple_tileset.tres" type="TileSet" id=1]
[ext_resource path="res://tools/frog spring/Froggy.tscn" type="PackedScene" id=2]
[ext_resource path="res://levels/Level.tscn" type="PackedScene" id=3]

[node name="Level1" instance=ExtResource( 3 )]
showcase_map = true
showcase_time = 0.01
showcase_delay = 0.0

[node name="TileMap" parent="." index="2"]
tile_set = ExtResource( 1 )
tile_data = PoolIntArray( 0, 2, 0, 1, 2, 0, 2, 2, 0, 3, 2, 0, 4, 2, 0, 5, 2, 0, 6, 2, 0, 7, 2, 0, 8, 2, 0, 9, 2, 0, 10, 2, 0, 11, 2, 0, 12, 2, 0, 13, 2, 0, 14, 2, 0, 15, 2, 0, 16, 2, 0, 17, 2, 0, 18, 2, 0, 19, 2, 0, 65536, 2, 0, 65537, 3, 0, 65538, 3, 0, 65539, 3, 0, 65540, 3, 0, 65541, 3, 0, 65542, 3, 0, 65543, 3, 0, 65544, 3, 0, 65545, 3, 0, 65546, 3, 0, 65547, 3, 0, 65548, 3, 0, 65549, 3, 0, 65550, 3, 0, 65551, 3, 0, 65552, 3, 0, 65553, 3, 0, 65554, 3, 0, 65555, 2, 0, 131072, 2, 0, 131073, 3, 0, 131074, 3, 0, 131075, 3, 0, 131076, 3, 0, 131077, 3, 0, 131078, 3, 0, 131079, 3, 0, 131080, 3, 0, 131081, 3, 0, 131082, 3, 0, 131083, 3, 0, 131084, 3, 0, 131085, 3, 0, 131086, 3, 0, 131087, 3, 0, 131088, 3, 0, 131089, 3, 0, 131090, 3, 0, 131091, 2, 0, 196608, 2, 0, 196609, 3, 0, 196610, 3, 0, 196611, 3, 0, 196612, 3, 0, 196613, 3, 0, 196614, 3, 0, 196615, 3, 0, 196616, 3, 0, 196617, 3, 0, 196618, 3, 0, 196619, 3, 0, 196620, 3, 0, 196621, 3, 0, 196622, 3, 0, 196623, 3, 0, 196624, 3, 0, 196625, 3, 0, 196626, 3, 0, 196627, 2, 0, 262144, 2, 0, 262145, 3, 0, 262146, 3, 0, 262147, 3, 0, 262148, 3, 0, 262149, 3, 0, 262150, 3, 0, 262151, 3, 0, 262152, 3, 0, 262153, 3, 0, 262154, 3, 0, 262155, 3, 0, 262156, 3, 0, 262157, 3, 0, 262158, 3, 0, 262159, 3, 0, 262160, 3, 0, 262161, 3, 0, 262162, 3, 0, 262163, 2, 0, 327680, 2, 0, 327681, 3, 0, 327682, 3, 0, 327683, 3, 0, 327684, 3, 0, 327685, 3, 0, 327686, 3, 0, 327687, 3, 0, 327688, 3, 0, 327689, 3, 0, 327690, 3, 0, 327691, 3, 0, 327692, 3, 0, 327693, 3, 0, 327694, 3, 0, 327695, 3, 0, 327696, 3, 0, 327697, 3, 0, 327698, 3, 0, 327699, 2, 0, 393216, 2, 0, 393217, 3, 0, 393218, 3, 0, 393219, 3, 0, 393220, 3, 0, 393221, 3, 0, 393222, 3, 0, 393223, 3, 0, 393224, 3, 0, 393225, 3, 0, 393226, 3, 0, 393227, 3, 0, 393228, 3, 0, 393229, 3, 0, 393230, 3, 0, 393231, 3, 0, 393232, 3, 0, 393233, 3, 0, 393234, 3, 0, 393235, 2, 0, 458752, 2, 0, 458753, 3, 0, 458754, 3, 0, 458755, 3, 0, 458756, 3, 0, 458757, 3, 0, 458758, 3, 0, 458759, 3, 0, 458760, 3, 0, 458761, 3, 0, 458762, 3, 0, 458763, 3, 0, 458764, 3, 0, 458765, 3, 0, 458766, 3, 0, 458767, 3, 0, 458768, 3, 0, 458769, 3, 0, 458770, 3, 0, 458771, 2, 0, 524288, 2, 0, 524289, 1, 0, 524290, 1, 0, 524291, 1, 0, 524292, 0, 0, 524293, 0, 0, 524294, 1, 0, 524295, 1, 0, 524296, 1, 0, 524297, 1, 0, 524298, 1, 0, 524299, 1, 0, 524300, 1, 0, 524301, 0, 0, 524302, 0, 0, 524303, 1, 0, 524304, 1, 0, 524305, 1, 0, 524306, 1, 0, 524307, 2, 0 )

[node name="Frog" parent="TileMap/Tools" index="0" instance=ExtResource( 2 )]
position = Vector2( 224, 480 )

[node name="Start" parent="TileMap" index="4"]
position = Vector2( 96, 512 )

[node name="Goal" parent="TileMap" index="5"]
position = Vector2( 1152, 512 )

[editable path="TileMap/Start"]

[editable path="TileMap/Goal"]
