[gd_resource type="StyleBoxFlat" format=2]

[resource]
bg_color = Color( 0.105882, 0.541176, 0.235294, 1 )
border_width_left = 5
border_width_top = 5
border_width_right = 5
border_width_bottom = 5
border_color = Color( 0.384314, 0.211765, 0, 1 )
border_blend = true
corner_radius_top_left = 10
corner_radius_top_right = 10
corner_radius_bottom_right = 10
corner_radius_bottom_left = 10
corner_detail = 20
