[gd_scene load_steps=2 format=2]

[ext_resource path="res://obstacles/hazards/KillBox.gd" type="Script" id=1]

[node name="KillBox" type="CollisionShape2D"]
script = ExtResource( 1 )

[node name="Area2D" type="Area2D" parent="."]
collision_layer = 2

[node name="CollisionShape2D" type="CollisionShape2D" parent="Area2D"]
