[gd_scene load_steps=5 format=2]

[ext_resource path="res://tools/Dasher.gd" type="Script" id=1]
[ext_resource path="res://tools/dasher.png" type="Texture" id=2]
[ext_resource path="res://tools/Tool.tscn" type="PackedScene" id=3]

[sub_resource type="RectangleShape2D" id=1]
extents = Vector2( 16.4019, 10 )

[node name="Dasher" instance=ExtResource( 3 )]
script = ExtResource( 1 )

[node name="Sprite" parent="." index="0"]
texture = ExtResource( 2 )

[node name="CollisionShape2D" parent="ActiveArea" index="0"]
shape = SubResource( 1 )
