[gd_scene load_steps=13 format=2]

[ext_resource path="res://tiles/simple_tileset.tres" type="TileSet" id=1]
[ext_resource path="res://levels/Level.tscn" type="PackedScene" id=2]
[ext_resource path="res://tools/frog spring/Froggy.tscn" type="PackedScene" id=3]
[ext_resource path="res://tiles/background/lil bush.png" type="Texture" id=4]
[ext_resource path="res://tiles/background/leaves.png" type="Texture" id=5]
[ext_resource path="res://obstacles/spider/Spider.tscn" type="PackedScene" id=6]
[ext_resource path="res://tiles/background/ferns.png" type="Texture" id=7]
[ext_resource path="res://tiles/background/branch base.png" type="Texture" id=8]
[ext_resource path="res://tiles/background/branch.png" type="Texture" id=9]
[ext_resource path="res://tools/eagle speed/Eagle.tscn" type="PackedScene" id=10]
[ext_resource path="res://tiles/background/branch2usb.png" type="Texture" id=11]
[ext_resource path="res://tiles/background/tree.png" type="Texture" id=12]

[node name="Tutorial" instance=ExtResource( 2 )]
showcase_map = true
showcase_delay = 2.0

[node name="BGTileMap" parent="." index="1"]
tile_set = ExtResource( 1 )
tile_data = PoolIntArray( -196608, 16, 0, -196607, 16, 0, -196606, 16, 0, -196605, 16, 0, -196604, 16, 0, -196603, 16, 0, -196602, 16, 0, -196601, 16, 0, -196600, 16, 0, -196599, 16, 0, -196598, 16, 0, -196597, 16, 0, -196596, 16, 0, -196595, 16, 0, -196594, 16, 0, -196593, 16, 0, -196592, 16, 0, -196591, 16, 0, -196590, 16, 0, -196589, 16, 0, -196588, 16, 0, -196587, 16, 0, -196586, 16, 0, -196585, 16, 0, -196584, 16, 0, -196583, 16, 0, -196582, 16, 0, -196581, 16, 0, -196580, 16, 0, -196579, 16, 0, -196578, 16, 0, -196577, 16, 0, -196576, 16, 0, -196575, 16, 0, -196574, 16, 0, -196573, 16, 0, -131072, 16, 0, -131071, 16, 0, -131070, 16, 0, -131069, 16, 0, -131068, 16, 0, -131067, 16, 0, -131066, 16, 0, -131065, 16, 0, -131064, 16, 0, -131063, 16, 0, -131062, 16, 0, -131061, 16, 0, -131060, 16, 0, -131059, 16, 0, -131058, 16, 0, -131057, 16, 0, -131056, 16, 0, -131055, 16, 0, -131054, 16, 0, -131053, 16, 0, -131052, 16, 0, -131051, 16, 0, -131050, 16, 0, -131049, 16, 0, -131048, 16, 0, -131047, 16, 0, -131046, 16, 0, -131045, 16, 0, -131044, 16, 0, -131043, 16, 0, -131042, 16, 0, -131041, 16, 0, -131040, 16, 0, -131039, 16, 0, -131038, 16, 0, -131037, 16, 0, -65536, 16, 0, -65535, 16, 0, -65534, 16, 0, -65533, 16, 0, -65532, 16, 0, -65531, 16, 0, -65530, 16, 0, -65529, 16, 0, -65528, 16, 0, -65527, 16, 0, -65526, 16, 0, -65525, 16, 0, -65524, 16, 0, -65523, 16, 0, -65522, 16, 0, -65521, 16, 0, -65520, 16, 0, -65519, 16, 0, -65518, 16, 0, -65517, 16, 0, -65516, 16, 0, -65515, 16, 0, -65514, 16, 0, -65513, 16, 0, -65512, 16, 0, -65511, 16, 0, -65510, 16, 0, -65509, 16, 0, -65508, 16, 0, -65507, 16, 0, -65506, 16, 0, -65505, 16, 0, -65504, 16, 0, -65503, 16, 0, -65502, 16, 0, -65501, 16, 0, 0, 16, 0, 1, 16, 0, 2, 16, 0, 3, 16, 0, 4, 16, 0, 5, 16, 0, 6, 16, 0, 7, 16, 0, 8, 16, 0, 9, 16, 0, 10, 16, 0, 11, 16, 0, 12, 16, 0, 13, 16, 0, 14, 16, 0, 15, 16, 0, 16, 16, 0, 17, 16, 0, 18, 16, 0, 19, 16, 0, 20, 16, 0, 21, 16, 0, 22, 16, 0, 23, 16, 0, 24, 16, 0, 25, 16, 0, 26, 16, 0, 27, 16, 0, 28, 16, 0, 29, 16, 0, 30, 16, 0, 31, 16, 0, 32, 16, 0, 33, 16, 0, 34, 16, 0, 35, 16, 0, 65536, 16, 0, 65537, 16, 0, 65538, 16, 0, 65539, 16, 0, 65540, 16, 0, 65541, 16, 0, 65542, 16, 0, 65543, 16, 0, 65544, 16, 0, 65545, 16, 0, 65546, 16, 0, 65547, 16, 0, 65548, 16, 0, 65549, 16, 0, 65550, 16, 0, 65551, 16, 0, 65552, 16, 0, 65553, 16, 0, 65554, 16, 0, 65555, 16, 0, 65556, 16, 0, 65557, 16, 0, 65558, 16, 0, 65559, 16, 0, 65560, 16, 0, 65561, 16, 0, 65562, 16, 0, 65563, 16, 0, 65564, 16, 0, 65565, 16, 0, 65566, 16, 0, 65567, 16, 0, 65568, 16, 0, 65569, 16, 0, 65570, 16, 0, 65571, 16, 0, 131072, 16, 0, 131073, 16, 0, 131074, 16, 0, 131075, 16, 0, 131076, 16, 0, 131077, 16, 0, 131078, 16, 0, 131079, 16, 0, 131080, 16, 0, 131081, 16, 0, 131082, 16, 0, 131083, 16, 0, 131084, 16, 0, 131085, 16, 0, 131086, 16, 0, 131087, 16, 0, 131088, 16, 0, 131089, 16, 0, 131090, 16, 0, 131091, 16, 0, 131092, 16, 0, 131093, 16, 0, 131094, 16, 0, 131095, 16, 0, 131096, 16, 0, 131097, 16, 0, 131098, 16, 0, 131099, 16, 0, 131100, 16, 0, 131101, 16, 0, 131102, 16, 0, 131103, 16, 0, 131104, 16, 0, 131105, 16, 0, 131106, 16, 0, 131107, 16, 0, 196608, 16, 0, 196609, 16, 0, 196610, 16, 0, 196611, 16, 0, 196612, 16, 0, 196613, 16, 0, 196614, 16, 0, 196615, 16, 0, 196616, 16, 0, 196617, 16, 0, 196618, 16, 0, 196619, 16, 0, 196620, 16, 0, 196621, 16, 0, 196622, 16, 0, 196623, 16, 0, 196624, 16, 0, 196625, 16, 0, 196626, 16, 0, 196627, 16, 0, 196628, 16, 0, 196629, 16, 0, 196630, 16, 0, 196631, 16, 0, 196632, 16, 0, 196633, 16, 0, 196634, 16, 0, 196635, 16, 0, 196636, 16, 0, 196637, 16, 0, 196638, 16, 0, 196639, 16, 0, 196640, 16, 0, 196641, 16, 0, 196642, 16, 0, 196643, 16, 0, 262144, 16, 0, 262145, 16, 0, 262146, 16, 0, 262147, 16, 0, 262148, 16, 0, 262149, 16, 0, 262150, 16, 0, 262151, 16, 0, 262152, 16, 0, 262153, 16, 0, 262154, 16, 0, 262155, 16, 0, 262156, 16, 0, 262157, 16, 0, 262158, 16, 0, 262159, 16, 0, 262160, 16, 0, 262161, 16, 0, 262162, 16, 0, 262163, 16, 0, 262164, 16, 0, 262165, 16, 0, 262166, 16, 0, 262167, 16, 0, 262168, 16, 0, 262169, 16, 0, 262170, 16, 0, 262171, 16, 0, 262172, 16, 0, 262173, 16, 0, 262174, 16, 0, 262175, 16, 0, 262176, 16, 0, 262177, 16, 0, 262178, 16, 0, 262179, 16, 0, 327680, 15, 0, 327681, 15, 0, 327682, 15, 0, 327683, 15, 0, 327684, 15, 0, 327685, 15, 0, 327686, 15, 0, 327687, 15, 0, 327688, 15, 0, 327689, 15, 0, 327690, 15, 0, 327691, 15, 0, 327692, 15, 0, 327693, 15, 0, 327694, 15, 0, 327695, 15, 0, 327696, 15, 0, 327697, 15, 0, 327698, 15, 0, 327699, 15, 0, 327700, 15, 0, 327701, 15, 0, 327702, 15, 0, 327703, 15, 0, 327704, 15, 0, 327705, 15, 0, 327706, 15, 0, 327707, 15, 0, 327708, 15, 0, 327709, 15, 0, 327710, 15, 0, 327711, 15, 0, 327712, 15, 0, 327713, 15, 0, 327714, 15, 0, 327715, 15, 0, 393216, 14, 0, 393217, 14, 0, 393218, 14, 0, 393219, 14, 0, 393220, 14, 0, 393221, 14, 0, 393222, 14, 0, 393223, 14, 0, 393224, 14, 0, 393225, 14, 0, 393226, 14, 0, 393227, 14, 0, 393228, 14, 0, 393229, 14, 0, 393230, 14, 0, 393231, 14, 0, 393232, 14, 0, 393233, 14, 0, 393234, 14, 0, 393235, 14, 0, 393236, 14, 0, 393237, 14, 0, 393238, 14, 0, 393239, 14, 0, 393240, 14, 0, 393241, 14, 0, 393242, 14, 0, 393243, 14, 0, 393244, 14, 0, 393245, 14, 0, 393246, 14, 0, 393247, 14, 0, 393248, 14, 0, 393249, 14, 0, 393250, 14, 0, 393251, 14, 0, 458752, 14, 0, 458753, 14, 0, 458754, 14, 0, 458755, 14, 0, 458756, 14, 0, 458757, 14, 0, 458758, 14, 0, 458759, 14, 0, 458760, 14, 0, 458761, 14, 0, 458762, 14, 0, 458763, 14, 0, 458764, 14, 0, 458765, 14, 0, 458766, 14, 0, 458767, 14, 0, 458768, 14, 0, 458769, 14, 0, 458770, 14, 0, 458771, 14, 0, 458772, 14, 0, 458773, 14, 0, 458774, 14, 0, 458775, 14, 0, 458776, 14, 0, 458777, 14, 0, 458778, 14, 0, 458779, 14, 0, 458780, 14, 0, 458781, 14, 0, 458782, 14, 0, 458783, 16, 0, 458784, 16, 0, 458785, 16, 0, 458786, 16, 0, 458787, 16, 0, 524288, 14, 0, 524289, 14, 0, 524290, 14, 0, 524291, 14, 0, 524292, 14, 0, 524293, 14, 0, 524294, 14, 0, 524295, 14, 0, 524296, 14, 0, 524297, 14, 0, 524298, 14, 0, 524299, 14, 0, 524300, 14, 0, 524301, 14, 0, 524302, 14, 0, 524303, 14, 0, 524304, 14, 0, 524305, 14, 0, 524306, 14, 0, 524307, 14, 0, 524308, 14, 0, 524309, 14, 0, 524310, 14, 0, 524311, 14, 0, 524312, 14, 0, 524313, 14, 0, 524314, 14, 0, 524315, 14, 0, 524316, 14, 0, 524317, 14, 0, 524318, 14, 0, 524319, 16, 0, 524320, 16, 0, 524321, 16, 0, 524322, 16, 0, 524323, 16, 0 )

[node name="fern" type="Sprite" parent="BGTileMap" index="0"]
position = Vector2( 305.009, 336.512 )
texture = ExtResource( 7 )

[node name="Sprite2" type="Sprite" parent="BGTileMap" index="1"]
position = Vector2( 1317.41, 14.3197 )
texture = ExtResource( 12 )

[node name="Sprite" type="Sprite" parent="BGTileMap" index="2"]
position = Vector2( 1250.11, 196.179 )
texture = ExtResource( 4 )

[node name="TileMap" parent="." index="2"]
tile_set = ExtResource( 1 )
tile_data = PoolIntArray( -65536, 16, 0, -65535, 16, 0, -65534, 16, 0, -65533, 16, 0, -65532, 16, 0, -65531, 16, 0, -65530, 16, 0, -65529, 16, 0, -65528, 16, 0, -65527, 16, 0, -65526, 16, 0, -65525, 16, 0, -65524, 16, 0, -65523, 16, 0, -65522, 16, 0, -65521, 16, 0, -65520, 16, 0, 262144, 17, 0, 262145, 17, 0, 262146, 17, 0, 262147, 17, 0, 262148, 17, 0, 262149, 17, 0, 262150, 17, 0, 262151, 17, 0, 262152, 17, 0, 262153, 17, 0, 262154, 17, 0, 262155, 17, 0, 262156, 17, 0, 262157, 17, 0, 262158, 17, 0, 262159, 17, 0, 262160, 17, 0, 262161, 17, 0, 262162, 17, 0, 262163, 17, 0, 262164, 17, 0, 262165, 17, 0, 262166, 17, 0, 262167, 17, 0, 262168, 17, 0, 262169, 17, 0, 262170, 17, 0, 262171, 17, 0, 262172, 17, 0, 262173, 17, 0, 262174, 17, 0, 262175, 17, 0, 262176, 17, 0, 262177, 17, 0, 262178, 17, 0, 262179, 17, 0, 393226, 7, 0, 458752, 8, 0, 458753, 5, 0, 458754, 5, 0, 458755, 5, 0, 458756, 5, 0, 458757, 5, 0, 458758, 5, 0, 458759, 5, 0, 458760, 5, 0, 458761, 5, 0, 458762, 5, 0, 458763, 5, 0, 458764, 5, 0, 458765, 5, 0, 458766, 5, 0, 458767, 4, 0, 458771, 8, 0, 458772, 5, 0, 458773, 5, 0, 458774, 5, 0, 458775, 5, 0, 458776, 5, 0, 458777, 5, 0, 458778, 5, 0, 458779, 5, 0, 458780, 5, 0, 458781, 5, 0, 458782, 5, 0, 458783, 5, 0, 458784, 5, 0, 458785, 5, 0, 458786, 5, 0, 458787, 4, 0, 524288, 12, 0, 524289, 12, 0, 524290, 12, 0, 524291, 12, 0, 524292, 12, 0, 524293, 12, 0, 524294, 12, 0, 524295, 12, 0, 524296, 12, 0, 524297, 12, 0, 524298, 12, 0, 524299, 12, 0, 524300, 12, 0, 524301, 12, 0, 524302, 12, 0, 524303, 12, 0, 524304, 5, 0, 524305, 5, 0, 524306, 5, 0, 524307, 12, 0, 524308, 12, 0, 524309, 12, 0, 524310, 12, 0, 524311, 12, 0, 524312, 12, 0, 524313, 12, 0, 524314, 12, 0, 524315, 12, 0, 524316, 12, 0, 524317, 12, 0, 524318, 12, 0, 524319, 12, 0, 524320, 12, 0, 524321, 12, 0, 524322, 12, 0, 524323, 12, 0 )

[node name="TreeLeaves" type="Node" parent="TileMap/Background" index="0"]

[node name="Sprite" type="Sprite" parent="TileMap/Background/TreeLeaves" index="0"]
position = Vector2( 96, -128 )
texture = ExtResource( 5 )

[node name="Sprite2" type="Sprite" parent="TileMap/Background/TreeLeaves" index="1"]
position = Vector2( 288, -128 )
texture = ExtResource( 5 )

[node name="Sprite4" type="Sprite" parent="TileMap/Background/TreeLeaves" index="2"]
position = Vector2( 480, -128 )
texture = ExtResource( 5 )

[node name="Sprite3" type="Sprite" parent="TileMap/Background/TreeLeaves" index="3"]
position = Vector2( 672, -128 )
texture = ExtResource( 5 )

[node name="Sprite8" type="Sprite" parent="TileMap/Background/TreeLeaves" index="4"]
position = Vector2( 864, -128 )
texture = ExtResource( 5 )

[node name="Sprite7" type="Sprite" parent="TileMap/Background/TreeLeaves" index="5"]
position = Vector2( 1056, -128 )
texture = ExtResource( 5 )

[node name="Sprite6" type="Sprite" parent="TileMap/Background/TreeLeaves" index="6"]
position = Vector2( 1248, -128 )
texture = ExtResource( 5 )

[node name="Sprite5" type="Sprite" parent="TileMap/Background/TreeLeaves" index="7"]
position = Vector2( 1440, -128 )
texture = ExtResource( 5 )

[node name="Sprite12" type="Sprite" parent="TileMap/Background/TreeLeaves" index="8"]
position = Vector2( 1632, -128 )
texture = ExtResource( 5 )

[node name="Sprite11" type="Sprite" parent="TileMap/Background/TreeLeaves" index="9"]
position = Vector2( 1824, -128 )
texture = ExtResource( 5 )

[node name="Sprite10" type="Sprite" parent="TileMap/Background/TreeLeaves" index="10"]
position = Vector2( 2016, -128 )
texture = ExtResource( 5 )

[node name="Sprite9" type="Sprite" parent="TileMap/Background/TreeLeaves" index="11"]
position = Vector2( 2208, -128 )
texture = ExtResource( 5 )

[node name="Branch" type="Node" parent="TileMap/Background" index="1"]

[node name="Sprite" type="Sprite" parent="TileMap/Background/Branch" index="0"]
position = Vector2( 1600, 384 )
texture = ExtResource( 8 )

[node name="Sprite2" type="Sprite" parent="TileMap/Background/Branch" index="1"]
position = Vector2( 1652.1, 353.753 )
texture = ExtResource( 9 )

[node name="Sprite3" type="Sprite" parent="TileMap/Background/Branch" index="2"]
position = Vector2( 1537.32, 347.034 )
texture = ExtResource( 11 )
flip_h = true

[node name="Spider" parent="TileMap/Obstacles" index="0" instance=ExtResource( 6 )]
position = Vector2( 1684.15, 352.06 )

[node name="Spider2" parent="TileMap/Obstacles" index="1" instance=ExtResource( 6 )]
position = Vector2( 1537.35, 354.812 )

[node name="Frog" parent="TileMap/Tools" index="0" instance=ExtResource( 3 )]
position = Vector2( 544, 416 )

[node name="Eagle" parent="TileMap/Tools" index="1" instance=ExtResource( 10 )]
position = Vector2( 1437.79, 414.998 )

[node name="Start" parent="TileMap" index="4"]
position = Vector2( 32, 448 )

[node name="Goal" parent="TileMap" index="5"]
position = Vector2( 1920, 448 )

[node name="HBoxContainer" parent="CanvasLayer/UI/Hotbar/Container" index="0"]
margin_left = 594.0
margin_right = 686.0

[node name="Frog" parent="CanvasLayer/UI/Hotbar/Container/HBoxContainer" index="0"]
quantity = 1

[node name="SuperFrog" parent="CanvasLayer/UI/Hotbar/Container/HBoxContainer" index="1"]
visible = false

[node name="Eagle" parent="CanvasLayer/UI/Hotbar/Container/HBoxContainer" index="2"]
visible = false
margin_left = 96.0
margin_right = 188.0

[node name="SuperEagle" parent="CanvasLayer/UI/Hotbar/Container/HBoxContainer" index="3"]
visible = false
margin_left = 96.0
margin_right = 188.0

[node name="Blocker" parent="CanvasLayer/UI/Hotbar/Container/HBoxContainer" index="4"]
visible = false
margin_left = 96.0
margin_right = 188.0

[node name="Umbrella" parent="CanvasLayer/UI/Hotbar/Container/HBoxContainer" index="5"]
visible = false
margin_left = 96.0
margin_right = 188.0

[editable path="CanvasLayer/UI/Hotbar"]
