[gd_scene load_steps=17 format=2]

[ext_resource path="res://tiles/simple_tileset.tres" type="TileSet" id=1]
[ext_resource path="res://levels/Level.tscn" type="PackedScene" id=2]
[ext_resource path="res://obstacles/gopher/Gopher.tscn" type="PackedScene" id=3]
[ext_resource path="res://obstacles/gopher/Exit.tscn" type="PackedScene" id=4]
[ext_resource path="res://obstacles/hazards/Fire.tscn" type="PackedScene" id=5]
[ext_resource path="res://tiles/background/branch.png" type="Texture" id=6]
[ext_resource path="res://tiles/background/branch base.png" type="Texture" id=7]
[ext_resource path="res://obstacles/spider/Spider.tscn" type="PackedScene" id=8]
[ext_resource path="res://obstacles/hazards/Thorns.tscn" type="PackedScene" id=9]
[ext_resource path="res://obstacles/tiger/Tiger.tscn" type="PackedScene" id=10]
[ext_resource path="res://tools/bread/Bread.tscn" type="PackedScene" id=11]
[ext_resource path="res://tiles/background/lil bush.png" type="Texture" id=12]
[ext_resource path="res://tiles/background/branch2usb.png" type="Texture" id=13]
[ext_resource path="res://tiles/background/ferns.png" type="Texture" id=14]
[ext_resource path="res://tiles/background/tree.png" type="Texture" id=15]
[ext_resource path="res://tiles/background/leaves.png" type="Texture" id=16]

[node name="LevelGopher" instance=ExtResource( 2 )]
showcase_map = true
showcase_time = 10.0
showcase_delay = 2.0

[node name="BGTileMap" parent="." index="1"]
tile_set = ExtResource( 1 )
tile_data = PoolIntArray( 0, 16, 0, 1, 16, 0, 2, 16, 0, 3, 16, 0, 4, 16, 0, 5, 16, 0, 6, 16, 0, 7, 16, 0, 8, 16, 0, 9, 16, 0, 10, 16, 0, 11, 16, 0, 12, 16, 0, 13, 16, 0, 14, 16, 0, 15, 16, 0, 16, 16, 0, 17, 16, 0, 18, 16, 0, 19, 16, 0, 20, 16, 0, 21, 16, 0, 22, 16, 0, 23, 16, 0, 24, 16, 0, 25, 16, 0, 26, 16, 0, 27, 16, 0, 28, 16, 0, 29, 16, 0, 30, 16, 0, 31, 16, 0, 32, 16, 0, 33, 16, 0, 34, 16, 0, 35, 16, 0, 36, 16, 0, 37, 16, 0, 38, 16, 0, 39, 16, 0, 40, 16, 0, 41, 16, 0, 42, 16, 0, 43, 16, 0, 44, 16, 0, 45, 16, 0, 46, 16, 0, 47, 16, 0, 48, 16, 0, 49, 16, 0, 50, 16, 0, 51, 16, 0, 52, 16, 0, 53, 16, 0, 54, 16, 0, 55, 16, 0, 56, 16, 0, 57, 16, 0, 58, 16, 0, 59, 16, 0, 60, 16, 0, 61, 16, 0, 62, 16, 0, 63, 16, 0, 64, 16, 0, 65, 16, 0, 66, 16, 0, 67, 16, 0, 68, 16, 0, 69, 16, 0, 70, 16, 0, 71, 16, 0, 72, 16, 0, 73, 16, 0, 74, 16, 0, 75, 16, 0, 76, 16, 0, 77, 16, 0, 78, 16, 0, 79, 16, 0, 80, 16, 0, 81, 16, 0, 82, 16, 0, 83, 16, 0, 84, 16, 0, 85, 16, 0, 86, 16, 0, 87, 16, 0, 88, 16, 0, 89, 16, 0, 90, 16, 0, 91, 16, 0, 92, 16, 0, 65536, 16, 0, 65537, 16, 0, 65538, 16, 0, 65539, 16, 0, 65540, 16, 0, 65541, 16, 0, 65542, 16, 0, 65543, 16, 0, 65544, 16, 0, 65545, 16, 0, 65546, 16, 0, 65547, 16, 0, 65548, 16, 0, 65549, 16, 0, 65550, 16, 0, 65551, 16, 0, 65552, 16, 0, 65553, 16, 0, 65554, 16, 0, 65555, 16, 0, 65556, 16, 0, 65557, 16, 0, 65558, 16, 0, 65559, 16, 0, 65560, 16, 0, 65561, 16, 0, 65562, 16, 0, 65563, 16, 0, 65564, 16, 0, 65565, 16, 0, 65566, 16, 0, 65567, 16, 0, 65568, 16, 0, 65569, 16, 0, 65570, 16, 0, 65571, 16, 0, 65572, 16, 0, 65573, 16, 0, 65574, 16, 0, 65575, 16, 0, 65576, 16, 0, 65577, 16, 0, 65578, 16, 0, 65579, 16, 0, 65580, 16, 0, 65581, 16, 0, 65582, 16, 0, 65583, 16, 0, 65584, 16, 0, 65585, 16, 0, 65586, 16, 0, 65587, 16, 0, 65588, 16, 0, 65589, 16, 0, 65590, 16, 0, 65591, 16, 0, 65592, 16, 0, 65593, 16, 0, 65594, 16, 0, 65595, 16, 0, 65596, 16, 0, 65597, 16, 0, 65598, 16, 0, 65599, 16, 0, 65600, 16, 0, 65601, 16, 0, 65602, 16, 0, 65603, 16, 0, 65604, 16, 0, 65605, 16, 0, 65606, 16, 0, 65607, 16, 0, 65608, 16, 0, 65609, 16, 0, 65610, 16, 0, 65611, 16, 0, 65612, 16, 0, 65613, 16, 0, 65614, 16, 0, 65615, 16, 0, 65616, 16, 0, 65617, 16, 0, 65618, 16, 0, 65619, 16, 0, 65620, 16, 0, 65621, 16, 0, 65622, 16, 0, 65623, 16, 0, 65624, 16, 0, 65625, 16, 0, 65626, 16, 0, 65627, 16, 0, 65628, 16, 0, 131072, 16, 0, 131073, 16, 0, 131074, 16, 0, 131075, 16, 0, 131076, 16, 0, 131077, 16, 0, 131078, 16, 0, 131079, 16, 0, 131080, 16, 0, 131081, 16, 0, 131082, 16, 0, 131083, 16, 0, 131084, 16, 0, 131085, 16, 0, 131086, 16, 0, 131087, 16, 0, 131088, 16, 0, 131089, 16, 0, 131090, 16, 0, 131091, 16, 0, 131092, 16, 0, 131093, 16, 0, 131094, 16, 0, 131095, 16, 0, 131096, 16, 0, 131097, 16, 0, 131098, 16, 0, 131099, 16, 0, 131100, 16, 0, 131101, 16, 0, 131102, 16, 0, 131103, 16, 0, 131104, 16, 0, 131105, 16, 0, 131106, 16, 0, 131107, 16, 0, 131108, 16, 0, 131109, 16, 0, 131110, 16, 0, 131111, 16, 0, 131112, 16, 0, 131113, 16, 0, 131114, 16, 0, 131115, 16, 0, 131116, 16, 0, 131117, 16, 0, 131118, 16, 0, 131119, 16, 0, 131120, 16, 0, 131121, 16, 0, 131122, 16, 0, 131123, 16, 0, 131124, 16, 0, 131125, 16, 0, 131126, 16, 0, 131127, 16, 0, 131128, 16, 0, 131129, 16, 0, 131130, 16, 0, 131131, 16, 0, 131132, 16, 0, 131133, 16, 0, 131134, 16, 0, 131135, 16, 0, 131136, 16, 0, 131137, 16, 0, 131138, 16, 0, 131139, 16, 0, 131140, 16, 0, 131141, 16, 0, 131142, 16, 0, 131143, 16, 0, 131144, 16, 0, 131145, 16, 0, 131146, 16, 0, 131147, 16, 0, 131148, 16, 0, 131149, 16, 0, 131150, 16, 0, 131151, 16, 0, 131152, 16, 0, 131153, 16, 0, 131154, 16, 0, 131155, 16, 0, 131156, 16, 0, 131157, 16, 0, 131158, 16, 0, 131159, 16, 0, 131160, 16, 0, 131161, 16, 0, 131162, 16, 0, 131163, 16, 0, 131164, 16, 0, 196608, 16, 0, 196609, 16, 0, 196610, 16, 0, 196611, 16, 0, 196612, 16, 0, 196613, 16, 0, 196614, 16, 0, 196615, 16, 0, 196616, 16, 0, 196617, 16, 0, 196618, 16, 0, 196619, 16, 0, 196620, 16, 0, 196621, 16, 0, 196622, 16, 0, 196623, 16, 0, 196624, 16, 0, 196625, 16, 0, 196626, 16, 0, 196627, 16, 0, 196628, 16, 0, 196629, 16, 0, 196630, 16, 0, 196631, 16, 0, 196632, 16, 0, 196633, 16, 0, 196634, 16, 0, 196635, 16, 0, 196636, 16, 0, 196637, 16, 0, 196638, 16, 0, 196639, 16, 0, 196640, 16, 0, 196641, 16, 0, 196642, 16, 0, 196643, 16, 0, 196644, 16, 0, 196645, 16, 0, 196646, 16, 0, 196647, 16, 0, 196648, 16, 0, 196649, 16, 0, 196650, 16, 0, 196651, 16, 0, 196652, 16, 0, 196653, 16, 0, 196654, 16, 0, 196655, 16, 0, 196656, 16, 0, 196657, 16, 0, 196658, 16, 0, 196659, 16, 0, 196660, 16, 0, 196661, 16, 0, 196662, 16, 0, 196663, 16, 0, 196664, 16, 0, 196665, 16, 0, 196666, 16, 0, 196667, 16, 0, 196668, 16, 0, 196669, 16, 0, 196670, 16, 0, 196671, 16, 0, 196672, 16, 0, 196673, 16, 0, 196674, 16, 0, 196675, 16, 0, 196676, 16, 0, 196677, 16, 0, 196678, 16, 0, 196679, 16, 0, 196680, 16, 0, 196681, 16, 0, 196682, 16, 0, 196683, 16, 0, 196684, 16, 0, 196685, 16, 0, 196686, 16, 0, 196687, 16, 0, 196688, 16, 0, 196689, 16, 0, 196690, 16, 0, 196691, 16, 0, 196692, 16, 0, 196693, 16, 0, 196694, 16, 0, 196695, 16, 0, 196696, 16, 0, 196697, 16, 0, 196698, 16, 0, 196699, 16, 0, 196700, 16, 0, 262144, 16, 0, 262145, 16, 0, 262146, 16, 0, 262147, 16, 0, 262148, 16, 0, 262149, 16, 0, 262150, 16, 0, 262151, 16, 0, 262152, 16, 0, 262153, 16, 0, 262154, 16, 0, 262155, 16, 0, 262156, 16, 0, 262157, 16, 0, 262158, 16, 0, 262159, 16, 0, 262160, 16, 0, 262161, 16, 0, 262162, 16, 0, 262163, 16, 0, 262164, 16, 0, 262165, 16, 0, 262166, 16, 0, 262167, 16, 0, 262168, 16, 0, 262169, 16, 0, 262170, 16, 0, 262171, 16, 0, 262172, 16, 0, 262173, 16, 0, 262174, 16, 0, 262175, 16, 0, 262176, 16, 0, 262177, 16, 0, 262178, 16, 0, 262179, 16, 0, 262180, 16, 0, 262181, 16, 0, 262182, 16, 0, 262183, 16, 0, 262184, 16, 0, 262185, 16, 0, 262186, 16, 0, 262187, 16, 0, 262188, 16, 0, 262189, 16, 0, 262190, 16, 0, 262191, 16, 0, 262192, 16, 0, 262193, 16, 0, 262194, 16, 0, 262195, 16, 0, 262196, 16, 0, 262197, 16, 0, 262198, 16, 0, 262199, 16, 0, 262200, 16, 0, 262201, 16, 0, 262202, 16, 0, 262203, 16, 0, 262204, 16, 0, 262205, 16, 0, 262206, 16, 0, 262207, 16, 0, 262208, 16, 0, 262209, 16, 0, 262210, 16, 0, 262211, 16, 0, 262212, 16, 0, 262213, 16, 0, 262214, 16, 0, 262215, 16, 0, 262216, 16, 0, 262217, 16, 0, 262218, 16, 0, 262219, 16, 0, 262220, 16, 0, 262221, 16, 0, 262222, 16, 0, 262223, 16, 0, 262224, 16, 0, 262225, 16, 0, 262226, 16, 0, 262227, 16, 0, 262228, 16, 0, 262229, 16, 0, 262230, 16, 0, 262231, 16, 0, 262232, 16, 0, 262233, 16, 0, 262234, 16, 0, 262235, 16, 0, 262236, 16, 0, 327680, 16, 0, 327681, 16, 0, 327682, 16, 0, 327683, 16, 0, 327684, 16, 0, 327685, 16, 0, 327686, 16, 0, 327687, 16, 0, 327688, 16, 0, 327689, 16, 0, 327690, 16, 0, 327691, 16, 0, 327692, 16, 0, 327693, 16, 0, 327694, 16, 0, 327695, 16, 0, 327696, 16, 0, 327697, 16, 0, 327698, 16, 0, 327699, 16, 0, 327700, 16, 0, 327701, 16, 0, 327702, 16, 0, 327703, 16, 0, 327704, 16, 0, 327705, 16, 0, 327706, 16, 0, 327707, 16, 0, 327708, 16, 0, 327709, 16, 0, 327710, 16, 0, 327711, 16, 0, 327712, 16, 0, 327713, 16, 0, 327714, 16, 0, 327715, 16, 0, 327716, 16, 0, 327717, 16, 0, 327718, 16, 0, 327719, 16, 0, 327720, 16, 0, 327721, 16, 0, 327722, 16, 0, 327723, 16, 0, 327724, 16, 0, 327725, 16, 0, 327726, 16, 0, 327727, 16, 0, 327728, 16, 0, 327729, 16, 0, 327730, 16, 0, 327731, 16, 0, 327732, 16, 0, 327733, 16, 0, 327734, 16, 0, 327735, 16, 0, 327736, 16, 0, 327737, 16, 0, 327738, 16, 0, 327739, 16, 0, 327740, 16, 0, 327741, 16, 0, 327742, 16, 0, 327743, 16, 0, 327744, 16, 0, 327745, 16, 0, 327746, 16, 0, 327747, 16, 0, 327748, 16, 0, 327749, 16, 0, 327750, 16, 0, 327751, 16, 0, 327752, 16, 0, 327753, 16, 0, 327754, 16, 0, 327755, 16, 0, 327756, 16, 0, 327757, 16, 0, 327758, 16, 0, 327759, 16, 0, 327760, 16, 0, 327761, 16, 0, 327762, 16, 0, 327763, 16, 0, 327764, 16, 0, 327765, 16, 0, 327766, 16, 0, 327767, 16, 0, 327768, 16, 0, 327769, 16, 0, 327770, 16, 0, 327771, 16, 0, 327772, 16, 0, 393216, 16, 0, 393217, 16, 0, 393218, 16, 0, 393219, 16, 0, 393220, 16, 0, 393221, 16, 0, 393222, 16, 0, 393223, 16, 0, 393224, 16, 0, 393225, 16, 0, 393226, 16, 0, 393227, 16, 0, 393228, 16, 0, 393229, 16, 0, 393230, 16, 0, 393231, 16, 0, 393232, 16, 0, 393233, 16, 0, 393234, 16, 0, 393235, 16, 0, 393236, 16, 0, 393237, 16, 0, 393238, 16, 0, 393239, 16, 0, 393240, 16, 0, 393241, 16, 0, 393242, 16, 0, 393243, 16, 0, 393244, 16, 0, 393245, 16, 0, 393246, 16, 0, 393247, 16, 0, 393248, 16, 0, 393249, 16, 0, 393250, 16, 0, 393251, 16, 0, 393252, 16, 0, 393253, 16, 0, 393254, 16, 0, 393255, 16, 0, 393256, 16, 0, 393257, 16, 0, 393258, 16, 0, 393259, 16, 0, 393260, 16, 0, 393261, 16, 0, 393262, 16, 0, 393263, 16, 0, 393264, 16, 0, 393265, 16, 0, 393266, 16, 0, 393267, 16, 0, 393268, 16, 0, 393269, 16, 0, 393270, 16, 0, 393271, 16, 0, 393272, 16, 0, 393273, 16, 0, 393274, 16, 0, 393275, 16, 0, 393276, 16, 0, 393277, 16, 0, 393278, 16, 0, 393279, 16, 0, 393280, 16, 0, 393281, 16, 0, 393282, 16, 0, 393283, 16, 0, 393284, 16, 0, 393285, 16, 0, 393286, 16, 0, 393287, 16, 0, 393288, 16, 0, 393289, 16, 0, 393290, 16, 0, 393291, 16, 0, 393292, 16, 0, 393293, 16, 0, 393294, 16, 0, 393295, 16, 0, 393296, 16, 0, 393297, 16, 0, 393298, 16, 0, 393299, 16, 0, 393300, 16, 0, 393301, 16, 0, 393302, 16, 0, 393303, 16, 0, 393304, 16, 0, 393305, 16, 0, 393306, 16, 0, 393307, 16, 0, 393308, 16, 0, 458752, 16, 0, 458753, 16, 0, 458754, 16, 0, 458755, 16, 0, 458756, 16, 0, 458757, 16, 0, 458758, 16, 0, 458759, 16, 0, 458760, 16, 0, 458761, 16, 0, 458762, 16, 0, 458763, 16, 0, 458764, 16, 0, 458765, 16, 0, 458766, 16, 0, 458767, 16, 0, 458768, 16, 0, 458769, 16, 0, 458770, 16, 0, 458771, 16, 0, 458772, 16, 0, 458773, 16, 0, 458774, 16, 0, 458775, 16, 0, 458776, 16, 0, 458777, 16, 0, 458778, 16, 0, 458779, 16, 0, 458780, 16, 0, 458781, 16, 0, 458782, 16, 0, 458783, 16, 0, 458784, 16, 0, 458785, 16, 0, 458786, 16, 0, 458787, 16, 0, 458788, 16, 0, 458789, 16, 0, 458790, 16, 0, 458791, 16, 0, 458792, 16, 0, 458793, 16, 0, 458794, 16, 0, 458795, 16, 0, 458796, 16, 0, 458797, 16, 0, 458798, 16, 0, 458799, 16, 0, 458800, 16, 0, 458801, 16, 0, 458802, 16, 0, 458803, 16, 0, 458804, 16, 0, 458805, 16, 0, 458806, 16, 0, 458807, 16, 0, 458808, 16, 0, 458809, 16, 0, 458810, 16, 0, 458811, 16, 0, 458812, 16, 0, 458813, 16, 0, 458814, 16, 0, 458815, 16, 0, 458816, 16, 0, 458817, 16, 0, 458818, 16, 0, 458819, 16, 0, 458820, 16, 0, 458821, 16, 0, 458822, 16, 0, 458823, 16, 0, 458824, 16, 0, 458825, 16, 0, 458826, 16, 0, 458827, 16, 0, 458828, 16, 0, 458829, 16, 0, 458830, 16, 0, 458831, 16, 0, 458832, 16, 0, 458833, 16, 0, 458834, 16, 0, 458835, 16, 0, 458836, 16, 0, 458837, 16, 0, 458838, 16, 0, 458839, 16, 0, 458840, 16, 0, 458841, 16, 0, 458842, 16, 0, 458843, 16, 0, 458844, 16, 0, 524288, 16, 0, 524289, 16, 0, 524290, 16, 0, 524291, 16, 0, 524292, 16, 0, 524293, 16, 0, 524294, 16, 0, 524295, 16, 0, 524296, 16, 0, 524297, 16, 0, 524298, 16, 0, 524299, 16, 0, 524300, 16, 0, 524301, 16, 0, 524302, 16, 0, 524303, 16, 0, 524304, 16, 0, 524305, 16, 0, 524306, 16, 0, 524307, 16, 0, 524308, 16, 0, 524309, 16, 0, 524310, 16, 0, 524311, 16, 0, 524312, 16, 0, 524313, 16, 0, 524314, 16, 0, 524315, 16, 0, 524316, 16, 0, 524317, 16, 0, 524318, 16, 0, 524319, 16, 0, 524320, 16, 0, 524321, 16, 0, 524322, 16, 0, 524323, 16, 0, 524324, 16, 0, 524325, 16, 0, 524326, 16, 0, 524327, 16, 0, 524328, 16, 0, 524329, 16, 0, 524330, 16, 0, 524331, 16, 0, 524332, 16, 0, 524333, 16, 0, 524334, 16, 0, 524335, 16, 0, 524336, 16, 0, 524337, 16, 0, 524338, 16, 0, 524339, 16, 0, 524340, 16, 0, 524341, 16, 0, 524342, 16, 0, 524343, 16, 0, 524344, 16, 0, 524345, 16, 0, 524346, 16, 0, 524347, 16, 0, 524348, 16, 0, 524349, 16, 0, 524350, 16, 0, 524351, 16, 0, 524352, 16, 0, 524353, 16, 0, 524354, 16, 0, 524355, 16, 0, 524356, 16, 0, 524357, 16, 0, 524358, 16, 0, 524359, 16, 0, 524360, 16, 0, 524361, 16, 0, 524362, 16, 0, 524363, 16, 0, 524364, 16, 0, 524365, 16, 0, 524366, 16, 0, 524367, 16, 0, 524368, 16, 0, 524369, 16, 0, 524370, 16, 0, 524371, 16, 0, 524372, 16, 0, 524373, 16, 0, 524374, 16, 0, 524375, 16, 0, 524376, 16, 0, 524377, 16, 0, 524378, 16, 0, 524379, 16, 0, 524380, 16, 0, 589824, 16, 0, 589825, 16, 0, 589826, 16, 0, 589827, 16, 0, 589828, 16, 0, 589829, 16, 0, 589830, 16, 0, 589831, 16, 0, 589832, 16, 0, 589833, 16, 0, 589834, 16, 0, 589835, 16, 0, 589836, 16, 0, 589837, 16, 0, 589838, 16, 0, 589839, 16, 0, 589840, 16, 0, 589841, 16, 0, 589842, 16, 0, 589843, 16, 0, 589844, 16, 0, 589845, 16, 0, 589846, 16, 0, 589847, 16, 0, 589848, 16, 0, 589849, 16, 0, 589850, 16, 0, 589851, 16, 0, 589852, 16, 0, 589853, 16, 0, 589854, 16, 0, 589855, 16, 0, 589856, 16, 0, 589857, 16, 0, 589858, 16, 0, 589859, 16, 0, 589860, 16, 0, 589861, 16, 0, 589862, 16, 0, 589863, 16, 0, 589864, 16, 0, 589865, 16, 0, 589866, 16, 0, 589867, 16, 0, 589868, 16, 0, 589869, 16, 0, 589870, 16, 0, 589871, 16, 0, 589872, 16, 0, 589873, 16, 0, 589874, 16, 0, 589875, 16, 0, 589876, 16, 0, 589877, 16, 0, 589878, 16, 0, 589879, 16, 0, 589880, 16, 0, 589881, 16, 0, 589882, 16, 0, 589883, 16, 0, 589884, 16, 0, 589885, 16, 0, 589886, 16, 0, 589887, 16, 0, 589888, 16, 0, 589889, 16, 0, 589890, 16, 0, 589891, 16, 0, 589892, 16, 0, 589893, 16, 0, 589894, 16, 0, 589895, 16, 0, 589896, 16, 0, 589897, 16, 0, 589898, 16, 0, 589899, 16, 0, 589900, 16, 0, 589901, 16, 0, 589902, 16, 0, 589903, 16, 0, 589904, 16, 0, 589905, 16, 0, 589906, 16, 0, 589907, 16, 0, 589908, 16, 0, 589909, 16, 0, 589910, 16, 0, 589911, 16, 0, 589912, 16, 0, 589913, 16, 0, 589914, 16, 0, 589915, 16, 0, 589916, 16, 0, 655360, 16, 0, 655361, 16, 0, 655362, 16, 0, 655363, 16, 0, 655364, 16, 0, 655365, 16, 0, 655366, 16, 0, 655367, 16, 0, 655368, 16, 0, 655369, 16, 0, 655370, 16, 0, 655371, 16, 0, 655372, 16, 0, 655373, 16, 0, 655374, 16, 0, 655375, 16, 0, 655376, 16, 0, 655377, 16, 0, 655378, 16, 0, 655379, 16, 0, 655380, 16, 0, 655381, 16, 0, 655382, 16, 0, 655383, 16, 0, 655384, 16, 0, 655385, 16, 0, 655386, 16, 0, 655387, 16, 0, 655388, 16, 0, 655389, 16, 0, 655390, 16, 0, 655391, 16, 0, 655392, 16, 0, 655393, 16, 0, 655394, 16, 0, 655395, 16, 0, 655396, 16, 0, 655397, 16, 0, 655398, 16, 0, 655399, 16, 0, 655400, 16, 0, 655401, 16, 0, 655402, 16, 0, 655403, 15, 0, 655404, 15, 0, 655405, 15, 0, 655406, 15, 0, 655407, 15, 0, 655408, 15, 0, 655409, 15, 0, 655410, 15, 0, 655411, 15, 0, 655412, 15, 0, 655413, 15, 0, 655414, 15, 0, 655415, 15, 0, 655416, 15, 0, 655417, 15, 0, 655418, 15, 0, 655419, 15, 0, 655420, 15, 0, 655421, 15, 0, 655422, 15, 0, 655423, 15, 0, 655424, 15, 0, 655425, 15, 0, 655426, 15, 0, 655427, 15, 0, 655428, 15, 0, 655429, 15, 0, 655430, 15, 0, 655431, 15, 0, 655432, 15, 0, 655433, 15, 0, 655434, 15, 0, 655435, 16, 0, 655436, 16, 0, 655437, 16, 0, 655438, 16, 0, 655439, 16, 0, 655440, 16, 0, 655441, 16, 0, 655442, 16, 0, 655443, 16, 0, 655444, 16, 0, 655445, 16, 0, 655446, 16, 0, 655447, 16, 0, 655448, 16, 0, 655449, 16, 0, 655450, 16, 0, 655451, 16, 0, 655452, 16, 0, 720896, 16, 0, 720897, 16, 0, 720898, 16, 0, 720899, 16, 0, 720900, 16, 0, 720901, 16, 0, 720902, 16, 0, 720903, 16, 0, 720904, 16, 0, 720905, 16, 0, 720906, 16, 0, 720907, 16, 0, 720908, 16, 0, 720909, 16, 0, 720910, 16, 0, 720911, 16, 0, 720912, 16, 0, 720913, 16, 0, 720914, 16, 0, 720915, 16, 0, 720916, 16, 0, 720917, 16, 0, 720918, 16, 0, 720919, 16, 0, 720920, 16, 0, 720921, 16, 0, 720922, 16, 0, 720923, 16, 0, 720924, 16, 0, 720925, 16, 0, 720926, 16, 0, 720927, 16, 0, 720928, 16, 0, 720929, 16, 0, 720930, 16, 0, 720931, 16, 0, 720932, 16, 0, 720933, 16, 0, 720934, 16, 0, 720935, 16, 0, 720936, 16, 0, 720937, 16, 0, 720938, 16, 0, 720939, 15, 0, 720940, 15, 0, 720941, 15, 0, 720942, 15, 0, 720943, 15, 0, 720944, 15, 0, 720945, 15, 0, 720946, 15, 0, 720947, 15, 0, 720948, 15, 0, 720949, 15, 0, 720950, 15, 0, 720951, 15, 0, 720952, 15, 0, 720953, 15, 0, 720954, 15, 0, 720955, 15, 0, 720956, 15, 0, 720957, 15, 0, 720958, 15, 0, 720959, 15, 0, 720960, 15, 0, 720961, 15, 0, 720962, 15, 0, 720963, 15, 0, 720964, 15, 0, 720965, 15, 0, 720966, 15, 0, 720967, 15, 0, 720968, 15, 0, 720969, 15, 0, 720970, 15, 0, 720971, 16, 0, 720972, 16, 0, 720973, 16, 0, 720974, 16, 0, 720975, 16, 0, 720976, 16, 0, 720977, 16, 0, 720978, 16, 0, 720979, 16, 0, 720980, 16, 0, 720981, 16, 0, 720982, 16, 0, 720983, 16, 0, 720984, 16, 0, 720985, 16, 0, 720986, 16, 0, 720987, 16, 0, 720988, 16, 0, 786432, 16, 0, 786433, 16, 0, 786434, 16, 0, 786435, 16, 0, 786436, 16, 0, 786437, 16, 0, 786438, 16, 0, 786439, 16, 0, 786440, 16, 0, 786441, 16, 0, 786442, 16, 0, 786443, 16, 0, 786444, 16, 0, 786445, 16, 0, 786446, 16, 0, 786447, 16, 0, 786448, 16, 0, 786449, 16, 0, 786450, 16, 0, 786451, 16, 0, 786452, 16, 0, 786453, 16, 0, 786454, 16, 0, 786455, 16, 0, 786456, 16, 0, 786457, 16, 0, 786458, 16, 0, 786459, 16, 0, 786460, 16, 0, 786461, 16, 0, 786462, 16, 0, 786463, 16, 0, 786464, 16, 0, 786465, 16, 0, 786466, 16, 0, 786467, 16, 0, 786468, 16, 0, 786469, 16, 0, 786470, 16, 0, 786471, 16, 0, 786472, 16, 0, 786473, 16, 0, 786474, 16, 0, 786475, 15, 0, 786476, 15, 0, 786477, 15, 0, 786478, 15, 0, 786479, 15, 0, 786480, 15, 0, 786481, 15, 0, 786482, 15, 0, 786483, 15, 0, 786484, 15, 0, 786485, 15, 0, 786486, 15, 0, 786487, 15, 0, 786488, 15, 0, 786489, 15, 0, 786490, 15, 0, 786491, 15, 0, 786492, 15, 0, 786493, 15, 0, 786494, 15, 0, 786495, 15, 0, 786496, 15, 0, 786497, 15, 0, 786498, 15, 0, 786499, 15, 0, 786500, 15, 0, 786501, 15, 0, 786502, 15, 0, 786503, 15, 0, 786504, 15, 0, 786505, 15, 0, 786506, 15, 0, 786507, 16, 0, 786508, 16, 0, 786509, 16, 0, 786510, 16, 0, 786511, 16, 0, 786512, 16, 0, 786513, 16, 0, 786514, 16, 0, 786515, 16, 0, 786516, 16, 0, 786517, 16, 0, 786518, 16, 0, 786519, 16, 0, 786520, 16, 0, 786521, 16, 0, 786522, 16, 0, 786523, 16, 0, 786524, 16, 0, 851968, 16, 0, 851969, 16, 0, 851970, 16, 0, 851971, 16, 0, 851972, 16, 0, 851973, 16, 0, 851974, 16, 0, 851975, 16, 0, 851976, 16, 0, 851977, 16, 0, 851978, 16, 0, 851979, 16, 0, 851980, 16, 0, 851981, 16, 0, 851982, 16, 0, 851983, 16, 0, 851984, 16, 0, 851985, 16, 0, 851986, 16, 0, 851987, 16, 0, 851988, 16, 0, 851989, 16, 0, 851990, 16, 0, 851991, 16, 0, 851992, 16, 0, 851993, 16, 0, 851994, 16, 0, 851995, 16, 0, 851996, 16, 0, 851997, 16, 0, 851998, 16, 0, 851999, 16, 0, 852000, 16, 0, 852001, 16, 0, 852002, 16, 0, 852003, 16, 0, 852004, 16, 0, 852005, 16, 0, 852006, 16, 0, 852007, 16, 0, 852008, 16, 0, 852009, 16, 0, 852010, 16, 0, 852011, 15, 0, 852012, 15, 0, 852013, 15, 0, 852014, 15, 0, 852015, 15, 0, 852016, 15, 0, 852017, 15, 0, 852018, 15, 0, 852019, 15, 0, 852020, 15, 0, 852021, 15, 0, 852022, 15, 0, 852023, 15, 0, 852024, 15, 0, 852025, 15, 0, 852026, 15, 0, 852027, 15, 0, 852028, 15, 0, 852029, 15, 0, 852030, 15, 0, 852031, 15, 0, 852032, 15, 0, 852033, 15, 0, 852034, 15, 0, 852035, 15, 0, 852036, 15, 0, 852037, 15, 0, 852038, 15, 0, 852039, 15, 0, 852040, 15, 0, 852041, 15, 0, 852042, 15, 0, 852043, 16, 0, 852044, 16, 0, 852045, 16, 0, 852046, 16, 0, 852047, 16, 0, 852048, 16, 0, 852049, 16, 0, 852050, 16, 0, 852051, 16, 0, 852052, 16, 0, 852053, 16, 0, 852054, 16, 0, 852055, 16, 0, 852056, 16, 0, 852057, 16, 0, 852058, 16, 0, 852059, 16, 0, 852060, 16, 0, 917504, 16, 0, 917505, 16, 0, 917506, 16, 0, 917507, 16, 0, 917508, 16, 0, 917509, 16, 0, 917510, 16, 0, 917511, 16, 0, 917512, 16, 0, 917513, 16, 0, 917514, 16, 0, 917515, 16, 0, 917516, 16, 0, 917517, 16, 0, 917518, 16, 0, 917519, 16, 0, 917520, 16, 0, 917521, 16, 0, 917522, 16, 0, 917523, 16, 0, 917524, 16, 0, 917525, 16, 0, 917526, 16, 0, 917527, 16, 0, 917528, 16, 0, 917529, 16, 0, 917530, 16, 0, 917531, 16, 0, 917532, 16, 0, 917533, 16, 0, 917534, 16, 0, 917535, 16, 0, 917536, 16, 0, 917537, 16, 0, 917538, 16, 0, 917539, 16, 0, 917540, 16, 0, 917541, 16, 0, 917542, 16, 0, 917543, 16, 0, 917544, 16, 0, 917545, 16, 0, 917546, 16, 0, 917547, 15, 0, 917548, 15, 0, 917549, 15, 0, 917550, 15, 0, 917551, 15, 0, 917552, 15, 0, 917553, 15, 0, 917554, 15, 0, 917555, 15, 0, 917556, 15, 0, 917557, 15, 0, 917558, 15, 0, 917559, 15, 0, 917560, 15, 0, 917561, 15, 0, 917562, 15, 0, 917563, 15, 0, 917564, 15, 0, 917565, 15, 0, 917566, 15, 0, 917567, 15, 0, 917568, 15, 0, 917569, 15, 0, 917570, 15, 0, 917571, 15, 0, 917572, 15, 0, 917573, 15, 0, 917574, 15, 0, 917575, 15, 0, 917576, 15, 0, 917577, 15, 0, 917578, 15, 0, 917579, 16, 0, 917580, 16, 0, 917581, 16, 0, 917582, 16, 0, 917583, 16, 0, 917584, 16, 0, 917585, 16, 0, 917586, 16, 0, 917587, 16, 0, 917588, 16, 0, 917589, 16, 0, 917590, 16, 0, 917591, 16, 0, 917592, 16, 0, 917593, 16, 0, 917594, 16, 0, 917595, 16, 0, 917596, 16, 0, 983040, 16, 0, 983041, 16, 0, 983042, 16, 0, 983043, 16, 0, 983044, 16, 0, 983045, 16, 0, 983046, 16, 0, 983047, 16, 0, 983048, 16, 0, 983049, 16, 0, 983050, 16, 0, 983051, 16, 0, 983052, 16, 0, 983053, 16, 0, 983054, 16, 0, 983055, 16, 0, 983056, 16, 0, 983057, 16, 0, 983058, 16, 0, 983059, 16, 0, 983060, 16, 0, 983061, 16, 0, 983062, 16, 0, 983063, 16, 0, 983064, 16, 0, 983065, 16, 0, 983066, 16, 0, 983067, 16, 0, 983068, 16, 0, 983069, 16, 0, 983070, 16, 0, 983071, 16, 0, 983072, 16, 0, 983073, 16, 0, 983074, 16, 0, 983075, 16, 0, 983076, 16, 0, 983077, 16, 0, 983078, 16, 0, 983079, 16, 0, 983080, 16, 0, 983081, 16, 0, 983082, 16, 0, 983083, 15, 0, 983084, 15, 0, 983085, 15, 0, 983086, 15, 0, 983087, 15, 0, 983088, 15, 0, 983089, 15, 0, 983090, 15, 0, 983091, 15, 0, 983092, 15, 0, 983093, 15, 0, 983094, 15, 0, 983095, 15, 0, 983096, 15, 0, 983097, 15, 0, 983098, 15, 0, 983099, 15, 0, 983100, 15, 0, 983101, 15, 0, 983102, 15, 0, 983103, 15, 0, 983104, 15, 0, 983105, 15, 0, 983106, 15, 0, 983107, 15, 0, 983108, 15, 0, 983109, 15, 0, 983110, 15, 0, 983111, 15, 0, 983112, 15, 0, 983113, 15, 0, 983114, 15, 0, 983115, 16, 0, 983116, 16, 0, 983117, 16, 0, 983118, 16, 0, 983119, 16, 0, 983120, 16, 0, 983121, 16, 0, 983122, 16, 0, 983123, 16, 0, 983124, 16, 0, 983125, 16, 0, 983126, 16, 0, 983127, 16, 0, 983128, 16, 0, 983129, 16, 0, 983130, 16, 0, 983131, 16, 0, 983132, 16, 0, 1048576, 16, 0, 1048577, 16, 0, 1048578, 16, 0, 1048579, 16, 0, 1048580, 16, 0, 1048581, 16, 0, 1048582, 16, 0, 1048583, 16, 0, 1048584, 16, 0, 1048585, 16, 0, 1048586, 16, 0, 1048587, 16, 0, 1048588, 16, 0, 1048589, 16, 0, 1048590, 16, 0, 1048591, 16, 0, 1048592, 16, 0, 1048593, 16, 0, 1048594, 16, 0, 1048595, 16, 0, 1048596, 16, 0, 1048597, 16, 0, 1048598, 16, 0, 1048599, 16, 0, 1048600, 16, 0, 1048601, 16, 0, 1048602, 16, 0, 1048603, 16, 0, 1048604, 16, 0, 1048605, 16, 0, 1048606, 16, 0, 1048607, 16, 0, 1048608, 16, 0, 1048609, 16, 0, 1048610, 16, 0, 1048611, 16, 0, 1048612, 16, 0, 1048613, 16, 0, 1048614, 16, 0, 1048615, 16, 0, 1048616, 16, 0, 1048617, 16, 0, 1048618, 16, 0, 1048619, 15, 0, 1048620, 15, 0, 1048621, 15, 0, 1048622, 15, 0, 1048623, 15, 0, 1048624, 15, 0, 1048625, 15, 0, 1048626, 15, 0, 1048627, 15, 0, 1048628, 15, 0, 1048629, 15, 0, 1048630, 15, 0, 1048631, 15, 0, 1048632, 15, 0, 1048633, 15, 0, 1048634, 15, 0, 1048635, 15, 0, 1048636, 15, 0, 1048637, 15, 0, 1048638, 15, 0, 1048639, 15, 0, 1048640, 15, 0, 1048641, 15, 0, 1048642, 15, 0, 1048643, 15, 0, 1048644, 15, 0, 1048645, 15, 0, 1048646, 15, 0, 1048647, 15, 0, 1048648, 15, 0, 1048649, 15, 0, 1048650, 15, 0, 1048651, 16, 0, 1048652, 16, 0, 1048653, 16, 0, 1048654, 16, 0, 1048655, 16, 0, 1048656, 16, 0, 1048657, 16, 0, 1048658, 16, 0, 1048659, 16, 0, 1048660, 16, 0, 1048661, 16, 0, 1048662, 16, 0, 1048663, 16, 0, 1048664, 16, 0, 1048665, 16, 0, 1048666, 16, 0, 1048667, 16, 0, 1048668, 16, 0, 1114112, 16, 0, 1114113, 16, 0, 1114114, 16, 0, 1114115, 16, 0, 1114116, 16, 0, 1114117, 16, 0, 1114118, 16, 0, 1114119, 16, 0, 1114120, 16, 0, 1114121, 16, 0, 1114122, 16, 0, 1114123, 16, 0, 1114124, 16, 0, 1114125, 16, 0, 1114126, 16, 0, 1114127, 16, 0, 1114128, 16, 0, 1114129, 16, 0, 1114130, 16, 0, 1114131, 16, 0, 1114132, 16, 0, 1114133, 16, 0, 1114134, 16, 0, 1114135, 16, 0, 1114136, 16, 0, 1114137, 16, 0, 1114138, 16, 0, 1114139, 16, 0, 1114140, 16, 0, 1114141, 16, 0, 1114142, 16, 0, 1114143, 16, 0, 1114144, 16, 0, 1114145, 16, 0, 1114146, 16, 0, 1114147, 16, 0, 1114148, 16, 0, 1114149, 16, 0, 1114150, 16, 0, 1114151, 16, 0, 1114152, 16, 0, 1114153, 16, 0, 1114154, 16, 0, 1114155, 15, 0, 1114156, 15, 0, 1114157, 15, 0, 1114158, 15, 0, 1114159, 15, 0, 1114160, 15, 0, 1114161, 15, 0, 1114162, 15, 0, 1114163, 15, 0, 1114164, 15, 0, 1114165, 15, 0, 1114166, 15, 0, 1114167, 15, 0, 1114168, 15, 0, 1114169, 15, 0, 1114170, 15, 0, 1114171, 15, 0, 1114172, 15, 0, 1114173, 15, 0, 1114174, 15, 0, 1114175, 15, 0, 1114176, 15, 0, 1114177, 15, 0, 1114178, 15, 0, 1114179, 15, 0, 1114180, 15, 0, 1114181, 15, 0, 1114182, 15, 0, 1114183, 15, 0, 1114184, 15, 0, 1114185, 15, 0, 1114186, 15, 0, 1114187, 16, 0, 1114188, 16, 0, 1114189, 16, 0, 1114190, 16, 0, 1114191, 16, 0, 1114192, 16, 0, 1114193, 16, 0, 1114194, 16, 0, 1114195, 16, 0, 1114196, 16, 0, 1114197, 16, 0, 1114198, 16, 0, 1114199, 16, 0, 1114200, 16, 0, 1114201, 16, 0, 1114202, 16, 0, 1114203, 16, 0, 1114204, 16, 0, 1179648, 16, 0, 1179649, 16, 0, 1179650, 16, 0, 1179651, 16, 0, 1179652, 16, 0, 1179653, 16, 0, 1179654, 16, 0, 1179655, 16, 0, 1179656, 16, 0, 1179657, 16, 0, 1179658, 16, 0, 1179659, 16, 0, 1179660, 16, 0, 1179661, 16, 0, 1179662, 16, 0, 1179663, 16, 0, 1179664, 16, 0, 1179665, 16, 0, 1179666, 16, 0, 1179667, 16, 0, 1179668, 16, 0, 1179669, 16, 0, 1179670, 16, 0, 1179671, 16, 0, 1179672, 16, 0, 1179673, 16, 0, 1179674, 16, 0, 1179675, 16, 0, 1179676, 16, 0, 1179677, 16, 0, 1179678, 16, 0, 1179679, 16, 0, 1179680, 16, 0, 1179681, 16, 0, 1179682, 16, 0, 1179683, 16, 0, 1179684, 16, 0, 1179685, 16, 0, 1179686, 16, 0, 1179687, 16, 0, 1179688, 16, 0, 1179689, 16, 0, 1179690, 16, 0, 1179691, 16, 0, 1179692, 16, 0, 1179693, 16, 0, 1179694, 16, 0, 1179695, 16, 0, 1179696, 16, 0, 1179697, 16, 0, 1179698, 16, 0, 1179699, 16, 0, 1179700, 16, 0, 1179701, 16, 0, 1179702, 16, 0, 1179703, 16, 0, 1179704, 16, 0, 1179705, 16, 0, 1179706, 16, 0, 1179707, 16, 0, 1179708, 16, 0, 1179709, 14, 0, 1179710, 14, 0, 1179711, 14, 0, 1179712, 14, 0, 1179713, 14, 0, 1179714, 14, 0, 1179715, 14, 0, 1179716, 14, 0, 1179717, 14, 0, 1179718, 14, 0, 1179719, 14, 0, 1179720, 14, 0, 1179721, 14, 0, 1179722, 14, 0, 1179723, 16, 0, 1179724, 16, 0, 1179725, 16, 0, 1179726, 16, 0, 1179727, 16, 0, 1179728, 16, 0, 1179729, 16, 0, 1179730, 16, 0, 1179731, 16, 0, 1179732, 16, 0, 1179733, 16, 0, 1179734, 16, 0, 1179735, 16, 0, 1179736, 16, 0, 1179737, 16, 0, 1179738, 16, 0, 1179739, 16, 0, 1179740, 16, 0, 1245184, 16, 0, 1245185, 16, 0, 1245186, 16, 0, 1245187, 16, 0, 1245188, 16, 0, 1245189, 16, 0, 1245190, 16, 0, 1245191, 16, 0, 1245192, 16, 0, 1245193, 16, 0, 1245194, 16, 0, 1245195, 16, 0, 1245196, 16, 0, 1245197, 16, 0, 1245198, 16, 0, 1245199, 16, 0, 1245200, 16, 0, 1245201, 16, 0, 1245202, 16, 0, 1245203, 16, 0, 1245204, 16, 0, 1245205, 16, 0, 1245206, 16, 0, 1245207, 16, 0, 1245208, 16, 0, 1245209, 16, 0, 1245210, 16, 0, 1245211, 16, 0, 1245212, 16, 0, 1245213, 16, 0, 1245214, 16, 0, 1245215, 16, 0, 1245216, 16, 0, 1245217, 16, 0, 1245218, 16, 0, 1245219, 16, 0, 1245220, 16, 0, 1245221, 16, 0, 1245222, 16, 0, 1245223, 16, 0, 1245224, 16, 0, 1245225, 16, 0, 1245226, 16, 0, 1245227, 16, 0, 1245228, 16, 0, 1245229, 16, 0, 1245230, 16, 0, 1245231, 16, 0, 1245232, 16, 0, 1245233, 16, 0, 1245234, 16, 0, 1245235, 16, 0, 1245236, 16, 0, 1245237, 16, 0, 1245238, 16, 0, 1245239, 16, 0, 1245240, 16, 0, 1245241, 16, 0, 1245242, 16, 0, 1245243, 16, 0, 1245244, 16, 0, 1245245, 14, 0, 1245246, 14, 0, 1245247, 14, 0, 1245248, 14, 0, 1245249, 14, 0, 1245250, 14, 0, 1245251, 14, 0, 1245252, 14, 0, 1245253, 14, 0, 1245254, 14, 0, 1245255, 14, 0, 1245256, 14, 0, 1245257, 14, 0, 1245258, 14, 0, 1245259, 16, 0, 1245260, 16, 0, 1245261, 16, 0, 1245262, 16, 0, 1245263, 16, 0, 1245264, 16, 0, 1245265, 16, 0, 1245266, 16, 0, 1245267, 16, 0, 1245268, 16, 0, 1245269, 16, 0, 1245270, 16, 0, 1245271, 16, 0, 1245272, 16, 0, 1245273, 16, 0, 1245274, 16, 0, 1245275, 16, 0, 1245276, 16, 0, 1310720, 16, 0, 1310721, 16, 0, 1310722, 16, 0, 1310723, 16, 0, 1310724, 16, 0, 1310725, 16, 0, 1310726, 16, 0, 1310727, 16, 0, 1310728, 16, 0, 1310729, 16, 0, 1310730, 16, 0, 1310731, 16, 0, 1310732, 16, 0, 1310733, 16, 0, 1310734, 16, 0, 1310735, 16, 0, 1310736, 16, 0, 1310737, 16, 0, 1310738, 16, 0, 1310739, 16, 0, 1310740, 16, 0, 1310741, 16, 0, 1310742, 16, 0, 1310743, 16, 0, 1310744, 16, 0, 1310745, 16, 0, 1310746, 16, 0, 1310747, 16, 0, 1310748, 16, 0, 1310749, 16, 0, 1310750, 16, 0, 1310751, 16, 0, 1310752, 16, 0, 1310753, 16, 0, 1310754, 16, 0, 1310755, 16, 0, 1310756, 16, 0, 1310757, 16, 0, 1310758, 16, 0, 1310759, 16, 0, 1310760, 16, 0, 1310761, 16, 0, 1310762, 16, 0, 1310763, 16, 0, 1310764, 16, 0, 1310765, 16, 0, 1310766, 16, 0, 1310767, 16, 0, 1310768, 16, 0, 1310769, 16, 0, 1310770, 16, 0, 1310771, 16, 0, 1310772, 16, 0, 1310773, 16, 0, 1310774, 16, 0, 1310775, 16, 0, 1310776, 16, 0, 1310777, 16, 0, 1310778, 16, 0, 1310779, 16, 0, 1310780, 16, 0, 1310781, 14, 0, 1310782, 14, 0, 1310783, 14, 0, 1310784, 14, 0, 1310785, 14, 0, 1310786, 14, 0, 1310787, 14, 0, 1310788, 14, 0, 1310789, 14, 0, 1310790, 14, 0, 1310791, 14, 0, 1310792, 14, 0, 1310793, 14, 0, 1310794, 14, 0, 1310795, 16, 0, 1310796, 16, 0, 1310797, 16, 0, 1310798, 16, 0, 1310799, 16, 0, 1310800, 16, 0, 1310801, 16, 0, 1310802, 16, 0, 1310803, 16, 0, 1310804, 16, 0, 1310805, 16, 0, 1310806, 16, 0, 1310807, 16, 0, 1310808, 16, 0, 1310809, 16, 0, 1310810, 16, 0, 1310811, 16, 0, 1310812, 16, 0, 1376256, 16, 0, 1376257, 16, 0, 1376258, 16, 0, 1376259, 16, 0, 1376260, 16, 0, 1376261, 16, 0, 1376262, 16, 0, 1376263, 16, 0, 1376264, 16, 0, 1376265, 16, 0, 1376266, 16, 0, 1376267, 16, 0, 1376268, 16, 0, 1376269, 16, 0, 1376270, 16, 0, 1376271, 16, 0, 1376272, 16, 0, 1376273, 16, 0, 1376274, 16, 0, 1376275, 16, 0, 1376276, 16, 0, 1376277, 16, 0, 1376278, 16, 0, 1376279, 16, 0, 1376280, 16, 0, 1376281, 16, 0, 1376282, 16, 0, 1376283, 16, 0, 1376284, 16, 0, 1376285, 16, 0, 1376286, 16, 0, 1376287, 16, 0, 1376288, 16, 0, 1376289, 16, 0, 1376290, 16, 0, 1376291, 16, 0, 1376292, 16, 0, 1376293, 16, 0, 1376294, 16, 0, 1376295, 16, 0, 1376296, 16, 0, 1376297, 16, 0, 1376298, 16, 0, 1376299, 16, 0, 1376300, 16, 0, 1376301, 16, 0, 1376302, 16, 0, 1376303, 16, 0, 1376304, 16, 0, 1376305, 16, 0, 1376306, 16, 0, 1376307, 16, 0, 1376308, 16, 0, 1376309, 16, 0, 1376310, 16, 0, 1376311, 16, 0, 1376312, 16, 0, 1376313, 16, 0, 1376314, 16, 0, 1376315, 16, 0, 1376316, 16, 0, 1376317, 14, 0, 1376318, 14, 0, 1376319, 14, 0, 1376320, 14, 0, 1376321, 14, 0, 1376322, 14, 0, 1376323, 14, 0, 1376324, 14, 0, 1376325, 14, 0, 1376326, 14, 0, 1376327, 14, 0, 1376328, 14, 0, 1376329, 14, 0, 1376330, 14, 0, 1376331, 16, 0, 1376332, 16, 0, 1376333, 16, 0, 1376334, 16, 0, 1376335, 16, 0, 1376336, 16, 0, 1376337, 16, 0, 1376338, 16, 0, 1376339, 16, 0, 1376340, 16, 0, 1376341, 16, 0, 1376342, 16, 0, 1376343, 16, 0, 1376344, 16, 0, 1376345, 16, 0, 1376346, 16, 0, 1376347, 16, 0, 1376348, 16, 0, 1441792, 16, 0, 1441793, 16, 0, 1441794, 16, 0, 1441795, 16, 0, 1441796, 16, 0, 1441797, 16, 0, 1441798, 16, 0, 1441799, 16, 0, 1441800, 16, 0, 1441801, 16, 0, 1441802, 16, 0, 1441803, 16, 0, 1441804, 16, 0, 1441805, 16, 0, 1441806, 16, 0, 1441807, 16, 0, 1441808, 16, 0, 1441809, 16, 0, 1441810, 16, 0, 1441811, 16, 0, 1441812, 16, 0, 1441813, 16, 0, 1441814, 16, 0, 1441815, 16, 0, 1441816, 16, 0, 1441817, 16, 0, 1441818, 16, 0, 1441819, 16, 0, 1441820, 16, 0, 1441821, 16, 0, 1441822, 16, 0, 1441823, 16, 0, 1441824, 16, 0, 1441825, 16, 0, 1441826, 16, 0, 1441827, 16, 0, 1441828, 16, 0, 1441829, 16, 0, 1441830, 16, 0, 1441831, 16, 0, 1441832, 16, 0, 1441833, 16, 0, 1441834, 16, 0, 1441835, 16, 0, 1441836, 16, 0, 1441837, 16, 0, 1441838, 16, 0, 1441839, 16, 0, 1441840, 16, 0, 1441841, 16, 0, 1441842, 16, 0, 1441843, 16, 0, 1441844, 16, 0, 1441845, 16, 0, 1441846, 16, 0, 1441847, 16, 0, 1441848, 16, 0, 1441849, 16, 0, 1441850, 16, 0, 1441851, 16, 0, 1441852, 16, 0, 1441853, 16, 0, 1441854, 16, 0, 1441855, 16, 0, 1441856, 16, 0, 1441857, 16, 0, 1441858, 16, 0, 1441859, 16, 0, 1441860, 16, 0, 1441861, 16, 0, 1441862, 16, 0, 1441863, 16, 0, 1441864, 16, 0, 1441865, 16, 0, 1441866, 16, 0, 1441867, 16, 0, 1441868, 16, 0, 1441869, 16, 0, 1441870, 16, 0, 1441871, 16, 0, 1441872, 16, 0, 1441873, 16, 0, 1441874, 16, 0, 1441875, 16, 0, 1441876, 16, 0, 1441877, 16, 0, 1441878, 16, 0, 1441879, 16, 0, 1441880, 16, 0, 1441881, 16, 0, 1441882, 16, 0, 1441883, 16, 0, 1441884, 16, 0 )

[node name="Leaves" type="Node" parent="BGTileMap" index="0"]

[node name="Sprite" type="Sprite" parent="BGTileMap/Leaves" index="0"]
position = Vector2( 96, 64 )
texture = ExtResource( 16 )

[node name="Sprite2" type="Sprite" parent="BGTileMap/Leaves" index="1"]
position = Vector2( 288, 64 )
texture = ExtResource( 16 )

[node name="Sprite3" type="Sprite" parent="BGTileMap/Leaves" index="2"]
position = Vector2( 480, 64 )
texture = ExtResource( 16 )

[node name="Sprite4" type="Sprite" parent="BGTileMap/Leaves" index="3"]
position = Vector2( 672, 64 )
texture = ExtResource( 16 )

[node name="Sprite8" type="Sprite" parent="BGTileMap/Leaves" index="4"]
position = Vector2( 864, 64 )
texture = ExtResource( 16 )

[node name="Sprite7" type="Sprite" parent="BGTileMap/Leaves" index="5"]
position = Vector2( 1056, 64 )
texture = ExtResource( 16 )

[node name="Sprite6" type="Sprite" parent="BGTileMap/Leaves" index="6"]
position = Vector2( 1248, 64 )
texture = ExtResource( 16 )

[node name="Sprite5" type="Sprite" parent="BGTileMap/Leaves" index="7"]
position = Vector2( 1440, 64 )
texture = ExtResource( 16 )

[node name="Sprite12" type="Sprite" parent="BGTileMap/Leaves" index="8"]
position = Vector2( 1632, 64 )
texture = ExtResource( 16 )

[node name="Sprite11" type="Sprite" parent="BGTileMap/Leaves" index="9"]
position = Vector2( 1824, 64 )
texture = ExtResource( 16 )

[node name="Sprite10" type="Sprite" parent="BGTileMap/Leaves" index="10"]
position = Vector2( 2016, 64 )
texture = ExtResource( 16 )

[node name="Sprite9" type="Sprite" parent="BGTileMap/Leaves" index="11"]
position = Vector2( 2208, 64 )
texture = ExtResource( 16 )

[node name="Sprite16" type="Sprite" parent="BGTileMap/Leaves" index="12"]
position = Vector2( 2400, 64 )
texture = ExtResource( 16 )

[node name="Sprite15" type="Sprite" parent="BGTileMap/Leaves" index="13"]
position = Vector2( 2592, 64 )
texture = ExtResource( 16 )

[node name="Sprite14" type="Sprite" parent="BGTileMap/Leaves" index="14"]
position = Vector2( 2784, 64 )
texture = ExtResource( 16 )

[node name="Sprite13" type="Sprite" parent="BGTileMap/Leaves" index="15"]
position = Vector2( 2976, 64 )
texture = ExtResource( 16 )

[node name="Sprite20" type="Sprite" parent="BGTileMap/Leaves" index="16"]
position = Vector2( 3168, 64 )
texture = ExtResource( 16 )

[node name="Sprite19" type="Sprite" parent="BGTileMap/Leaves" index="17"]
position = Vector2( 3360, 64 )
texture = ExtResource( 16 )

[node name="Sprite18" type="Sprite" parent="BGTileMap/Leaves" index="18"]
position = Vector2( 3552, 64 )
texture = ExtResource( 16 )

[node name="Sprite17" type="Sprite" parent="BGTileMap/Leaves" index="19"]
position = Vector2( 3744, 64 )
texture = ExtResource( 16 )

[node name="Sprite24" type="Sprite" parent="BGTileMap/Leaves" index="20"]
position = Vector2( 3936, 64 )
texture = ExtResource( 16 )

[node name="Sprite23" type="Sprite" parent="BGTileMap/Leaves" index="21"]
position = Vector2( 4128, 64 )
texture = ExtResource( 16 )

[node name="Sprite22" type="Sprite" parent="BGTileMap/Leaves" index="22"]
position = Vector2( 4320, 64 )
texture = ExtResource( 16 )

[node name="Sprite21" type="Sprite" parent="BGTileMap/Leaves" index="23"]
position = Vector2( 4512, 64 )
texture = ExtResource( 16 )

[node name="Sprite28" type="Sprite" parent="BGTileMap/Leaves" index="24"]
position = Vector2( 4704, 64 )
texture = ExtResource( 16 )

[node name="Sprite27" type="Sprite" parent="BGTileMap/Leaves" index="25"]
position = Vector2( 4896, 64 )
texture = ExtResource( 16 )

[node name="Sprite26" type="Sprite" parent="BGTileMap/Leaves" index="26"]
position = Vector2( 5088, 64 )
texture = ExtResource( 16 )

[node name="Sprite25" type="Sprite" parent="BGTileMap/Leaves" index="27"]
position = Vector2( 5280, 64 )
texture = ExtResource( 16 )

[node name="Sprite32" type="Sprite" parent="BGTileMap/Leaves" index="28"]
position = Vector2( 5472, 64 )
texture = ExtResource( 16 )

[node name="Sprite31" type="Sprite" parent="BGTileMap/Leaves" index="29"]
position = Vector2( 5664, 64 )
texture = ExtResource( 16 )

[node name="Sprite30" type="Sprite" parent="BGTileMap/Leaves" index="30"]
position = Vector2( 5856, 64 )
texture = ExtResource( 16 )

[node name="Fern" type="Sprite" parent="BGTileMap" index="1"]
position = Vector2( 4056, 368 )
texture = ExtResource( 14 )

[node name="Fern2" type="Sprite" parent="BGTileMap" index="2"]
position = Vector2( 4720, 752 )
texture = ExtResource( 14 )

[node name="Fern3" type="Sprite" parent="BGTileMap" index="3"]
position = Vector2( 512, 536 )
texture = ExtResource( 14 )

[node name="Tree" type="Sprite" parent="BGTileMap" index="4"]
position = Vector2( 1688, 320 )
texture = ExtResource( 15 )

[node name="Sprite" type="Sprite" parent="BGTileMap/Tree" index="0"]
position = Vector2( 88, -120 )
texture = ExtResource( 6 )

[node name="Sprite2" type="Sprite" parent="BGTileMap/Tree" index="1"]
position = Vector2( 88, -16 )
texture = ExtResource( 13 )

[node name="Sprite3" type="Sprite" parent="BGTileMap/Tree" index="2"]
position = Vector2( -88, -112 )
texture = ExtResource( 13 )
flip_h = true

[node name="Tree3" type="Sprite" parent="BGTileMap" index="5"]
position = Vector2( 4128, 288 )
texture = ExtResource( 15 )

[node name="Sprite" type="Sprite" parent="BGTileMap/Tree3" index="0"]
position = Vector2( 88, 144 )
texture = ExtResource( 6 )

[node name="Sprite3" type="Sprite" parent="BGTileMap/Tree3" index="1"]
position = Vector2( -88, -112 )
texture = ExtResource( 13 )
flip_h = true

[node name="Tree2" type="Sprite" parent="BGTileMap" index="6"]
position = Vector2( 5088, 216 )
texture = ExtResource( 15 )

[node name="Bush" type="Sprite" parent="BGTileMap" index="7"]
position = Vector2( 4176, 480 )
texture = ExtResource( 12 )

[node name="Bush4" type="Sprite" parent="BGTileMap" index="8"]
position = Vector2( 96, 384 )
texture = ExtResource( 12 )

[node name="Bush2" type="Sprite" parent="BGTileMap" index="9"]
position = Vector2( 4088, 904 )
texture = ExtResource( 12 )

[node name="Bush3" type="Sprite" parent="BGTileMap" index="10"]
position = Vector2( 4784, 1192 )
texture = ExtResource( 12 )

[node name="TileMap" parent="." index="2"]
tile_set = ExtResource( 1 )
tile_data = PoolIntArray( 327704, 7, 0, 327705, 8, 0, 327706, 5, 0, 327707, 5, 0, 327708, 5, 0, 327709, 5, 0, 327710, 5, 0, 327711, 5, 0, 327712, 5, 0, 327713, 5, 0, 327755, 8, 0, 327756, 5, 0, 327757, 5, 0, 327758, 5, 0, 327759, 5, 0, 327760, 5, 0, 327761, 5, 0, 327762, 5, 0, 327763, 5, 0, 327764, 5, 0, 327765, 5, 0, 327766, 5, 0, 327767, 5, 0, 327768, 5, 0, 327769, 5, 0, 327770, 5, 0, 327771, 5, 0, 327772, 5, 0, 393240, 6, 0, 393241, 12, 0, 393242, 12, 0, 393243, 12, 0, 393244, 12, 0, 393250, 9, 0, 393251, 10, 0, 393252, 10, 0, 393253, 10, 0, 393254, 11, 0, 393291, 12, 0, 393292, 12, 0, 393293, 12, 0, 393294, 12, 0, 393295, 12, 0, 393296, 12, 0, 393297, 12, 0, 393298, 12, 0, 393299, 12, 0, 393300, 12, 0, 393301, 12, 0, 393302, 12, 0, 393303, 12, 0, 393304, 12, 0, 393305, 12, 0, 393306, 12, 0, 393307, 12, 0, 393308, 12, 0, 458752, 9, 0, 458753, 10, 0, 458754, 10, 0, 458755, 10, 0, 458756, 10, 0, 458757, 10, 0, 458758, 10, 0, 458759, 10, 0, 458760, 10, 0, 458761, 10, 0, 458762, 10, 0, 458763, 10, 0, 458764, 10, 0, 458765, 10, 0, 458766, 10, 0, 458767, 10, 0, 458768, 10, 0, 458769, 10, 0, 458770, 10, 0, 458771, 10, 0, 458772, 10, 0, 458773, 10, 0, 458774, 10, 0, 458775, 11, 0, 458776, 6, 0, 458777, 12, 0, 458778, 12, 0, 458779, 12, 0, 458780, 12, 0, 458791, 8, 0, 458792, 5, 0, 458793, 5, 0, 458794, 5, 0, 458795, 5, 0, 458796, 5, 0, 458797, 5, 0, 458798, 5, 0, 458799, 5, 0, 458800, 5, 0, 458801, 5, 0, 458827, 12, 0, 458828, 12, 0, 458829, 12, 0, 458830, 12, 0, 458831, 12, 0, 458832, 12, 0, 458833, 12, 0, 458834, 12, 0, 458835, 12, 0, 458836, 12, 0, 458837, 12, 0, 458838, 12, 0, 458839, 12, 0, 458840, 12, 0, 458841, 12, 0, 458842, 12, 0, 458843, 12, 0, 458844, 12, 0, 524288, 5, 0, 524289, 5, 0, 524290, 5, 0, 524291, 4, 0, 524312, 6, 0, 524313, 12, 0, 524314, 12, 0, 524315, 12, 0, 524316, 12, 0, 524317, 13, 0, 524318, 13, 0, 524319, 13, 0, 524320, 13, 0, 524321, 13, 0, 524322, 13, 0, 524323, 13, 0, 524324, 13, 0, 524325, 13, 0, 524326, 13, 0, 524327, 12, 0, 524335, 12, 0, 524336, 12, 0, 524337, 12, 0, 524341, 8, 0, 524342, 5, 0, 524343, 5, 0, 524363, 12, 0, 524364, 12, 0, 524365, 12, 0, 524366, 12, 0, 524367, 12, 0, 524368, 12, 0, 524369, 12, 0, 524370, 12, 0, 524371, 12, 0, 524372, 12, 0, 524373, 12, 0, 524374, 12, 0, 524375, 12, 0, 524376, 12, 0, 524377, 12, 0, 524378, 12, 0, 524379, 12, 0, 524380, 12, 0, 589824, 12, 0, 589825, 12, 0, 589826, 12, 0, 589827, 12, 0, 589828, 5, 0, 589829, 5, 0, 589830, 5, 0, 589831, 5, 0, 589832, 5, 0, 589833, 5, 0, 589834, 5, 0, 589835, 5, 0, 589836, 4, 0, 589837, 13, 0, 589838, 13, 0, 589839, 13, 0, 589840, 13, 0, 589841, 13, 0, 589842, 13, 0, 589843, 5, 0, 589844, 5, 0, 589845, 5, 0, 589846, 5, 0, 589847, 5, 0, 589848, 6, 0, 589849, 12, 0, 589850, 12, 0, 589851, 12, 0, 589852, 12, 0, 589853, 0, 0, 589854, 0, 0, 589855, 0, 0, 589856, 0, 0, 589857, 0, 0, 589858, 0, 0, 589859, 0, 0, 589860, 0, 0, 589861, 0, 0, 589862, 0, 0, 589863, 12, 0, 589864, 5, 0, 589865, 5, 0, 589866, 5, 0, 589867, 5, 0, 589868, 5, 0, 589869, 5, 0, 589870, 5, 0, 589871, 12, 0, 589872, 12, 0, 589873, 12, 0, 589874, 5, 0, 589875, 5, 0, 589876, 5, 0, 589877, 12, 0, 589878, 12, 0, 589879, 12, 0, 589880, 17, 0, 589881, 17, 0, 589882, 17, 0, 589883, 17, 0, 589884, 17, 0, 589885, 17, 0, 589886, 17, 0, 589887, 17, 0, 589888, 17, 0, 589889, 17, 0, 589890, 17, 0, 589891, 17, 0, 589892, 17, 0, 589893, 17, 0, 589894, 17, 0, 589895, 17, 0, 589896, 17, 0, 589897, 17, 0, 589898, 17, 0, 589899, 12, 0, 589900, 12, 0, 589901, 12, 0, 589902, 12, 0, 589903, 12, 0, 589904, 12, 0, 589905, 12, 0, 589906, 12, 0, 589907, 12, 0, 589908, 12, 0, 589909, 12, 0, 589910, 12, 0, 589911, 12, 0, 589912, 12, 0, 589913, 12, 0, 589914, 12, 0, 589915, 12, 0, 589916, 12, 0, 655360, 12, 0, 655361, 12, 0, 655362, 12, 0, 655363, 12, 0, 655364, 12, 0, 655365, 12, 0, 655366, 12, 0, 655367, 12, 0, 655368, 12, 0, 655369, 12, 0, 655370, 12, 0, 655371, 12, 0, 655372, 12, 0, 655373, 0, 0, 655374, 0, 0, 655375, 0, 0, 655376, 0, 0, 655377, 0, 0, 655378, 0, 0, 655379, 12, 0, 655380, 12, 0, 655381, 12, 0, 655382, 12, 0, 655383, 12, 0, 655384, 12, 0, 655385, 12, 0, 655386, 12, 0, 655387, 12, 0, 655388, 12, 0, 655389, 0, 0, 655390, 0, 0, 655391, 0, 0, 655392, 0, 0, 655393, 0, 0, 655394, 0, 0, 655395, 0, 0, 655396, 0, 0, 655397, 0, 0, 655398, 0, 0, 655399, 12, 0, 655400, 12, 0, 655401, 12, 0, 655402, 12, 0, 655403, 12, 0, 655404, 12, 0, 655405, 12, 0, 655406, 12, 0, 655407, 12, 0, 655408, 12, 0, 655409, 12, 0, 655410, 12, 0, 655411, 12, 0, 655412, 12, 0, 655413, 12, 0, 655414, 12, 0, 655415, 12, 0, 655435, 12, 0, 655436, 12, 0, 655437, 12, 0, 655438, 12, 0, 655439, 12, 0, 655440, 12, 0, 655441, 12, 0, 655442, 12, 0, 655443, 12, 0, 655444, 12, 0, 655445, 12, 0, 655446, 12, 0, 655447, 12, 0, 655448, 12, 0, 655449, 12, 0, 655450, 12, 0, 655451, 12, 0, 655452, 12, 0, 720896, 12, 0, 720897, 12, 0, 720898, 12, 0, 720899, 12, 0, 720900, 12, 0, 720901, 12, 0, 720902, 12, 0, 720903, 12, 0, 720904, 12, 0, 720905, 12, 0, 720906, 12, 0, 720907, 12, 0, 720908, 12, 0, 720909, 0, 0, 720910, 0, 0, 720911, 0, 0, 720912, 0, 0, 720913, 0, 0, 720914, 0, 0, 720915, 12, 0, 720916, 12, 0, 720917, 12, 0, 720918, 12, 0, 720919, 12, 0, 720920, 12, 0, 720921, 12, 0, 720922, 12, 0, 720923, 12, 0, 720924, 12, 0, 720925, 0, 0, 720926, 0, 0, 720927, 0, 0, 720928, 0, 0, 720929, 0, 0, 720930, 0, 0, 720931, 0, 0, 720932, 0, 0, 720933, 0, 0, 720934, 0, 0, 720935, 12, 0, 720936, 12, 0, 720937, 12, 0, 720938, 12, 0, 720939, 12, 0, 720940, 12, 0, 720941, 12, 0, 720942, 12, 0, 720943, 12, 0, 720944, 12, 0, 720945, 12, 0, 720946, 12, 0, 720947, 12, 0, 720948, 12, 0, 720949, 12, 0, 720950, 12, 0, 720951, 12, 0, 720952, 5, 0, 720953, 5, 0, 720954, 5, 0, 720955, 5, 0, 720956, 5, 0, 720971, 12, 0, 720972, 12, 0, 720973, 12, 0, 720974, 12, 0, 720975, 12, 0, 720976, 12, 0, 720977, 12, 0, 720978, 12, 0, 720979, 12, 0, 720980, 12, 0, 720981, 12, 0, 720982, 12, 0, 720983, 12, 0, 720984, 12, 0, 720985, 12, 0, 720986, 12, 0, 720987, 12, 0, 720988, 12, 0, 786432, 12, 0, 786433, 12, 0, 786434, 12, 0, 786435, 12, 0, 786436, 12, 0, 786437, 12, 0, 786438, 12, 0, 786439, 12, 0, 786440, 12, 0, 786441, 12, 0, 786442, 12, 0, 786443, 12, 0, 786444, 12, 0, 786445, 12, 0, 786446, 12, 0, 786447, 12, 0, 786448, 12, 0, 786449, 12, 0, 786450, 12, 0, 786451, 12, 0, 786452, 12, 0, 786453, 12, 0, 786454, 12, 0, 786455, 12, 0, 786456, 12, 0, 786457, 12, 0, 786458, 12, 0, 786459, 12, 0, 786460, 12, 0, 786461, 0, 0, 786462, 0, 0, 786463, 0, 0, 786464, 0, 0, 786465, 0, 0, 786466, 0, 0, 786467, 0, 0, 786468, 0, 0, 786469, 0, 0, 786470, 0, 0, 786471, 12, 0, 786472, 12, 0, 786473, 12, 0, 786474, 12, 0, 786475, 12, 0, 786476, 12, 0, 786477, 12, 0, 786478, 12, 0, 786479, 12, 0, 786480, 12, 0, 786481, 12, 0, 786482, 12, 0, 786483, 12, 0, 786484, 12, 0, 786485, 12, 0, 786486, 12, 0, 786487, 12, 0, 786488, 12, 0, 786489, 12, 0, 786490, 12, 0, 786491, 12, 0, 786492, 12, 0, 786507, 12, 0, 786508, 12, 0, 786509, 12, 0, 786510, 12, 0, 786511, 12, 0, 786512, 12, 0, 786513, 12, 0, 786514, 12, 0, 786515, 12, 0, 786516, 12, 0, 786517, 12, 0, 786518, 12, 0, 786519, 12, 0, 786520, 12, 0, 786521, 12, 0, 786522, 12, 0, 786523, 12, 0, 786524, 12, 0, 851968, 12, 0, 851969, 12, 0, 851970, 12, 0, 851971, 12, 0, 851972, 12, 0, 851973, 12, 0, 851974, 12, 0, 851975, 12, 0, 851976, 12, 0, 851977, 12, 0, 851978, 12, 0, 851979, 12, 0, 851980, 12, 0, 851981, 12, 0, 851982, 12, 0, 851983, 12, 0, 851984, 12, 0, 851985, 12, 0, 851986, 12, 0, 851987, 12, 0, 851988, 12, 0, 851989, 12, 0, 851990, 12, 0, 851991, 12, 0, 851992, 12, 0, 851993, 12, 0, 851994, 12, 0, 851995, 12, 0, 851996, 12, 0, 851997, 0, 0, 851998, 0, 0, 851999, 0, 0, 852000, 0, 0, 852001, 0, 0, 852002, 0, 0, 852003, 0, 0, 852004, 0, 0, 852005, 0, 0, 852006, 0, 0, 852007, 12, 0, 852008, 12, 0, 852009, 12, 0, 852010, 12, 0, 852011, 12, 0, 852012, 12, 0, 852028, 12, 0, 852034, 8, 0, 852035, 5, 0, 852036, 5, 0, 852037, 4, 0, 852043, 12, 0, 852044, 12, 0, 852045, 12, 0, 852046, 12, 0, 852047, 12, 0, 852048, 12, 0, 852049, 12, 0, 852050, 12, 0, 852051, 12, 0, 852052, 12, 0, 852053, 12, 0, 852054, 12, 0, 852055, 12, 0, 852056, 12, 0, 852057, 12, 0, 852058, 12, 0, 852059, 12, 0, 852060, 12, 0, 917504, 12, 0, 917505, 12, 0, 917506, 12, 0, 917507, 12, 0, 917508, 12, 0, 917509, 12, 0, 917510, 12, 0, 917511, 12, 0, 917512, 12, 0, 917513, 12, 0, 917514, 12, 0, 917515, 12, 0, 917516, 12, 0, 917517, 12, 0, 917518, 12, 0, 917519, 12, 0, 917520, 12, 0, 917521, 12, 0, 917522, 12, 0, 917523, 12, 0, 917524, 12, 0, 917525, 12, 0, 917526, 12, 0, 917527, 12, 0, 917528, 12, 0, 917529, 12, 0, 917530, 12, 0, 917531, 12, 0, 917532, 12, 0, 917533, 0, 0, 917534, 0, 0, 917535, 0, 0, 917536, 0, 0, 917537, 0, 0, 917538, 0, 0, 917539, 0, 0, 917540, 0, 0, 917541, 0, 0, 917542, 0, 0, 917543, 12, 0, 917544, 12, 0, 917545, 12, 0, 917546, 12, 0, 917547, 12, 0, 917548, 12, 0, 917549, 5, 0, 917550, 5, 0, 917551, 5, 0, 917552, 5, 0, 917553, 5, 0, 917554, 5, 0, 917555, 5, 0, 917556, 5, 0, 917557, 5, 0, 917558, 5, 0, 917559, 5, 0, 917560, 5, 0, 917561, 5, 0, 917562, 5, 0, 917563, 5, 0, 917564, 12, 0, 917579, 12, 0, 917580, 12, 0, 917581, 12, 0, 917582, 12, 0, 917583, 12, 0, 917584, 12, 0, 917585, 12, 0, 917586, 12, 0, 917587, 12, 0, 917588, 12, 0, 917589, 12, 0, 917590, 12, 0, 917591, 12, 0, 917592, 12, 0, 917593, 12, 0, 917594, 12, 0, 917595, 12, 0, 917596, 12, 0, 983040, 12, 0, 983041, 12, 0, 983042, 12, 0, 983043, 12, 0, 983044, 12, 0, 983045, 12, 0, 983046, 12, 0, 983047, 12, 0, 983048, 12, 0, 983049, 12, 0, 983050, 12, 0, 983051, 12, 0, 983052, 12, 0, 983053, 12, 0, 983054, 12, 0, 983055, 12, 0, 983056, 12, 0, 983057, 12, 0, 983058, 12, 0, 983059, 12, 0, 983060, 12, 0, 983061, 12, 0, 983062, 12, 0, 983063, 12, 0, 983064, 12, 0, 983065, 12, 0, 983066, 12, 0, 983067, 12, 0, 983068, 12, 0, 983069, 0, 0, 983070, 0, 0, 983071, 0, 0, 983072, 0, 0, 983073, 0, 0, 983074, 0, 0, 983075, 0, 0, 983076, 0, 0, 983077, 0, 0, 983078, 0, 0, 983079, 12, 0, 983080, 12, 0, 983081, 12, 0, 983082, 12, 0, 983083, 12, 0, 983084, 12, 0, 983085, 12, 0, 983086, 12, 0, 983087, 12, 0, 983088, 12, 0, 983089, 12, 0, 983090, 12, 0, 983091, 12, 0, 983092, 12, 0, 983093, 12, 0, 983094, 12, 0, 983095, 12, 0, 983096, 12, 0, 983097, 12, 0, 983098, 12, 0, 983099, 12, 0, 983100, 12, 0, 983115, 12, 0, 983116, 12, 0, 983117, 12, 0, 983118, 12, 0, 983119, 12, 0, 983120, 12, 0, 983121, 12, 0, 983122, 12, 0, 983123, 12, 0, 983124, 12, 0, 983125, 12, 0, 983126, 12, 0, 983127, 12, 0, 983128, 12, 0, 983129, 12, 0, 983130, 12, 0, 983131, 12, 0, 983132, 12, 0, 1048576, 12, 0, 1048577, 12, 0, 1048578, 12, 0, 1048579, 12, 0, 1048580, 12, 0, 1048581, 12, 0, 1048582, 12, 0, 1048583, 12, 0, 1048584, 12, 0, 1048585, 12, 0, 1048586, 12, 0, 1048587, 12, 0, 1048588, 12, 0, 1048589, 12, 0, 1048590, 12, 0, 1048591, 12, 0, 1048592, 12, 0, 1048593, 12, 0, 1048594, 12, 0, 1048595, 12, 0, 1048596, 12, 0, 1048597, 12, 0, 1048598, 12, 0, 1048599, 12, 0, 1048600, 12, 0, 1048601, 12, 0, 1048602, 12, 0, 1048603, 12, 0, 1048604, 12, 0, 1048605, 0, 0, 1048606, 0, 0, 1048607, 0, 0, 1048608, 0, 0, 1048609, 0, 0, 1048610, 0, 0, 1048611, 0, 0, 1048612, 0, 0, 1048613, 0, 0, 1048614, 0, 0, 1048615, 12, 0, 1048616, 12, 0, 1048617, 12, 0, 1048618, 12, 0, 1048619, 12, 0, 1048620, 12, 0, 1048636, 12, 0, 1048651, 12, 0, 1048652, 12, 0, 1048653, 12, 0, 1048654, 12, 0, 1048655, 12, 0, 1048656, 12, 0, 1048657, 12, 0, 1048658, 12, 0, 1048659, 12, 0, 1048660, 12, 0, 1048661, 12, 0, 1048662, 12, 0, 1048663, 12, 0, 1048664, 12, 0, 1048665, 12, 0, 1048666, 12, 0, 1048667, 12, 0, 1048668, 12, 0, 1114112, 12, 0, 1114113, 12, 0, 1114114, 12, 0, 1114115, 12, 0, 1114116, 12, 0, 1114117, 12, 0, 1114118, 12, 0, 1114119, 12, 0, 1114120, 12, 0, 1114121, 12, 0, 1114122, 12, 0, 1114123, 12, 0, 1114124, 12, 0, 1114125, 12, 0, 1114126, 12, 0, 1114127, 12, 0, 1114128, 12, 0, 1114129, 12, 0, 1114130, 12, 0, 1114131, 12, 0, 1114132, 12, 0, 1114133, 12, 0, 1114134, 12, 0, 1114135, 12, 0, 1114136, 12, 0, 1114137, 12, 0, 1114138, 12, 0, 1114139, 12, 0, 1114140, 12, 0, 1114141, 0, 0, 1114142, 0, 0, 1114143, 0, 0, 1114144, 0, 0, 1114145, 0, 0, 1114146, 0, 0, 1114147, 0, 0, 1114148, 0, 0, 1114149, 0, 0, 1114150, 0, 0, 1114151, 12, 0, 1114152, 12, 0, 1114153, 12, 0, 1114154, 12, 0, 1114155, 12, 0, 1114156, 12, 0, 1114157, 5, 0, 1114158, 5, 0, 1114159, 5, 0, 1114160, 5, 0, 1114161, 5, 0, 1114162, 5, 0, 1114163, 5, 0, 1114164, 5, 0, 1114165, 5, 0, 1114166, 5, 0, 1114167, 5, 0, 1114168, 5, 0, 1114169, 5, 0, 1114170, 5, 0, 1114171, 5, 0, 1114172, 12, 0, 1114173, 5, 0, 1114174, 5, 0, 1114175, 5, 0, 1114176, 4, 0, 1114183, 8, 0, 1114184, 5, 0, 1114185, 5, 0, 1114186, 5, 0, 1114187, 12, 0, 1114188, 12, 0, 1114189, 12, 0, 1114190, 12, 0, 1114191, 12, 0, 1114192, 12, 0, 1114193, 12, 0, 1114194, 12, 0, 1114195, 12, 0, 1114196, 12, 0, 1114197, 12, 0, 1114198, 12, 0, 1114199, 12, 0, 1114200, 12, 0, 1114201, 12, 0, 1114202, 12, 0, 1114203, 12, 0, 1114204, 12, 0, 1179648, 12, 0, 1179649, 12, 0, 1179650, 12, 0, 1179651, 12, 0, 1179652, 12, 0, 1179653, 12, 0, 1179654, 12, 0, 1179655, 12, 0, 1179656, 12, 0, 1179657, 12, 0, 1179658, 12, 0, 1179659, 12, 0, 1179660, 12, 0, 1179661, 12, 0, 1179662, 12, 0, 1179663, 12, 0, 1179664, 12, 0, 1179665, 12, 0, 1179666, 12, 0, 1179667, 12, 0, 1179668, 12, 0, 1179669, 12, 0, 1179670, 12, 0, 1179671, 12, 0, 1179672, 12, 0, 1179673, 12, 0, 1179674, 12, 0, 1179675, 12, 0, 1179676, 12, 0, 1179677, 0, 0, 1179678, 0, 0, 1179679, 0, 0, 1179680, 0, 0, 1179681, 0, 0, 1179682, 0, 0, 1179683, 0, 0, 1179684, 0, 0, 1179685, 0, 0, 1179686, 0, 0, 1179687, 12, 0, 1179688, 12, 0, 1179689, 12, 0, 1179690, 12, 0, 1179691, 12, 0, 1179692, 12, 0, 1179693, 12, 0, 1179694, 12, 0, 1179695, 12, 0, 1179696, 12, 0, 1179697, 12, 0, 1179698, 12, 0, 1179699, 12, 0, 1179700, 12, 0, 1179701, 12, 0, 1179702, 12, 0, 1179703, 12, 0, 1179704, 12, 0, 1179705, 12, 0, 1179706, 12, 0, 1179707, 12, 0, 1179708, 12, 0, 1179723, 12, 0, 1179724, 12, 0, 1179725, 12, 0, 1179726, 12, 0, 1179727, 12, 0, 1179728, 12, 0, 1179729, 12, 0, 1179730, 12, 0, 1179731, 12, 0, 1179732, 12, 0, 1179733, 12, 0, 1179734, 12, 0, 1179735, 12, 0, 1179736, 12, 0, 1179737, 12, 0, 1179738, 12, 0, 1179739, 12, 0, 1179740, 12, 0, 1245184, 12, 0, 1245185, 12, 0, 1245186, 12, 0, 1245187, 12, 0, 1245188, 12, 0, 1245189, 12, 0, 1245190, 12, 0, 1245191, 12, 0, 1245192, 12, 0, 1245193, 12, 0, 1245194, 12, 0, 1245195, 12, 0, 1245196, 12, 0, 1245197, 12, 0, 1245198, 12, 0, 1245199, 12, 0, 1245200, 12, 0, 1245201, 12, 0, 1245202, 12, 0, 1245203, 12, 0, 1245204, 12, 0, 1245205, 12, 0, 1245206, 12, 0, 1245207, 12, 0, 1245208, 12, 0, 1245209, 12, 0, 1245210, 12, 0, 1245211, 12, 0, 1245212, 12, 0, 1245213, 0, 0, 1245214, 0, 0, 1245215, 0, 0, 1245216, 0, 0, 1245217, 0, 0, 1245218, 0, 0, 1245219, 0, 0, 1245220, 0, 0, 1245221, 0, 0, 1245222, 0, 0, 1245223, 12, 0, 1245224, 12, 0, 1245225, 12, 0, 1245226, 12, 0, 1245227, 12, 0, 1245228, 12, 0, 1245229, 12, 0, 1245230, 12, 0, 1245231, 12, 0, 1245232, 12, 0, 1245233, 12, 0, 1245234, 12, 0, 1245235, 12, 0, 1245236, 12, 0, 1245237, 12, 0, 1245238, 12, 0, 1245239, 12, 0, 1245240, 12, 0, 1245241, 12, 0, 1245242, 12, 0, 1245243, 12, 0, 1245244, 12, 0, 1245259, 12, 0, 1245260, 12, 0, 1245261, 12, 0, 1245262, 12, 0, 1245263, 12, 0, 1245264, 12, 0, 1245265, 12, 0, 1245266, 12, 0, 1245267, 12, 0, 1245268, 12, 0, 1245269, 12, 0, 1245270, 12, 0, 1245271, 12, 0, 1245272, 12, 0, 1245273, 12, 0, 1245274, 12, 0, 1245275, 12, 0, 1245276, 12, 0, 1310720, 12, 0, 1310721, 12, 0, 1310722, 12, 0, 1310723, 12, 0, 1310724, 12, 0, 1310725, 12, 0, 1310726, 12, 0, 1310727, 12, 0, 1310728, 12, 0, 1310729, 12, 0, 1310730, 12, 0, 1310731, 12, 0, 1310732, 12, 0, 1310733, 12, 0, 1310734, 12, 0, 1310735, 12, 0, 1310736, 12, 0, 1310737, 12, 0, 1310738, 12, 0, 1310739, 12, 0, 1310740, 12, 0, 1310741, 12, 0, 1310742, 12, 0, 1310743, 12, 0, 1310744, 12, 0, 1310745, 12, 0, 1310746, 12, 0, 1310747, 12, 0, 1310748, 12, 0, 1310749, 0, 0, 1310750, 0, 0, 1310751, 0, 0, 1310752, 0, 0, 1310753, 0, 0, 1310754, 0, 0, 1310755, 0, 0, 1310756, 0, 0, 1310757, 0, 0, 1310758, 0, 0, 1310759, 12, 0, 1310760, 12, 0, 1310761, 12, 0, 1310762, 12, 0, 1310763, 12, 0, 1310764, 12, 0, 1310765, 12, 0, 1310766, 12, 0, 1310767, 12, 0, 1310768, 12, 0, 1310769, 12, 0, 1310770, 12, 0, 1310771, 12, 0, 1310772, 12, 0, 1310773, 12, 0, 1310774, 12, 0, 1310775, 12, 0, 1310776, 12, 0, 1310777, 12, 0, 1310778, 12, 0, 1310779, 12, 0, 1310780, 12, 0, 1310795, 12, 0, 1310796, 12, 0, 1310797, 12, 0, 1310798, 12, 0, 1310799, 12, 0, 1310800, 12, 0, 1310801, 12, 0, 1310802, 12, 0, 1310803, 12, 0, 1310804, 12, 0, 1310805, 12, 0, 1310806, 12, 0, 1310807, 12, 0, 1310808, 12, 0, 1310809, 12, 0, 1310810, 12, 0, 1310811, 12, 0, 1310812, 12, 0, 1376256, 12, 0, 1376257, 12, 0, 1376258, 12, 0, 1376259, 12, 0, 1376260, 12, 0, 1376261, 12, 0, 1376262, 12, 0, 1376263, 12, 0, 1376264, 12, 0, 1376265, 12, 0, 1376266, 12, 0, 1376267, 12, 0, 1376268, 12, 0, 1376269, 12, 0, 1376270, 12, 0, 1376271, 12, 0, 1376272, 12, 0, 1376273, 12, 0, 1376274, 12, 0, 1376275, 12, 0, 1376276, 12, 0, 1376277, 12, 0, 1376278, 12, 0, 1376279, 12, 0, 1376280, 12, 0, 1376281, 12, 0, 1376282, 12, 0, 1376283, 12, 0, 1376284, 12, 0, 1376285, 0, 0, 1376286, 0, 0, 1376287, 0, 0, 1376288, 0, 0, 1376289, 0, 0, 1376290, 0, 0, 1376291, 0, 0, 1376292, 0, 0, 1376293, 0, 0, 1376294, 0, 0, 1376295, 12, 0, 1376296, 12, 0, 1376297, 12, 0, 1376298, 12, 0, 1376299, 12, 0, 1376300, 12, 0, 1376301, 12, 0, 1376302, 12, 0, 1376303, 12, 0, 1376304, 12, 0, 1376305, 12, 0, 1376306, 12, 0, 1376307, 12, 0, 1376308, 12, 0, 1376309, 12, 0, 1376310, 12, 0, 1376311, 12, 0, 1376312, 12, 0, 1376313, 12, 0, 1376314, 12, 0, 1376315, 12, 0, 1376316, 12, 0, 1376331, 12, 0, 1376332, 12, 0, 1376333, 12, 0, 1376334, 12, 0, 1376335, 12, 0, 1376336, 12, 0, 1376337, 12, 0, 1376338, 12, 0, 1376339, 12, 0, 1376340, 12, 0, 1376341, 12, 0, 1376342, 12, 0, 1376343, 12, 0, 1376344, 12, 0, 1376345, 12, 0, 1376346, 12, 0, 1376347, 12, 0, 1376348, 12, 0, 1441792, 12, 0, 1441793, 12, 0, 1441794, 12, 0, 1441795, 12, 0, 1441796, 12, 0, 1441797, 12, 0, 1441798, 12, 0, 1441799, 12, 0, 1441800, 12, 0, 1441801, 12, 0, 1441802, 12, 0, 1441803, 12, 0, 1441804, 12, 0, 1441805, 12, 0, 1441806, 12, 0, 1441807, 12, 0, 1441808, 12, 0, 1441809, 12, 0, 1441810, 12, 0, 1441811, 12, 0, 1441812, 12, 0, 1441813, 12, 0, 1441814, 12, 0, 1441815, 12, 0, 1441816, 12, 0, 1441817, 12, 0, 1441818, 12, 0, 1441819, 12, 0, 1441820, 12, 0, 1441821, 0, 0, 1441822, 0, 0, 1441823, 0, 0, 1441824, 0, 0, 1441825, 0, 0, 1441826, 0, 0, 1441827, 0, 0, 1441828, 0, 0, 1441829, 0, 0, 1441830, 0, 0, 1441831, 12, 0, 1441832, 12, 0, 1441833, 12, 0, 1441834, 12, 0, 1441835, 12, 0, 1441836, 12, 0, 1441837, 12, 0, 1441838, 12, 0, 1441839, 12, 0, 1441840, 12, 0, 1441841, 12, 0, 1441842, 12, 0, 1441843, 12, 0, 1441844, 12, 0, 1441845, 12, 0, 1441846, 12, 0, 1441847, 12, 0, 1441848, 12, 0, 1441849, 12, 0, 1441850, 12, 0, 1441851, 12, 0, 1441852, 12, 0, 1441853, 5, 0, 1441854, 5, 0, 1441855, 5, 0, 1441856, 5, 0, 1441857, 5, 0, 1441858, 5, 0, 1441859, 5, 0, 1441860, 5, 0, 1441861, 5, 0, 1441862, 5, 0, 1441863, 5, 0, 1441864, 5, 0, 1441865, 5, 0, 1441866, 5, 0, 1441867, 12, 0, 1441868, 12, 0, 1441869, 12, 0, 1441870, 12, 0, 1441871, 12, 0, 1441872, 12, 0, 1441873, 12, 0, 1441874, 12, 0, 1441875, 12, 0, 1441876, 12, 0, 1441877, 12, 0, 1441878, 12, 0, 1441879, 12, 0, 1441880, 12, 0, 1441881, 12, 0, 1441882, 12, 0, 1441883, 12, 0, 1441884, 12, 0 )

[node name="Sprite" type="Sprite" parent="TileMap/Background" index="0"]
position = Vector2( 2080, 256 )
texture = ExtResource( 7 )

[node name="Sprite" type="Sprite" parent="TileMap/Background/Sprite" index="0"]
position = Vector2( -71.9999, -8 )
texture = ExtResource( 6 )
flip_h = true

[node name="Gopher" parent="TileMap/Obstacles" index="0" instance=ExtResource( 3 )]
position = Vector2( 801.703, 543.695 )

[node name="Exit" parent="TileMap/Obstacles/Gopher" index="6" instance=ExtResource( 4 )]
position = Vector2( 480.557, 32.5801 )

[node name="Gopher2" parent="TileMap/Obstacles" index="1" instance=ExtResource( 3 )]
position = Vector2( 1506.02, 543.273 )

[node name="Exit" parent="TileMap/Obstacles/Gopher2" index="6" instance=ExtResource( 4 )]
position = Vector2( 160.984, -227.142 )

[node name="Fire2" parent="TileMap/Obstacles" index="2" instance=ExtResource( 5 )]
position = Vector2( 1824.41, 288.517 )

[node name="Fire3" parent="TileMap/Obstacles" index="3" instance=ExtResource( 5 )]
position = Vector2( 2976, 544 )

[node name="Spider" parent="TileMap/Obstacles" index="4" instance=ExtResource( 8 )]
position = Vector2( 2016, 224 )

[node name="Tiger" parent="TileMap/Obstacles" index="5" instance=ExtResource( 10 )]
position = Vector2( 2272, 352 )

[node name="Gopher3" parent="TileMap/Obstacles" index="6" instance=ExtResource( 3 )]
position = Vector2( 2912, 416 )

[node name="Exit" parent="TileMap/Obstacles/Gopher3" index="6" instance=ExtResource( 4 )]
position = Vector2( -288, 160 )

[node name="Thorns" parent="TileMap/Obstacles" index="7" instance=ExtResource( 9 )]
position = Vector2( 3360, 544 )

[node name="Thorns2" parent="TileMap/Obstacles" index="8" instance=ExtResource( 9 )]
position = Vector2( 3296, 544 )

[node name="Thorns3" parent="TileMap/Obstacles" index="9" instance=ExtResource( 9 )]
position = Vector2( 3232, 544 )

[node name="GopherTL" parent="TileMap/Obstacles" index="10" instance=ExtResource( 3 )]
position = Vector2( 4256, 792 )

[node name="Exit" parent="TileMap/Obstacles/GopherTL" index="6" instance=ExtResource( 4 )]
position = Vector2( -1312, 104 )

[node name="GopherML" parent="TileMap/Obstacles" index="11" instance=ExtResource( 3 )]
position = Vector2( 4128, 1056 )

[node name="Exit" parent="TileMap/Obstacles/GopherML" index="6" instance=ExtResource( 4 )]
position = Vector2( -1120, -160 )

[node name="GopherMR_W" parent="TileMap/Obstacles" index="12" instance=ExtResource( 3 )]
position = Vector2( 4576, 1056 )

[node name="Exit" parent="TileMap/Obstacles/GopherMR_W" index="6" instance=ExtResource( 4 )]
position = Vector2( 352, -736 )

[node name="GopherBLL" parent="TileMap/Obstacles" index="13" instance=ExtResource( 3 )]
position = Vector2( 4000, 1368 )

[node name="Exit" parent="TileMap/Obstacles/GopherBLL" index="6" instance=ExtResource( 4 )]
position = Vector2( -1056, -280 )

[node name="GopherBL" parent="TileMap/Obstacles" index="14" instance=ExtResource( 3 )]
position = Vector2( 4256, 1368 )

[node name="Exit" parent="TileMap/Obstacles/GopherBL" index="6" instance=ExtResource( 4 )]
position = Vector2( -1184, -472 )

[node name="GopherBR" parent="TileMap/Obstacles" index="15" instance=ExtResource( 3 )]
position = Vector2( 4448, 1368 )

[node name="Exit" parent="TileMap/Obstacles/GopherBR" index="6" instance=ExtResource( 4 )]
position = Vector2( -1312, -472 )

[node name="GopherBRR" parent="TileMap/Obstacles" index="16" instance=ExtResource( 3 )]
position = Vector2( 4704, 1368 )

[node name="Exit" parent="TileMap/Obstacles/GopherBRR" index="6" instance=ExtResource( 4 )]
position = Vector2( -1504, -472 )

[node name="GopherTR" parent="TileMap/Obstacles" index="17" instance=ExtResource( 3 )]
position = Vector2( 4448, 800 )

[node name="Exit" parent="TileMap/Obstacles/GopherTR" index="6" instance=ExtResource( 4 )]
position = Vector2( -1184, 96 )

[node name="GopherMLL" parent="TileMap/Obstacles" index="18" instance=ExtResource( 3 )]
position = Vector2( 3936, 1048 )

[node name="Exit" parent="TileMap/Obstacles/GopherMLL" index="6" instance=ExtResource( 4 )]
position = Vector2( -608, -152 )

[node name="GopherMRR" parent="TileMap/Obstacles" index="19" instance=ExtResource( 3 )]
position = Vector2( 4768, 1056 )

[node name="Exit" parent="TileMap/Obstacles/GopherMRR" index="6" instance=ExtResource( 4 )]
position = Vector2( -1368, -160 )

[node name="Gopher4" parent="TileMap/Obstacles" index="20" instance=ExtResource( 3 )]
position = Vector2( 3808, 864 )

[node name="Exit" parent="TileMap/Obstacles/Gopher4" index="6" instance=ExtResource( 4 )]
position = Vector2( -160, -160 )

[node name="Gopher5" parent="TileMap/Obstacles" index="21" instance=ExtResource( 3 )]
position = Vector2( 3808, 1056 )

[node name="Exit" parent="TileMap/Obstacles/Gopher5" index="6" instance=ExtResource( 4 )]
position = Vector2( -224, -544 )

[node name="Bread" parent="TileMap/Tools" index="0" instance=ExtResource( 11 )]
position = Vector2( 3304, 1056 )

[node name="Start" parent="TileMap" index="4"]
position = Vector2( 288, 577.138 )

[node name="Goal" parent="TileMap" index="5"]
position = Vector2( 5648, 320 )

[node name="Node2D" type="Node2D" parent="TileMap/Waypoints" index="0"]
position = Vector2( 4736, 320 )

[node name="Node2D2" type="Node2D" parent="TileMap/Waypoints" index="1"]
position = Vector2( 4736, 1280 )

[node name="Node2D3" type="Node2D" parent="TileMap/Waypoints" index="2"]
position = Vector2( 3944, 1280 )

[node name="Node2D4" type="Node2D" parent="TileMap/Waypoints" index="3"]
position = Vector2( 3944, 496 )

[node name="Node2D5" type="Node2D" parent="TileMap/Waypoints" index="4"]
position = Vector2( 2824, 496 )

[node name="Node2D6" type="Node2D" parent="TileMap/Waypoints" index="5"]
position = Vector2( 1360, 496 )

[node name="HBoxContainer" parent="CanvasLayer/UI/Hotbar/Container" index="0"]
margin_left = 450.0
margin_right = 830.0

[node name="Frog" parent="CanvasLayer/UI/Hotbar/Container/HBoxContainer" index="0"]
quantity = 12

[node name="SuperFrog" parent="CanvasLayer/UI/Hotbar/Container/HBoxContainer" index="1"]
visible = false

[node name="Eagle" parent="CanvasLayer/UI/Hotbar/Container/HBoxContainer" index="2"]
margin_left = 96.0
margin_right = 188.0
quantity = 4

[node name="SuperEagle" parent="CanvasLayer/UI/Hotbar/Container/HBoxContainer" index="3"]
visible = false

[node name="Blocker" parent="CanvasLayer/UI/Hotbar/Container/HBoxContainer" index="4"]
margin_left = 192.0
margin_right = 284.0
quantity = 4

[node name="Umbrella" parent="CanvasLayer/UI/Hotbar/Container/HBoxContainer" index="5"]
margin_left = 288.0
margin_right = 380.0

[editable path="CanvasLayer/UI/Hotbar"]
