[gd_scene load_steps=18 format=2]

[ext_resource path="res://tiles/simple_tileset.tres" type="TileSet" id=1]
[ext_resource path="res://tools/umbrella/Umbrella.tscn" type="PackedScene" id=2]
[ext_resource path="res://levels/Level.tscn" type="PackedScene" id=3]
[ext_resource path="res://obstacles/hazards/Thorns.tscn" type="PackedScene" id=4]
[ext_resource path="res://obstacles/hazards/Fire.tscn" type="PackedScene" id=5]
[ext_resource path="res://tiles/background/branch.png" type="Texture" id=6]
[ext_resource path="res://tiles/background/branch base.png" type="Texture" id=7]
[ext_resource path="res://tiles/background/leaves.png" type="Texture" id=8]
[ext_resource path="res://tiles/background/tree.png" type="Texture" id=9]
[ext_resource path="res://tiles/background/branch2usb.png" type="Texture" id=10]
[ext_resource path="res://obstacles/spider/Spider.tscn" type="PackedScene" id=11]
[ext_resource path="res://tiles/background/lil bush.png" type="Texture" id=12]
[ext_resource path="res://tiles/background/ferns.png" type="Texture" id=13]
[ext_resource path="res://obstacles/tiger/Tiger.tscn" type="PackedScene" id=14]
[ext_resource path="res://tools/bread/Bread.tscn" type="PackedScene" id=15]
[ext_resource path="res://obstacles/hazards/KillBox.tscn" type="PackedScene" id=16]

[sub_resource type="RectangleShape2D" id=1]
extents = Vector2( 10, 608 )

[node name="LevelThree" instance=ExtResource( 3 )]
showcase_map = true
showcase_time = 10.0
showcase_delay = 2.0

[node name="BGTileMap" parent="." index="1"]
tile_set = ExtResource( 1 )
tile_data = PoolIntArray( 0, 16, 0, 1, 16, 0, 2, 16, 0, 3, 16, 0, 4, 16, 0, 5, 16, 0, 6, 16, 0, 7, 16, 0, 8, 16, 0, 9, 16, 0, 10, 16, 0, 11, 16, 0, 12, 16, 0, 13, 16, 0, 14, 16, 0, 15, 16, 0, 16, 16, 0, 17, 16, 0, 18, 16, 0, 19, 16, 0, 20, 16, 0, 21, 16, 0, 22, 16, 0, 23, 16, 0, 24, 16, 0, 25, 16, 0, 26, 16, 0, 27, 16, 0, 28, 16, 0, 29, 16, 0, 30, 16, 0, 31, 16, 0, 32, 16, 0, 33, 16, 0, 34, 16, 0, 35, 16, 0, 36, 16, 0, 37, 16, 0, 38, 16, 0, 39, 16, 0, 40, 16, 0, 41, 16, 0, 42, 16, 0, 65536, 16, 0, 65537, 16, 0, 65538, 16, 0, 65539, 16, 0, 65540, 16, 0, 65541, 16, 0, 65542, 16, 0, 65543, 16, 0, 65544, 16, 0, 65545, 16, 0, 65546, 16, 0, 65547, 16, 0, 65548, 16, 0, 65549, 16, 0, 65550, 16, 0, 65551, 16, 0, 65552, 16, 0, 65553, 16, 0, 65554, 16, 0, 65555, 16, 0, 65556, 16, 0, 65557, 16, 0, 65558, 16, 0, 65559, 16, 0, 65560, 16, 0, 65561, 16, 0, 65562, 16, 0, 65563, 16, 0, 65564, 16, 0, 65565, 16, 0, 65566, 16, 0, 65567, 16, 0, 65568, 16, 0, 65569, 16, 0, 65570, 16, 0, 65571, 16, 0, 65572, 16, 0, 65573, 16, 0, 65574, 16, 0, 65575, 16, 0, 65576, 16, 0, 65577, 16, 0, 65578, 16, 0, 131072, 16, 0, 131073, 16, 0, 131074, 16, 0, 131075, 16, 0, 131076, 16, 0, 131077, 16, 0, 131078, 16, 0, 131079, 16, 0, 131080, 16, 0, 131081, 16, 0, 131082, 16, 0, 131083, 16, 0, 131084, 16, 0, 131085, 16, 0, 131086, 16, 0, 131087, 16, 0, 131088, 16, 0, 131089, 16, 0, 131090, 16, 0, 131091, 16, 0, 131092, 16, 0, 131093, 16, 0, 131094, 16, 0, 131095, 16, 0, 131096, 16, 0, 131097, 16, 0, 131098, 16, 0, 131099, 16, 0, 131100, 16, 0, 131101, 16, 0, 131102, 16, 0, 131103, 16, 0, 131104, 16, 0, 131105, 16, 0, 131106, 16, 0, 131107, 16, 0, 131108, 16, 0, 131109, 16, 0, 131110, 16, 0, 131111, 16, 0, 131112, 16, 0, 131113, 16, 0, 131114, 16, 0, 196608, 16, 0, 196609, 16, 0, 196610, 16, 0, 196611, 16, 0, 196612, 16, 0, 196613, 16, 0, 196614, 16, 0, 196615, 16, 0, 196616, 16, 0, 196617, 16, 0, 196618, 16, 0, 196619, 16, 0, 196620, 16, 0, 196621, 16, 0, 196622, 16, 0, 196623, 16, 0, 196624, 16, 0, 196625, 16, 0, 196626, 16, 0, 196627, 16, 0, 196628, 16, 0, 196629, 16, 0, 196630, 16, 0, 196631, 16, 0, 196632, 16, 0, 196633, 16, 0, 196634, 16, 0, 196635, 16, 0, 196636, 16, 0, 196637, 16, 0, 196638, 16, 0, 196639, 16, 0, 196640, 16, 0, 196641, 16, 0, 196642, 16, 0, 196643, 16, 0, 196644, 16, 0, 196645, 16, 0, 196646, 16, 0, 196647, 16, 0, 196648, 16, 0, 196649, 16, 0, 196650, 16, 0, 262144, 16, 0, 262145, 16, 0, 262146, 16, 0, 262147, 16, 0, 262148, 16, 0, 262149, 16, 0, 262150, 16, 0, 262151, 16, 0, 262152, 16, 0, 262153, 16, 0, 262154, 16, 0, 262155, 16, 0, 262156, 16, 0, 262157, 16, 0, 262158, 16, 0, 262159, 16, 0, 262160, 16, 0, 262161, 16, 0, 262162, 16, 0, 262163, 16, 0, 262164, 16, 0, 262165, 16, 0, 262166, 16, 0, 262167, 16, 0, 262168, 16, 0, 262169, 16, 0, 262170, 16, 0, 262171, 16, 0, 262172, 16, 0, 262173, 16, 0, 262174, 16, 0, 262175, 16, 0, 262176, 16, 0, 262177, 16, 0, 262178, 16, 0, 262179, 16, 0, 262180, 16, 0, 262181, 16, 0, 262182, 16, 0, 262183, 16, 0, 262184, 16, 0, 262185, 16, 0, 262186, 16, 0, 327680, 16, 0, 327681, 16, 0, 327682, 16, 0, 327683, 16, 0, 327684, 16, 0, 327685, 16, 0, 327686, 16, 0, 327687, 16, 0, 327688, 16, 0, 327689, 16, 0, 327690, 16, 0, 327691, 16, 0, 327692, 16, 0, 327693, 16, 0, 327694, 16, 0, 327695, 16, 0, 327696, 16, 0, 327697, 16, 0, 327698, 16, 0, 327699, 16, 0, 327700, 16, 0, 327701, 16, 0, 327702, 16, 0, 327703, 16, 0, 327704, 16, 0, 327705, 16, 0, 327706, 16, 0, 327707, 16, 0, 327708, 16, 0, 327709, 16, 0, 327710, 16, 0, 327711, 16, 0, 327712, 16, 0, 327713, 16, 0, 327714, 16, 0, 327715, 16, 0, 327716, 16, 0, 327717, 16, 0, 327718, 16, 0, 327719, 16, 0, 327720, 16, 0, 327721, 16, 0, 327722, 16, 0, 393216, 16, 0, 393217, 16, 0, 393218, 16, 0, 393219, 16, 0, 393220, 16, 0, 393221, 16, 0, 393222, 16, 0, 393223, 16, 0, 393224, 16, 0, 393225, 16, 0, 393226, 16, 0, 393227, 16, 0, 393228, 16, 0, 393229, 16, 0, 393230, 16, 0, 393231, 16, 0, 393232, 16, 0, 393233, 16, 0, 393234, 16, 0, 393235, 16, 0, 393236, 16, 0, 393237, 16, 0, 393238, 16, 0, 393239, 16, 0, 393240, 16, 0, 393241, 16, 0, 393242, 16, 0, 393243, 16, 0, 393244, 16, 0, 393245, 16, 0, 393246, 16, 0, 393247, 16, 0, 393248, 16, 0, 393249, 16, 0, 393250, 16, 0, 393251, 16, 0, 393252, 16, 0, 393253, 16, 0, 393254, 16, 0, 393255, 16, 0, 393256, 16, 0, 393257, 16, 0, 393258, 16, 0, 458752, 16, 0, 458753, 16, 0, 458754, 16, 0, 458755, 16, 0, 458756, 16, 0, 458757, 16, 0, 458758, 16, 0, 458759, 16, 0, 458760, 16, 0, 458761, 16, 0, 458762, 16, 0, 458763, 16, 0, 458764, 16, 0, 458765, 16, 0, 458766, 16, 0, 458767, 16, 0, 458768, 16, 0, 458769, 16, 0, 458770, 16, 0, 458771, 16, 0, 458772, 16, 0, 458773, 16, 0, 458774, 16, 0, 458775, 16, 0, 458776, 16, 0, 458777, 16, 0, 458778, 16, 0, 458779, 16, 0, 458780, 16, 0, 458781, 16, 0, 458782, 16, 0, 458783, 16, 0, 458784, 16, 0, 458785, 16, 0, 458786, 16, 0, 458787, 16, 0, 458788, 16, 0, 458789, 16, 0, 458790, 16, 0, 458791, 16, 0, 458792, 16, 0, 458793, 16, 0, 458794, 16, 0, 524288, 16, 0, 524289, 16, 0, 524290, 16, 0, 524291, 16, 0, 524292, 16, 0, 524293, 16, 0, 524294, 16, 0, 524295, 16, 0, 524296, 16, 0, 524297, 16, 0, 524298, 16, 0, 524299, 16, 0, 524300, 16, 0, 524301, 16, 0, 524302, 16, 0, 524303, 16, 0, 524304, 16, 0, 524305, 16, 0, 524306, 16, 0, 524307, 16, 0, 524308, 16, 0, 524309, 16, 0, 524310, 16, 0, 524311, 16, 0, 524312, 16, 0, 524313, 16, 0, 524314, 16, 0, 524315, 16, 0, 524316, 16, 0, 524317, 16, 0, 524318, 16, 0, 524319, 16, 0, 524320, 16, 0, 524321, 16, 0, 524322, 16, 0, 524323, 16, 0, 524324, 16, 0, 524325, 16, 0, 524326, 16, 0, 524327, 16, 0, 524328, 16, 0, 524329, 16, 0, 524330, 16, 0, 589824, 16, 0, 589825, 16, 0, 589826, 16, 0, 589827, 16, 0, 589828, 16, 0, 589829, 16, 0, 589830, 16, 0, 589831, 16, 0, 589832, 16, 0, 589833, 16, 0, 589834, 16, 0, 589835, 16, 0, 589836, 16, 0, 589837, 16, 0, 589838, 16, 0, 589839, 16, 0, 589840, 16, 0, 589841, 16, 0, 589842, 16, 0, 589843, 16, 0, 589844, 16, 0, 589845, 16, 0, 589846, 16, 0, 589847, 16, 0, 589848, 16, 0, 589849, 16, 0, 589850, 16, 0, 589851, 16, 0, 589852, 16, 0, 589853, 16, 0, 589854, 16, 0, 589855, 16, 0, 589856, 16, 0, 589857, 16, 0, 589858, 16, 0, 589859, 16, 0, 589860, 16, 0, 589861, 16, 0, 589862, 16, 0, 589863, 16, 0, 589864, 16, 0, 589865, 16, 0, 589866, 16, 0, 655360, 16, 0, 655361, 16, 0, 655362, 16, 0, 655363, 16, 0, 655364, 16, 0, 655365, 16, 0, 655366, 16, 0, 655367, 16, 0, 655368, 16, 0, 655369, 16, 0, 655370, 16, 0, 655371, 16, 0, 655372, 16, 0, 655373, 16, 0, 655374, 16, 0, 655375, 16, 0, 655376, 16, 0, 655377, 16, 0, 655378, 16, 0, 655379, 16, 0, 655380, 16, 0, 655381, 16, 0, 655382, 16, 0, 655383, 16, 0, 655384, 16, 0, 655385, 16, 0, 655386, 16, 0, 655387, 16, 0, 655388, 16, 0, 655389, 16, 0, 655390, 16, 0, 655391, 16, 0, 655392, 16, 0, 655393, 16, 0, 655394, 16, 0, 655395, 16, 0, 655396, 16, 0, 655397, 16, 0, 655398, 16, 0, 655399, 16, 0, 655400, 16, 0, 655401, 16, 0, 655402, 16, 0, 720896, 16, 0, 720897, 16, 0, 720898, 16, 0, 720899, 16, 0, 720900, 16, 0, 720901, 16, 0, 720902, 16, 0, 720903, 16, 0, 720904, 16, 0, 720905, 16, 0, 720906, 16, 0, 720907, 16, 0, 720908, 16, 0, 720909, 16, 0, 720910, 16, 0, 720911, 16, 0, 720912, 16, 0, 720913, 16, 0, 720914, 16, 0, 720915, 16, 0, 720916, 16, 0, 720917, 16, 0, 720918, 16, 0, 720919, 16, 0, 720920, 16, 0, 720921, 16, 0, 720922, 16, 0, 720923, 16, 0, 720924, 16, 0, 720925, 16, 0, 720926, 16, 0, 720927, 16, 0, 720928, 16, 0, 720929, 16, 0, 720930, 16, 0, 720931, 16, 0, 720932, 16, 0, 720933, 16, 0, 720934, 16, 0, 720935, 16, 0, 720936, 16, 0, 720937, 16, 0, 720938, 16, 0, 786432, 16, 0, 786433, 16, 0, 786434, 16, 0, 786435, 16, 0, 786436, 16, 0, 786437, 16, 0, 786438, 16, 0, 786439, 16, 0, 786440, 16, 0, 786441, 16, 0, 786442, 16, 0, 786443, 16, 0, 786444, 16, 0, 786445, 16, 0, 786446, 16, 0, 786447, 16, 0, 786448, 16, 0, 786449, 16, 0, 786450, 16, 0, 786451, 16, 0, 786452, 16, 0, 786453, 16, 0, 786454, 16, 0, 786455, 16, 0, 786456, 16, 0, 786457, 16, 0, 786458, 16, 0, 786459, 16, 0, 786460, 16, 0, 786461, 16, 0, 786462, 16, 0, 786463, 16, 0, 786464, 16, 0, 786465, 16, 0, 786466, 16, 0, 786467, 16, 0, 786468, 16, 0, 786469, 16, 0, 786470, 16, 0, 786471, 16, 0, 786472, 16, 0, 786473, 16, 0, 786474, 16, 0, 851968, 16, 0, 851969, 16, 0, 851970, 16, 0, 851971, 16, 0, 851972, 16, 0, 851973, 16, 0, 851974, 16, 0, 851975, 16, 0, 851976, 16, 0, 851977, 16, 0, 851978, 16, 0, 851979, 16, 0, 851980, 16, 0, 851981, 16, 0, 851982, 16, 0, 851983, 16, 0, 851984, 16, 0, 851985, 16, 0, 851986, 16, 0, 851987, 16, 0, 851988, 16, 0, 851989, 16, 0, 851990, 16, 0, 851991, 16, 0, 851992, 16, 0, 851993, 16, 0, 851994, 16, 0, 851995, 16, 0, 851996, 16, 0, 851997, 16, 0, 851998, 16, 0, 851999, 16, 0, 852000, 16, 0, 852001, 16, 0, 852002, 16, 0, 852003, 16, 0, 852004, 16, 0, 852005, 16, 0, 852006, 16, 0, 852007, 16, 0, 852008, 16, 0, 852009, 16, 0, 852010, 16, 0, 917504, 15, 0, 917505, 15, 0, 917506, 15, 0, 917507, 15, 0, 917508, 15, 0, 917509, 15, 0, 917510, 15, 0, 917511, 15, 0, 917512, 15, 0, 917513, 15, 0, 917514, 15, 0, 917515, 15, 0, 917516, 15, 0, 917517, 15, 0, 917518, 15, 0, 917519, 15, 0, 917520, 15, 0, 917521, 15, 0, 917522, 15, 0, 917523, 15, 0, 917524, 15, 0, 917525, 15, 0, 917526, 15, 0, 917527, 15, 0, 917528, 15, 0, 917529, 15, 0, 917530, 15, 0, 917531, 15, 0, 917532, 15, 0, 917533, 15, 0, 917534, 15, 0, 917535, 15, 0, 917536, 15, 0, 917537, 15, 0, 917538, 15, 0, 917539, 15, 0, 917540, 15, 0, 917541, 15, 0, 917542, 15, 0, 917543, 15, 0, 917544, 15, 0, 917545, 15, 0, 917546, 15, 0, 983040, 15, 0, 983041, 15, 0, 983042, 15, 0, 983043, 15, 0, 983044, 15, 0, 983045, 15, 0, 983046, 15, 0, 983047, 15, 0, 983048, 15, 0, 983049, 15, 0, 983050, 15, 0, 983051, 15, 0, 983052, 15, 0, 983053, 15, 0, 983054, 15, 0, 983055, 15, 0, 983056, 15, 0, 983057, 15, 0, 983058, 15, 0, 983059, 15, 0, 983060, 15, 0, 983061, 15, 0, 983062, 15, 0, 983063, 15, 0, 983064, 15, 0, 983065, 15, 0, 983066, 15, 0, 983067, 15, 0, 983068, 15, 0, 983069, 15, 0, 983070, 15, 0, 983071, 15, 0, 983072, 15, 0, 983073, 15, 0, 983074, 15, 0, 983075, 15, 0, 983076, 15, 0, 983077, 15, 0, 983078, 15, 0, 983079, 15, 0, 983080, 15, 0, 983081, 15, 0, 983082, 15, 0, 1048576, 15, 0, 1048577, 15, 0, 1048578, 15, 0, 1048579, 15, 0, 1048580, 15, 0, 1048581, 15, 0, 1048582, 15, 0, 1048583, 15, 0, 1048584, 15, 0, 1048585, 15, 0, 1048586, 15, 0, 1048587, 15, 0, 1048588, 15, 0, 1048589, 15, 0, 1048590, 15, 0, 1048591, 15, 0, 1048592, 15, 0, 1048593, 15, 0, 1048594, 15, 0, 1048595, 15, 0, 1048596, 15, 0, 1048597, 15, 0, 1048598, 15, 0, 1048599, 15, 0, 1048600, 15, 0, 1048601, 15, 0, 1048602, 15, 0, 1048603, 15, 0, 1048604, 15, 0, 1048605, 15, 0, 1048606, 15, 0, 1048607, 15, 0, 1048608, 15, 0, 1048609, 15, 0, 1048610, 15, 0, 1048611, 15, 0, 1048612, 15, 0, 1048613, 15, 0, 1048614, 15, 0, 1048615, 15, 0, 1048616, 15, 0, 1048617, 15, 0, 1048618, 15, 0, 1114112, 15, 0, 1114113, 15, 0, 1114114, 15, 0, 1114115, 15, 0, 1114116, 15, 0, 1114117, 15, 0, 1114118, 16, 0, 1114119, 15, 0, 1114120, 15, 0, 1114121, 16, 0, 1114122, 16, 0, 1114123, 15, 0, 1114124, 15, 0, 1114125, 15, 0, 1114126, 15, 0, 1114127, 16, 0, 1114128, 15, 0, 1114129, 15, 0, 1114130, 15, 0, 1114131, 15, 0, 1114132, 15, 0, 1114133, 15, 0, 1114134, 15, 0, 1114135, 15, 0, 1114136, 15, 0, 1114137, 15, 0, 1114138, 15, 0, 1114139, 15, 0, 1114140, 15, 0, 1114141, 15, 0, 1114142, 15, 0, 1114143, 15, 0, 1114144, 15, 0, 1114145, 15, 0, 1114146, 15, 0, 1114147, 15, 0, 1114148, 15, 0, 1114149, 15, 0, 1114150, 15, 0, 1114151, 15, 0, 1114152, 15, 0, 1114153, 15, 0, 1114154, 15, 0, 1179648, 16, 0, 1179649, 16, 0, 1179650, 16, 0, 1179651, 16, 0, 1179652, 16, 0, 1179653, 16, 0, 1179654, 0, 0, 1179655, 0, 0, 1179656, 0, 0, 1179657, 0, 0, 1179658, 0, 0, 1179659, 16, 0, 1179660, 16, 0, 1179661, 16, 0, 1179662, 16, 0, 1179663, 16, 0, 1179664, 15, 0, 1179665, 15, 0, 1179666, 15, 0, 1179667, 15, 0, 1179668, 15, 0, 1179669, 15, 0, 1179670, 15, 0, 1179671, 15, 0, 1179672, 15, 0, 1179673, 15, 0, 1179674, 15, 0, 1179675, 15, 0, 1179676, 15, 0, 1179677, 15, 0, 1179678, 15, 0, 1179679, 15, 0, 1179680, 15, 0, 1179681, 15, 0, 1179682, 15, 0, 1179683, 15, 0, 1179684, 15, 0, 1179685, 15, 0, 1179686, 15, 0, 1179687, 15, 0, 1179688, 15, 0, 1179689, 15, 0, 1179690, 15, 0, 1245184, 16, 0, 1245185, 16, 0, 1245186, 16, 0, 1245187, 16, 0, 1245188, 16, 0, 1245189, 16, 0, 1245190, 16, 0, 1245191, 16, 0, 1245192, 16, 0, 1245193, 16, 0, 1245194, 16, 0, 1245195, 16, 0, 1245196, 16, 0, 1245197, 16, 0, 1245198, 16, 0, 1245199, 16, 0, 1245200, 14, 0, 1245201, 14, 0, 1245202, 14, 0, 1245203, 14, 0, 1245204, 14, 0, 1245205, 14, 0, 1245206, 14, 0, 1245207, 14, 0, 1245208, 14, 0, 1245209, 14, 0, 1245210, 14, 0, 1245211, 14, 0, 1245212, 14, 0, 1245213, 14, 0, 1245214, 14, 0, 1245215, 14, 0, 1245216, 14, 0, 1245217, 14, 0, 1245218, 14, 0, 1245219, 14, 0, 1245220, 14, 0, 1245221, 14, 0, 1245222, 14, 0, 1245223, 14, 0, 1245224, 14, 0, 1245225, 14, 0, 1245226, 14, 0, 1310720, 16, 0, 1310721, 16, 0, 1310722, 16, 0, 1310723, 16, 0, 1310724, 16, 0, 1310725, 16, 0, 1310726, 16, 0, 1310727, 16, 0, 1310728, 16, 0, 1310729, 16, 0, 1310730, 16, 0, 1310731, 16, 0, 1310732, 16, 0, 1310733, 16, 0, 1310734, 16, 0, 1310735, 16, 0, 1310736, 14, 0, 1310737, 14, 0, 1310738, 14, 0, 1310739, 14, 0, 1310740, 14, 0, 1310741, 14, 0, 1310742, 14, 0, 1310743, 14, 0, 1310744, 14, 0, 1310745, 14, 0, 1310746, 14, 0, 1310747, 14, 0, 1310748, 14, 0, 1310749, 14, 0, 1310750, 14, 0, 1310751, 14, 0, 1310752, 14, 0, 1310753, 14, 0, 1310754, 14, 0, 1310755, 14, 0, 1310756, 14, 0, 1310757, 14, 0, 1310758, 14, 0, 1310759, 14, 0, 1310760, 14, 0, 1310761, 14, 0, 1310762, 14, 0, 1376256, 16, 0, 1376257, 16, 0, 1376258, 16, 0, 1376259, 16, 0, 1376260, 16, 0, 1376261, 16, 0, 1376262, 16, 0, 1376263, 16, 0, 1376264, 16, 0, 1376265, 16, 0, 1376266, 16, 0, 1376267, 16, 0, 1376268, 16, 0, 1376269, 16, 0, 1376270, 16, 0, 1376271, 16, 0, 1376272, 14, 0, 1376273, 14, 0, 1376274, 14, 0, 1376275, 14, 0, 1376276, 14, 0, 1376277, 14, 0, 1376278, 14, 0, 1376279, 14, 0, 1376280, 14, 0, 1376281, 14, 0, 1376282, 14, 0, 1376283, 14, 0, 1376284, 14, 0, 1376285, 14, 0, 1376286, 14, 0, 1376287, 14, 0, 1376288, 14, 0, 1376289, 14, 0, 1376290, 14, 0, 1376291, 14, 0, 1376292, 14, 0, 1376293, 14, 0, 1376294, 14, 0, 1376295, 14, 0, 1376296, 14, 0, 1376297, 14, 0, 1376298, 14, 0, 1441792, 16, 0, 1441793, 16, 0, 1441794, 16, 0, 1441795, 16, 0, 1441796, 16, 0, 1441797, 16, 0, 1441798, 16, 0, 1441799, 16, 0, 1441800, 16, 0, 1441801, 16, 0, 1441802, 16, 0, 1441803, 16, 0, 1441804, 16, 0, 1441805, 16, 0, 1441806, 16, 0, 1441807, 16, 0, 1441808, 14, 0, 1441809, 14, 0, 1441810, 14, 0, 1441811, 14, 0, 1441812, 14, 0, 1441813, 14, 0, 1441814, 14, 0, 1441815, 14, 0, 1441816, 14, 0, 1441817, 14, 0, 1441818, 14, 0, 1441819, 14, 0, 1441820, 14, 0, 1441821, 14, 0, 1441822, 14, 0, 1441823, 14, 0, 1441824, 14, 0, 1441825, 14, 0, 1441826, 14, 0, 1441827, 14, 0, 1441828, 14, 0, 1441829, 14, 0, 1441830, 14, 0, 1441831, 14, 0, 1441832, 14, 0, 1441833, 14, 0, 1441834, 14, 0, 1507328, 16, 0, 1507329, 16, 0, 1507330, 16, 0, 1507331, 16, 0, 1507332, 16, 0, 1507333, 16, 0, 1507334, 16, 0, 1507335, 16, 0, 1507336, 16, 0, 1507337, 16, 0, 1507338, 16, 0, 1507339, 16, 0, 1507340, 16, 0, 1507341, 16, 0, 1507342, 16, 0, 1507343, 16, 0, 1507344, 14, 0, 1507345, 14, 0, 1507346, 14, 0, 1507347, 14, 0, 1507348, 14, 0, 1507349, 14, 0, 1507350, 14, 0, 1507351, 14, 0, 1507352, 14, 0, 1507353, 14, 0, 1507354, 14, 0, 1507355, 14, 0, 1507356, 14, 0, 1507357, 14, 0, 1507358, 14, 0, 1507359, 14, 0, 1507360, 14, 0, 1507361, 14, 0, 1507362, 14, 0, 1507363, 14, 0, 1507364, 14, 0, 1507365, 14, 0, 1507366, 14, 0, 1507367, 14, 0, 1507368, 14, 0, 1507369, 14, 0, 1507370, 14, 0, 1572864, 16, 0, 1572865, 16, 0, 1572866, 16, 0, 1572867, 16, 0, 1572868, 16, 0, 1572869, 16, 0, 1572870, 16, 0, 1572871, 16, 0, 1572872, 16, 0, 1572873, 16, 0, 1572874, 16, 0, 1572875, 16, 0, 1572876, 16, 0, 1572877, 16, 0, 1572878, 16, 0, 1572879, 16, 0, 1572880, 14, 0, 1572881, 14, 0, 1572882, 14, 0, 1572883, 14, 0, 1572884, 14, 0, 1572885, 14, 0, 1572886, 14, 0, 1572887, 14, 0, 1572888, 14, 0, 1572889, 14, 0, 1572890, 14, 0, 1572891, 14, 0, 1572892, 14, 0, 1572893, 14, 0, 1572894, 14, 0, 1572895, 14, 0, 1572896, 14, 0, 1572897, 14, 0, 1572898, 14, 0, 1572899, 14, 0, 1572900, 14, 0, 1572901, 14, 0, 1572902, 14, 0, 1572903, 14, 0, 1572904, 14, 0, 1572905, 14, 0, 1572906, 14, 0, 1638400, 16, 0, 1638401, 16, 0, 1638402, 16, 0, 1638403, 16, 0, 1638404, 16, 0, 1638405, 16, 0, 1638406, 16, 0, 1638407, 16, 0, 1638408, 16, 0, 1638409, 16, 0, 1638410, 16, 0, 1638411, 16, 0, 1638412, 16, 0, 1638413, 16, 0, 1638414, 16, 0, 1638415, 16, 0, 1638416, 14, 0, 1638417, 14, 0, 1638418, 14, 0, 1638419, 14, 0, 1638420, 14, 0, 1638421, 14, 0, 1638422, 14, 0, 1638423, 14, 0, 1638424, 14, 0, 1638425, 14, 0, 1638426, 14, 0, 1638427, 14, 0, 1638428, 14, 0, 1638429, 14, 0, 1638430, 14, 0, 1638431, 14, 0, 1638432, 14, 0, 1638433, 14, 0, 1638434, 14, 0, 1638435, 14, 0, 1638436, 14, 0, 1638437, 14, 0, 1638438, 14, 0, 1638439, 14, 0, 1638440, 14, 0, 1638441, 14, 0, 1638442, 14, 0, 1703936, 16, 0, 1703937, 16, 0, 1703938, 16, 0, 1703939, 16, 0, 1703940, 16, 0, 1703941, 16, 0, 1703942, 16, 0, 1703943, 16, 0, 1703944, 16, 0, 1703945, 16, 0, 1703946, 16, 0, 1703947, 16, 0, 1703948, 16, 0, 1703949, 16, 0, 1703950, 16, 0, 1703951, 16, 0, 1703952, 14, 0, 1703953, 14, 0, 1703954, 14, 0, 1703955, 14, 0, 1703956, 14, 0, 1703957, 14, 0, 1703958, 14, 0, 1703959, 14, 0, 1703960, 14, 0, 1703961, 14, 0, 1703962, 14, 0, 1703963, 14, 0, 1703964, 14, 0, 1703965, 14, 0, 1703966, 14, 0, 1703967, 14, 0, 1703968, 14, 0, 1703969, 14, 0, 1703970, 14, 0, 1703971, 14, 0, 1703972, 14, 0, 1703973, 14, 0, 1703974, 14, 0, 1703975, 14, 0, 1703976, 14, 0, 1703977, 14, 0, 1703978, 14, 0, 1769472, 16, 0, 1769473, 16, 0, 1769474, 16, 0, 1769475, 16, 0, 1769476, 16, 0, 1769477, 16, 0, 1769478, 16, 0, 1769479, 16, 0, 1769480, 16, 0, 1769481, 16, 0, 1769482, 16, 0, 1769483, 16, 0, 1769484, 16, 0, 1769485, 16, 0, 1769486, 16, 0, 1769487, 16, 0, 1769488, 16, 0, 1769489, 16, 0, 1769490, 16, 0, 1769491, 16, 0, 1769492, 16, 0, 1769493, 16, 0, 1769494, 16, 0, 1769495, 16, 0, 1769496, 16, 0, 1769497, 14, 0, 1769498, 14, 0, 1769499, 14, 0, 1769500, 14, 0, 1769501, 14, 0, 1769502, 14, 0, 1769503, 14, 0, 1769504, 14, 0, 1769505, 13, 0, 1769506, 13, 0, 1769507, 13, 0, 1769508, 13, 0, 1769509, 13, 0, 1769510, 13, 0, 1769511, 13, 0, 1769512, 13, 0, 1769513, 13, 0, 1769514, 13, 0, 1835008, 16, 0, 1835009, 16, 0, 1835010, 16, 0, 1835011, 16, 0, 1835012, 16, 0, 1835013, 16, 0, 1835014, 16, 0, 1835015, 16, 0, 1835016, 16, 0, 1835017, 16, 0, 1835018, 16, 0, 1835019, 16, 0, 1835020, 16, 0, 1835021, 16, 0, 1835022, 16, 0, 1835023, 16, 0, 1835024, 16, 0, 1835025, 16, 0, 1835026, 16, 0, 1835027, 16, 0, 1835028, 16, 0, 1835029, 16, 0, 1835030, 16, 0, 1835031, 16, 0, 1835032, 16, 0, 1835033, 16, 0, 1835034, 16, 0, 1835035, 16, 0, 1835036, 16, 0, 1835037, 16, 0, 1835038, 16, 0, 1835039, 16, 0, 1835040, 16, 0, 1835041, 16, 0, 1835042, 16, 0, 1835043, 16, 0, 1835044, 16, 0, 1835045, 16, 0, 1835046, 16, 0, 1835047, 16, 0, 1835048, 16, 0, 1835049, 16, 0, 1835050, 0, 0, 1900544, 16, 0, 1900545, 16, 0, 1900546, 16, 0, 1900547, 16, 0, 1900548, 16, 0, 1900549, 16, 0, 1900550, 16, 0, 1900551, 16, 0, 1900552, 16, 0, 1900553, 16, 0, 1900554, 16, 0, 1900555, 16, 0, 1900556, 16, 0, 1900557, 16, 0, 1900558, 16, 0, 1900559, 16, 0, 1900560, 16, 0, 1900561, 16, 0, 1900562, 16, 0, 1900563, 16, 0, 1900564, 16, 0, 1900565, 16, 0, 1900566, 16, 0, 1900567, 16, 0, 1900568, 16, 0, 1900569, 16, 0, 1900570, 16, 0, 1900571, 16, 0, 1900572, 16, 0, 1900573, 16, 0, 1900574, 16, 0, 1900575, 16, 0, 1900576, 16, 0, 1900577, 16, 0, 1900578, 16, 0, 1900579, 16, 0, 1900580, 16, 0, 1900581, 16, 0, 1900582, 16, 0, 1900583, 16, 0, 1900584, 16, 0, 1900585, 16, 0, 1900586, 0, 0, 1966080, 16, 0, 1966081, 16, 0, 1966082, 16, 0, 1966083, 16, 0, 1966084, 16, 0, 1966085, 16, 0, 1966086, 16, 0, 1966087, 16, 0, 1966088, 16, 0, 1966089, 16, 0, 1966090, 16, 0, 1966091, 16, 0, 1966092, 16, 0, 1966093, 16, 0, 1966094, 16, 0, 1966095, 16, 0, 1966096, 16, 0, 1966097, 16, 0, 1966098, 16, 0, 1966099, 16, 0, 1966100, 16, 0, 1966101, 16, 0, 1966102, 16, 0, 1966103, 16, 0, 1966104, 16, 0, 1966105, 16, 0, 1966106, 16, 0, 1966107, 16, 0, 1966108, 16, 0, 1966109, 16, 0, 1966110, 16, 0, 1966111, 16, 0, 1966112, 16, 0, 1966113, 16, 0, 1966114, 16, 0, 1966115, 16, 0, 1966116, 16, 0, 1966117, 16, 0, 1966118, 16, 0, 1966119, 16, 0, 1966120, 16, 0, 1966121, 16, 0, 1966122, 0, 0, 2031616, 16, 0, 2031617, 16, 0, 2031618, 16, 0, 2031619, 16, 0, 2031620, 16, 0, 2031621, 16, 0, 2031622, 16, 0, 2031623, 16, 0, 2031624, 16, 0, 2031625, 16, 0, 2031626, 16, 0, 2031627, 16, 0, 2031628, 16, 0, 2031629, 16, 0, 2031630, 16, 0, 2031631, 16, 0, 2031632, 16, 0, 2031633, 16, 0, 2031634, 16, 0, 2031635, 16, 0, 2031636, 16, 0, 2031637, 16, 0, 2031638, 16, 0, 2031639, 16, 0, 2031640, 16, 0, 2031641, 16, 0, 2031642, 16, 0, 2031643, 16, 0, 2031644, 16, 0, 2031645, 16, 0, 2031646, 16, 0, 2031647, 16, 0, 2031648, 16, 0, 2031649, 16, 0, 2031650, 16, 0, 2031651, 16, 0, 2031652, 16, 0, 2031653, 16, 0, 2031654, 16, 0, 2031655, 16, 0, 2031656, 16, 0, 2031657, 16, 0, 2031658, 0, 0, 2097152, 16, 0, 2097153, 16, 0, 2097154, 16, 0, 2097155, 16, 0, 2097156, 16, 0, 2097157, 16, 0, 2097158, 16, 0, 2097159, 16, 0, 2097160, 16, 0, 2097161, 16, 0, 2097162, 16, 0, 2097163, 16, 0, 2097164, 16, 0, 2097165, 16, 0, 2097166, 16, 0, 2097167, 16, 0, 2097168, 16, 0, 2097169, 16, 0, 2097170, 16, 0, 2097171, 16, 0, 2097172, 16, 0, 2097173, 16, 0, 2097174, 16, 0, 2097175, 16, 0, 2097176, 16, 0, 2097177, 16, 0, 2097178, 16, 0, 2097179, 16, 0, 2097180, 16, 0, 2097181, 16, 0, 2097182, 16, 0, 2097183, 16, 0, 2097184, 16, 0, 2097185, 16, 0, 2097186, 16, 0, 2097187, 16, 0, 2097188, 16, 0, 2097189, 16, 0, 2097190, 16, 0, 2097191, 16, 0, 2097192, 16, 0, 2097193, 16, 0, 2097194, 16, 0 )

[node name="Tree" type="Sprite" parent="BGTileMap" index="0"]
position = Vector2( 0, 496 )
texture = ExtResource( 9 )

[node name="Tree2" type="Sprite" parent="BGTileMap" index="1"]
position = Vector2( 920, 504 )
texture = ExtResource( 9 )

[node name="Sprite4" type="Sprite" parent="BGTileMap" index="2"]
position = Vector2( 120, 72 )
texture = ExtResource( 8 )
offset = Vector2( -24, 176 )

[node name="Sprite3" type="Sprite" parent="BGTileMap" index="3"]
position = Vector2( 120, 72 )
texture = ExtResource( 8 )
offset = Vector2( -24, 112 )

[node name="Sprite" type="Sprite" parent="BGTileMap" index="4"]
position = Vector2( 120, 72 )
texture = ExtResource( 8 )
offset = Vector2( -24, 56 )

[node name="Sprite2" type="Sprite" parent="BGTileMap" index="5"]
position = Vector2( 120, 72 )
texture = ExtResource( 8 )
offset = Vector2( -24, -8 )

[node name="Sprite8" type="Sprite" parent="BGTileMap" index="6"]
position = Vector2( 312, 72 )
texture = ExtResource( 8 )
offset = Vector2( -24, 176 )

[node name="Sprite7" type="Sprite" parent="BGTileMap" index="7"]
position = Vector2( 312, 72 )
texture = ExtResource( 8 )
offset = Vector2( -24, 112 )

[node name="Sprite6" type="Sprite" parent="BGTileMap" index="8"]
position = Vector2( 312, 72 )
texture = ExtResource( 8 )
offset = Vector2( -24, 56 )

[node name="Sprite5" type="Sprite" parent="BGTileMap" index="9"]
position = Vector2( 312, 72 )
texture = ExtResource( 8 )
offset = Vector2( -24, -8 )

[node name="Sprite12" type="Sprite" parent="BGTileMap" index="10"]
position = Vector2( 504, 72 )
texture = ExtResource( 8 )
offset = Vector2( -24, 176 )

[node name="Sprite11" type="Sprite" parent="BGTileMap" index="11"]
position = Vector2( 504, 72 )
texture = ExtResource( 8 )
offset = Vector2( -24, 112 )

[node name="Sprite10" type="Sprite" parent="BGTileMap" index="12"]
position = Vector2( 504, 72 )
texture = ExtResource( 8 )
offset = Vector2( -24, 56 )

[node name="Sprite9" type="Sprite" parent="BGTileMap" index="13"]
position = Vector2( 504, 72 )
texture = ExtResource( 8 )
offset = Vector2( -24, -8 )

[node name="Sprite16" type="Sprite" parent="BGTileMap" index="14"]
position = Vector2( 696, 72 )
texture = ExtResource( 8 )
offset = Vector2( -24, 176 )

[node name="Sprite15" type="Sprite" parent="BGTileMap" index="15"]
position = Vector2( 696, 72 )
texture = ExtResource( 8 )
offset = Vector2( -24, 112 )

[node name="Sprite14" type="Sprite" parent="BGTileMap" index="16"]
position = Vector2( 696, 72 )
texture = ExtResource( 8 )
offset = Vector2( -24, 56 )

[node name="Sprite13" type="Sprite" parent="BGTileMap" index="17"]
position = Vector2( 696, 72 )
texture = ExtResource( 8 )
offset = Vector2( -24, -8 )

[node name="Sprite20" type="Sprite" parent="BGTileMap" index="18"]
position = Vector2( 888, 72 )
texture = ExtResource( 8 )
offset = Vector2( -24, 176 )

[node name="Sprite19" type="Sprite" parent="BGTileMap" index="19"]
position = Vector2( 888, 72 )
texture = ExtResource( 8 )
offset = Vector2( -24, 112 )

[node name="Sprite18" type="Sprite" parent="BGTileMap" index="20"]
position = Vector2( 888, 72 )
texture = ExtResource( 8 )
offset = Vector2( -24, 56 )

[node name="Sprite17" type="Sprite" parent="BGTileMap" index="21"]
position = Vector2( 888, 72 )
texture = ExtResource( 8 )
offset = Vector2( -24, -8 )

[node name="Sprite28" type="Sprite" parent="BGTileMap" index="22"]
position = Vector2( 1080, 72 )
texture = ExtResource( 8 )
offset = Vector2( -24, 176 )

[node name="Sprite27" type="Sprite" parent="BGTileMap" index="23"]
position = Vector2( 1080, 72 )
texture = ExtResource( 8 )
offset = Vector2( -24, 112 )

[node name="Sprite26" type="Sprite" parent="BGTileMap" index="24"]
position = Vector2( 1080, 72 )
texture = ExtResource( 8 )
offset = Vector2( -24, 56 )

[node name="Sprite25" type="Sprite" parent="BGTileMap" index="25"]
position = Vector2( 1080, 72 )
texture = ExtResource( 8 )
offset = Vector2( -24, -8 )

[node name="Sprite24" type="Sprite" parent="BGTileMap" index="26"]
position = Vector2( 1272, 72 )
texture = ExtResource( 8 )
offset = Vector2( -24, 176 )

[node name="Sprite23" type="Sprite" parent="BGTileMap" index="27"]
position = Vector2( 1272, 72 )
texture = ExtResource( 8 )
offset = Vector2( -24, 112 )

[node name="Sprite22" type="Sprite" parent="BGTileMap" index="28"]
position = Vector2( 1272, 72 )
texture = ExtResource( 8 )
offset = Vector2( -24, 56 )

[node name="Sprite21" type="Sprite" parent="BGTileMap" index="29"]
position = Vector2( 1272, 72 )
texture = ExtResource( 8 )
offset = Vector2( -24, -8 )

[node name="Sprite36" type="Sprite" parent="BGTileMap" index="30"]
position = Vector2( 1464, 72 )
texture = ExtResource( 8 )
offset = Vector2( -24, 176 )

[node name="Sprite35" type="Sprite" parent="BGTileMap" index="31"]
position = Vector2( 1464, 72 )
texture = ExtResource( 8 )
offset = Vector2( -24, 112 )

[node name="Sprite34" type="Sprite" parent="BGTileMap" index="32"]
position = Vector2( 1464, 72 )
texture = ExtResource( 8 )
offset = Vector2( -24, 56 )

[node name="Sprite33" type="Sprite" parent="BGTileMap" index="33"]
position = Vector2( 1464, 72 )
texture = ExtResource( 8 )
offset = Vector2( -24, -8 )

[node name="Sprite32" type="Sprite" parent="BGTileMap" index="34"]
position = Vector2( 1656, 72 )
texture = ExtResource( 8 )
offset = Vector2( -24, 176 )

[node name="Sprite31" type="Sprite" parent="BGTileMap" index="35"]
position = Vector2( 1656, 72 )
texture = ExtResource( 8 )
offset = Vector2( -24, 112 )

[node name="Sprite30" type="Sprite" parent="BGTileMap" index="36"]
position = Vector2( 1656, 72 )
texture = ExtResource( 8 )
offset = Vector2( -24, 56 )

[node name="Sprite29" type="Sprite" parent="BGTileMap" index="37"]
position = Vector2( 1656, 72 )
texture = ExtResource( 8 )
offset = Vector2( -24, -8 )

[node name="Sprite44" type="Sprite" parent="BGTileMap" index="38"]
position = Vector2( 1848, 72 )
texture = ExtResource( 8 )
offset = Vector2( -24, 176 )

[node name="Sprite43" type="Sprite" parent="BGTileMap" index="39"]
position = Vector2( 1848, 72 )
texture = ExtResource( 8 )
offset = Vector2( -24, 112 )

[node name="Sprite42" type="Sprite" parent="BGTileMap" index="40"]
position = Vector2( 1848, 72 )
texture = ExtResource( 8 )
offset = Vector2( -24, 56 )

[node name="Sprite41" type="Sprite" parent="BGTileMap" index="41"]
position = Vector2( 1848, 72 )
texture = ExtResource( 8 )
offset = Vector2( -24, -8 )

[node name="Sprite40" type="Sprite" parent="BGTileMap" index="42"]
position = Vector2( 2040, 72 )
texture = ExtResource( 8 )
offset = Vector2( -24, 176 )

[node name="Sprite39" type="Sprite" parent="BGTileMap" index="43"]
position = Vector2( 2040, 72 )
texture = ExtResource( 8 )
offset = Vector2( -24, 112 )

[node name="Sprite38" type="Sprite" parent="BGTileMap" index="44"]
position = Vector2( 2040, 72 )
texture = ExtResource( 8 )
offset = Vector2( -24, 56 )

[node name="Sprite37" type="Sprite" parent="BGTileMap" index="45"]
position = Vector2( 2040, 72 )
texture = ExtResource( 8 )
offset = Vector2( -24, -8 )

[node name="Sprite52" type="Sprite" parent="BGTileMap" index="46"]
position = Vector2( 2232, 72 )
texture = ExtResource( 8 )
offset = Vector2( -24, 176 )

[node name="Sprite51" type="Sprite" parent="BGTileMap" index="47"]
position = Vector2( 2232, 72 )
texture = ExtResource( 8 )
offset = Vector2( -24, 112 )

[node name="Sprite50" type="Sprite" parent="BGTileMap" index="48"]
position = Vector2( 2232, 72 )
texture = ExtResource( 8 )
offset = Vector2( -24, 56 )

[node name="Sprite49" type="Sprite" parent="BGTileMap" index="49"]
position = Vector2( 2232, 72 )
texture = ExtResource( 8 )
offset = Vector2( -24, -8 )

[node name="Sprite48" type="Sprite" parent="BGTileMap" index="50"]
position = Vector2( 2424, 72 )
texture = ExtResource( 8 )
offset = Vector2( -24, 176 )

[node name="Sprite47" type="Sprite" parent="BGTileMap" index="51"]
position = Vector2( 2424, 72 )
texture = ExtResource( 8 )
offset = Vector2( -24, 112 )

[node name="Sprite46" type="Sprite" parent="BGTileMap" index="52"]
position = Vector2( 2424, 72 )
texture = ExtResource( 8 )
offset = Vector2( -24, 56 )

[node name="Sprite45" type="Sprite" parent="BGTileMap" index="53"]
position = Vector2( 2424, 72 )
texture = ExtResource( 8 )
offset = Vector2( -24, -8 )

[node name="Sprite60" type="Sprite" parent="BGTileMap" index="54"]
position = Vector2( 2616, 72 )
texture = ExtResource( 8 )
offset = Vector2( -24, 176 )

[node name="Sprite59" type="Sprite" parent="BGTileMap" index="55"]
position = Vector2( 2616, 72 )
texture = ExtResource( 8 )
offset = Vector2( -24, 112 )

[node name="Sprite58" type="Sprite" parent="BGTileMap" index="56"]
position = Vector2( 2616, 72 )
texture = ExtResource( 8 )
offset = Vector2( -24, 56 )

[node name="Sprite57" type="Sprite" parent="BGTileMap" index="57"]
position = Vector2( 2616, 72 )
texture = ExtResource( 8 )
offset = Vector2( -24, -8 )

[node name="Sprite56" type="Sprite" parent="BGTileMap" index="58"]
position = Vector2( 2808, 72 )
texture = ExtResource( 8 )
offset = Vector2( -24, 176 )

[node name="Sprite55" type="Sprite" parent="BGTileMap" index="59"]
position = Vector2( 2808, 72 )
texture = ExtResource( 8 )
offset = Vector2( -24, 112 )

[node name="Sprite54" type="Sprite" parent="BGTileMap" index="60"]
position = Vector2( 2808, 72 )
texture = ExtResource( 8 )
offset = Vector2( -24, 56 )

[node name="Sprite53" type="Sprite" parent="BGTileMap" index="61"]
position = Vector2( 2808, 72 )
texture = ExtResource( 8 )
offset = Vector2( -24, -8 )

[node name="Sprite68" type="Sprite" parent="BGTileMap" index="62"]
position = Vector2( 2088, 1384 )
texture = ExtResource( 12 )

[node name="Sprite69" type="Sprite" parent="BGTileMap" index="63"]
position = Vector2( 1672, 1600 )
texture = ExtResource( 12 )

[node name="Sprite70" type="Sprite" parent="BGTileMap" index="64"]
position = Vector2( 2304, 1008 )
texture = ExtResource( 12 )

[node name="Sprite71" type="Sprite" parent="BGTileMap" index="65"]
position = Vector2( 2360, 1008 )
texture = ExtResource( 12 )
flip_h = true

[node name="Sprite61" type="Sprite" parent="BGTileMap" index="66"]
position = Vector2( 192, 976 )
texture = ExtResource( 13 )

[node name="Sprite62" type="Sprite" parent="BGTileMap" index="67"]
position = Vector2( 1208, 912 )
texture = ExtResource( 13 )

[node name="Sprite63" type="Sprite" parent="BGTileMap" index="68"]
position = Vector2( 2032, 1416 )
texture = ExtResource( 13 )

[node name="Sprite64" type="Sprite" parent="BGTileMap" index="69"]
position = Vector2( 2696, 1688 )
texture = ExtResource( 13 )

[node name="Sprite65" type="Sprite" parent="BGTileMap" index="70"]
position = Vector2( 2600, 1288 )
texture = ExtResource( 13 )

[node name="Sprite66" type="Sprite" parent="BGTileMap" index="71"]
position = Vector2( 968, 712 )
texture = ExtResource( 13 )

[node name="Sprite67" type="Sprite" parent="BGTileMap" index="72"]
position = Vector2( 824, 712 )
texture = ExtResource( 13 )
flip_h = true

[node name="Sprite" type="Sprite" parent="BGTileMap/Sprite67" index="0"]
position = Vector2( 48, 32 )
texture = ExtResource( 12 )

[node name="Sprite2" type="Sprite" parent="BGTileMap/Sprite67" index="1"]
position = Vector2( -760, -32 )
texture = ExtResource( 12 )

[node name="Sprite3" type="Sprite" parent="BGTileMap/Sprite67" index="2"]
position = Vector2( 760, 320 )
texture = ExtResource( 12 )

[node name="Sprite4" type="Sprite" parent="BGTileMap/Sprite67" index="3"]
position = Vector2( 960, 544 )
texture = ExtResource( 12 )

[node name="TileMap" parent="." index="2"]
tile_set = ExtResource( 1 )
tile_data = PoolIntArray( 10, 7, 0, 65546, 6, 0, 131072, 9, 0, 131073, 10, 0, 131074, 10, 0, 131075, 10, 0, 131076, 10, 0, 131077, 10, 0, 131078, 11, 0, 131082, 6, 0, 196614, 7, 0, 196618, 6, 0, 262150, 6, 0, 262154, 6, 0, 327686, 6, 0, 327690, 6, 0, 393222, 6, 0, 458758, 6, 0, 524294, 6, 0, 524298, 7, 0, 524299, 9, 0, 524300, 10, 0, 524301, 10, 0, 524302, 10, 0, 524303, 10, 0, 524304, 11, 0, 589830, 6, 0, 589834, 6, 0, 655370, 6, 0, 720906, 6, 0, 786435, 9, 0, 786436, 10, 0, 786437, 11, 0, 786438, 7, 0, 786442, 6, 0, 851968, 17, 0, 851969, 17, 0, 851970, 17, 0, 851971, 17, 0, 851972, 17, 0, 851973, 17, 0, 851974, 6, 0, 851975, 17, 0, 851976, 17, 0, 851977, 17, 0, 851978, 6, 0, 851979, 17, 0, 851980, 17, 0, 851981, 17, 0, 851982, 17, 0, 851983, 17, 0, 851984, 17, 0, 851985, 17, 0, 851986, 17, 0, 851987, 17, 0, 851988, 17, 0, 851989, 17, 0, 851990, 17, 0, 851991, 17, 0, 851992, 17, 0, 851993, 17, 0, 851994, 17, 0, 851995, 17, 0, 851996, 17, 0, 851997, 17, 0, 851998, 17, 0, 851999, 17, 0, 852000, 17, 0, 852001, 17, 0, 852002, 17, 0, 852003, 17, 0, 852004, 17, 0, 852005, 17, 0, 852006, 17, 0, 852007, 17, 0, 852008, 17, 0, 852009, 17, 0, 852010, 17, 0, 917510, 6, 0, 983046, 6, 0, 983063, 7, 0, 1048582, 6, 0, 1048599, 6, 0, 1114112, 13, 0, 1114113, 13, 0, 1114114, 13, 0, 1114115, 13, 0, 1114116, 13, 0, 1114117, 13, 0, 1114118, 6, 0, 1114121, 7, 0, 1114122, 7, 0, 1114123, 13, 0, 1114124, 13, 0, 1114125, 13, 0, 1114126, 13, 0, 1114127, 7, 0, 1114133, 7, 0, 1114135, 6, 0, 1114136, 9, 0, 1114137, 10, 0, 1114138, 10, 0, 1114139, 10, 0, 1114140, 10, 0, 1114141, 10, 0, 1114142, 11, 0, 1179648, 0, 0, 1179649, 0, 0, 1179650, 0, 0, 1179651, 0, 0, 1179652, 0, 0, 1179653, 0, 0, 1179654, 9, 0, 1179655, 10, 0, 1179656, 10, 0, 1179657, 10, 0, 1179658, 11, 0, 1179659, 0, 0, 1179660, 0, 0, 1179661, 0, 0, 1179662, 0, 0, 1179663, 6, 0, 1179669, 6, 0, 1245184, 0, 0, 1245185, 0, 0, 1245186, 0, 0, 1245187, 0, 0, 1245188, 0, 0, 1245189, 0, 0, 1245190, 0, 0, 1245191, 0, 0, 1245192, 0, 0, 1245193, 0, 0, 1245194, 0, 0, 1245195, 0, 0, 1245196, 0, 0, 1245197, 0, 0, 1245198, 0, 0, 1245199, 6, 0, 1245205, 6, 0, 1310720, 0, 0, 1310721, 0, 0, 1310722, 0, 0, 1310723, 0, 0, 1310724, 0, 0, 1310725, 0, 0, 1310726, 0, 0, 1310727, 0, 0, 1310728, 0, 0, 1310729, 0, 0, 1310730, 0, 0, 1310731, 0, 0, 1310732, 0, 0, 1310733, 0, 0, 1310734, 0, 0, 1310735, 6, 0, 1310741, 6, 0, 1376256, 0, 0, 1376257, 0, 0, 1376258, 0, 0, 1376259, 0, 0, 1376260, 0, 0, 1376261, 0, 0, 1376262, 0, 0, 1376263, 0, 0, 1376264, 0, 0, 1376265, 0, 0, 1376266, 0, 0, 1376267, 0, 0, 1376268, 0, 0, 1376269, 0, 0, 1376270, 0, 0, 1376271, 6, 0, 1376277, 6, 0, 1441792, 0, 0, 1441793, 0, 0, 1441794, 0, 0, 1441795, 0, 0, 1441796, 0, 0, 1441797, 0, 0, 1441798, 0, 0, 1441799, 0, 0, 1441800, 0, 0, 1441801, 0, 0, 1441802, 0, 0, 1441803, 0, 0, 1441804, 0, 0, 1441805, 0, 0, 1441806, 0, 0, 1441807, 6, 0, 1507328, 0, 0, 1507329, 0, 0, 1507330, 0, 0, 1507331, 0, 0, 1507332, 0, 0, 1507333, 0, 0, 1507334, 0, 0, 1507335, 0, 0, 1507336, 0, 0, 1507337, 0, 0, 1507338, 0, 0, 1507339, 0, 0, 1507340, 0, 0, 1507341, 0, 0, 1507342, 0, 0, 1507343, 6, 0, 1507351, 9, 0, 1507352, 10, 0, 1507353, 11, 0, 1572864, 0, 0, 1572865, 0, 0, 1572866, 0, 0, 1572867, 0, 0, 1572868, 0, 0, 1572869, 0, 0, 1572870, 0, 0, 1572871, 0, 0, 1572872, 0, 0, 1572873, 0, 0, 1572874, 0, 0, 1572875, 0, 0, 1572876, 0, 0, 1572877, 0, 0, 1572878, 0, 0, 1572879, 6, 0, 1572887, 9, 0, 1572888, 10, 0, 1572889, 11, 0, 1638400, 0, 0, 1638401, 0, 0, 1638402, 0, 0, 1638403, 0, 0, 1638404, 0, 0, 1638405, 0, 0, 1638406, 0, 0, 1638407, 0, 0, 1638408, 0, 0, 1638409, 0, 0, 1638410, 0, 0, 1638411, 0, 0, 1638412, 0, 0, 1638413, 0, 0, 1638414, 0, 0, 1638415, 2, 0, 1638421, 9, 0, 1638422, 10, 0, 1638423, 10, 0, 1638424, 11, 0, 1703936, 0, 0, 1703937, 0, 0, 1703938, 0, 0, 1703939, 0, 0, 1703940, 0, 0, 1703941, 0, 0, 1703942, 0, 0, 1703943, 0, 0, 1703944, 0, 0, 1703945, 0, 0, 1703946, 0, 0, 1703947, 0, 0, 1703948, 0, 0, 1703949, 0, 0, 1703950, 0, 0, 1703951, 9, 0, 1703952, 10, 0, 1703953, 10, 0, 1703954, 10, 0, 1703955, 10, 0, 1703956, 10, 0, 1703957, 10, 0, 1703958, 10, 0, 1703959, 10, 0, 1703960, 11, 0, 1769472, 0, 0, 1769473, 0, 0, 1769474, 0, 0, 1769475, 0, 0, 1769476, 0, 0, 1769477, 0, 0, 1769478, 0, 0, 1769479, 0, 0, 1769480, 0, 0, 1769481, 0, 0, 1769482, 0, 0, 1769483, 0, 0, 1769484, 0, 0, 1769485, 0, 0, 1769486, 0, 0, 1769487, 6, 0, 1769488, 6, 0, 1769489, 6, 0, 1769490, 6, 0, 1769491, 6, 0, 1769492, 6, 0, 1769493, 6, 0, 1769494, 6, 0, 1769495, 6, 0, 1769496, 6, 0, 1769497, 13, 0, 1769498, 13, 0, 1769499, 13, 0, 1769500, 13, 0, 1769501, 13, 0, 1769502, 13, 0, 1769503, 13, 0, 1769504, 13, 0, 1769505, 9, 0, 1769506, 10, 0, 1769507, 10, 0, 1769508, 10, 0, 1769509, 10, 0, 1769510, 10, 0, 1769511, 10, 0, 1769512, 10, 0, 1769513, 10, 0, 1769514, 10, 0, 1835008, 0, 0, 1835009, 0, 0, 1835010, 0, 0, 1835011, 0, 0, 1835012, 0, 0, 1835013, 0, 0, 1835014, 0, 0, 1835015, 0, 0, 1835016, 0, 0, 1835017, 0, 0, 1835018, 0, 0, 1835019, 0, 0, 1835020, 0, 0, 1835021, 0, 0, 1835022, 0, 0, 1835023, 6, 0, 1835024, 6, 0, 1835025, 6, 0, 1835026, 6, 0, 1835027, 6, 0, 1835028, 6, 0, 1835029, 6, 0, 1835030, 6, 0, 1835031, 6, 0, 1835032, 6, 0, 1835033, 0, 0, 1835034, 0, 0, 1835035, 0, 0, 1835036, 0, 0, 1835037, 0, 0, 1835038, 0, 0, 1835039, 0, 0, 1835040, 0, 0, 1835041, 0, 0, 1835042, 0, 0, 1835043, 0, 0, 1835044, 0, 0, 1835045, 0, 0, 1835046, 0, 0, 1835047, 0, 0, 1835048, 0, 0, 1835049, 0, 0, 1835050, 2, 0, 1900544, 0, 0, 1900545, 0, 0, 1900546, 0, 0, 1900547, 0, 0, 1900548, 0, 0, 1900549, 0, 0, 1900550, 0, 0, 1900551, 0, 0, 1900552, 0, 0, 1900553, 0, 0, 1900554, 0, 0, 1900555, 0, 0, 1900556, 0, 0, 1900557, 0, 0, 1900558, 0, 0, 1900559, 6, 0, 1900560, 6, 0, 1900561, 6, 0, 1900562, 6, 0, 1900563, 6, 0, 1900564, 6, 0, 1900565, 6, 0, 1900566, 6, 0, 1900567, 6, 0, 1900568, 6, 0, 1900569, 0, 0, 1900570, 0, 0, 1900571, 0, 0, 1900572, 0, 0, 1900573, 0, 0, 1900574, 0, 0, 1900575, 0, 0, 1900576, 0, 0, 1900577, 0, 0, 1900578, 0, 0, 1900579, 0, 0, 1900580, 0, 0, 1900581, 0, 0, 1900582, 0, 0, 1900583, 0, 0, 1900584, 0, 0, 1900585, 0, 0, 1900586, 2, 0, 1966080, 0, 0, 1966081, 0, 0, 1966082, 0, 0, 1966083, 0, 0, 1966084, 0, 0, 1966085, 0, 0, 1966086, 0, 0, 1966087, 0, 0, 1966088, 0, 0, 1966089, 0, 0, 1966090, 0, 0, 1966091, 0, 0, 1966092, 0, 0, 1966093, 0, 0, 1966094, 0, 0, 1966095, 6, 0, 1966096, 6, 0, 1966097, 6, 0, 1966098, 6, 0, 1966099, 6, 0, 1966100, 6, 0, 1966101, 6, 0, 1966102, 6, 0, 1966103, 6, 0, 1966104, 6, 0, 1966105, 0, 0, 1966106, 0, 0, 1966107, 0, 0, 1966108, 0, 0, 1966109, 0, 0, 1966110, 0, 0, 1966111, 0, 0, 1966112, 0, 0, 1966113, 0, 0, 1966114, 0, 0, 1966115, 0, 0, 1966116, 0, 0, 1966117, 0, 0, 1966118, 0, 0, 1966119, 0, 0, 1966120, 0, 0, 1966121, 0, 0, 1966122, 2, 0, 2031616, 0, 0, 2031617, 0, 0, 2031618, 0, 0, 2031619, 0, 0, 2031620, 0, 0, 2031621, 0, 0, 2031622, 0, 0, 2031623, 0, 0, 2031624, 0, 0, 2031625, 0, 0, 2031626, 0, 0, 2031627, 0, 0, 2031628, 0, 0, 2031629, 0, 0, 2031630, 0, 0, 2031631, 6, 0, 2031632, 6, 0, 2031633, 6, 0, 2031634, 6, 0, 2031635, 6, 0, 2031636, 6, 0, 2031637, 6, 0, 2031638, 6, 0, 2031639, 6, 0, 2031640, 6, 0, 2031641, 0, 0, 2031642, 0, 0, 2031643, 0, 0, 2031644, 0, 0, 2031645, 0, 0, 2031646, 0, 0, 2031647, 0, 0, 2031648, 0, 0, 2031649, 0, 0, 2031650, 0, 0, 2031651, 0, 0, 2031652, 0, 0, 2031653, 0, 0, 2031654, 0, 0, 2031655, 0, 0, 2031656, 0, 0, 2031657, 0, 0, 2031658, 2, 0, 2097152, 9, 0, 2097153, 10, 0, 2097154, 10, 0, 2097155, 10, 0, 2097156, 10, 0, 2097157, 10, 0, 2097158, 10, 0, 2097159, 10, 0, 2097160, 10, 0, 2097161, 10, 0, 2097162, 10, 0, 2097163, 10, 0, 2097164, 10, 0, 2097165, 10, 0, 2097166, 10, 0, 2097167, 10, 0, 2097168, 10, 0, 2097169, 10, 0, 2097170, 10, 0, 2097171, 10, 0, 2097172, 10, 0, 2097173, 10, 0, 2097174, 10, 0, 2097175, 10, 0, 2097176, 10, 0, 2097177, 10, 0, 2097178, 10, 0, 2097179, 10, 0, 2097180, 10, 0, 2097181, 10, 0, 2097182, 10, 0, 2097183, 10, 0, 2097184, 10, 0, 2097185, 10, 0, 2097186, 10, 0, 2097187, 10, 0, 2097188, 10, 0, 2097189, 10, 0, 2097190, 10, 0, 2097191, 10, 0, 2097192, 10, 0, 2097193, 10, 0, 2097194, 11, 0 )

[node name="Sprite" type="Sprite" parent="TileMap/Background" index="0"]
position = Vector2( 1736, 1024 )
texture = ExtResource( 7 )

[node name="Sprite" type="Sprite" parent="TileMap/Background/Sprite" index="0"]
position = Vector2( 48, -32 )
texture = ExtResource( 6 )

[node name="Sprite" type="Sprite" parent="TileMap/Background/Sprite/Sprite" index="0"]
position = Vector2( 104, -24 )
rotation = -0.0663225
scale = Vector2( 1, 0.945 )
texture = ExtResource( 10 )

[node name="Sprite2" type="Sprite" parent="TileMap/Background/Sprite" index="1"]
position = Vector2( -72, -32 )
scale = Vector2( 1.2, 1 )
texture = ExtResource( 10 )
flip_h = true

[node name="Sprite" type="Sprite" parent="TileMap/Background/Sprite/Sprite2" index="0"]
position = Vector2( -0.846436, -22.9662 )
rotation = 0.424115
texture = ExtResource( 6 )
flip_h = true

[node name="Thorns" parent="TileMap/Obstacles" index="0" instance=ExtResource( 4 )]
position = Vector2( 744, 480 )

[node name="KillBox" parent="TileMap/Obstacles" index="1" instance=ExtResource( 4 )]
position = Vector2( 736, 1184 )

[node name="Sprite" parent="TileMap/Obstacles/KillBox" index="0"]
visible = false

[node name="KillBox2" parent="TileMap/Obstacles" index="2" instance=ExtResource( 4 )]
position = Vector2( 800, 1184 )

[node name="Sprite" parent="TileMap/Obstacles/KillBox2" index="0"]
visible = false

[node name="KillBox3" parent="TileMap/Obstacles" index="3" instance=ExtResource( 4 )]
position = Vector2( 864, 1184 )

[node name="Sprite" parent="TileMap/Obstacles/KillBox3" index="0"]
visible = false

[node name="KillBox4" parent="TileMap/Obstacles" index="4" instance=ExtResource( 4 )]
position = Vector2( 928, 1184 )

[node name="Sprite" parent="TileMap/Obstacles/KillBox4" index="0"]
visible = false

[node name="KillBox5" parent="TileMap/Obstacles" index="5" instance=ExtResource( 4 )]
position = Vector2( 1632, 1760 )

[node name="Sprite" parent="TileMap/Obstacles/KillBox5" index="0"]
visible = false

[node name="KillBox6" parent="TileMap/Obstacles" index="6" instance=ExtResource( 4 )]
position = Vector2( 1696, 1760 )

[node name="Sprite" parent="TileMap/Obstacles/KillBox6" index="0"]
visible = false

[node name="KillBox7" parent="TileMap/Obstacles" index="7" instance=ExtResource( 4 )]
position = Vector2( 1760, 1760 )

[node name="Sprite" parent="TileMap/Obstacles/KillBox7" index="0"]
visible = false

[node name="KillBox8" parent="TileMap/Obstacles" index="8" instance=ExtResource( 4 )]
position = Vector2( 1824, 1760 )

[node name="Sprite" parent="TileMap/Obstacles/KillBox8" index="0"]
visible = false

[node name="KillBox9" parent="TileMap/Obstacles" index="9" instance=ExtResource( 4 )]
position = Vector2( 1888, 1760 )

[node name="Sprite" parent="TileMap/Obstacles/KillBox9" index="0"]
visible = false

[node name="KillBox10" parent="TileMap/Obstacles" index="10" instance=ExtResource( 4 )]
position = Vector2( 1952, 1760 )

[node name="Sprite" parent="TileMap/Obstacles/KillBox10" index="0"]
visible = false

[node name="KillBox11" parent="TileMap/Obstacles" index="11" instance=ExtResource( 4 )]
position = Vector2( 2016, 1760 )

[node name="Sprite" parent="TileMap/Obstacles/KillBox11" index="0"]
visible = false

[node name="KillBox12" parent="TileMap/Obstacles" index="12" instance=ExtResource( 4 )]
position = Vector2( 2080, 1816 )

[node name="Sprite" parent="TileMap/Obstacles/KillBox12" index="0"]
visible = false

[node name="Thorns5" parent="TileMap/Obstacles" index="13" instance=ExtResource( 4 )]
position = Vector2( 480, 1120 )

[node name="Thorns6" parent="TileMap/Obstacles" index="14" instance=ExtResource( 4 )]
position = Vector2( 536, 1120 )

[node name="Thorns2" parent="TileMap/Obstacles" index="15" instance=ExtResource( 4 )]
position = Vector2( 800, 480 )

[node name="Thorns3" parent="TileMap/Obstacles" index="16" instance=ExtResource( 4 )]
position = Vector2( 864, 480 )

[node name="Thorns4" parent="TileMap/Obstacles" index="17" instance=ExtResource( 4 )]
position = Vector2( 928, 480 )

[node name="Fire" parent="TileMap/Obstacles" index="18" instance=ExtResource( 5 )]
position = Vector2( 352, 736 )

[node name="Fire4" parent="TileMap/Obstacles" index="19" instance=ExtResource( 5 )]
position = Vector2( 1312, 1632 )

[node name="Fire5" parent="TileMap/Obstacles" index="20" instance=ExtResource( 5 )]
position = Vector2( 1248, 1632 )

[node name="Fire6" parent="TileMap/Obstacles" index="21" instance=ExtResource( 5 )]
position = Vector2( 1184, 1632 )

[node name="Fire7" parent="TileMap/Obstacles" index="22" instance=ExtResource( 5 )]
position = Vector2( 1120, 1632 )

[node name="Fire8" parent="TileMap/Obstacles" index="23" instance=ExtResource( 5 )]
position = Vector2( 1056, 1632 )

[node name="Fire2" parent="TileMap/Obstacles" index="24" instance=ExtResource( 5 )]
position = Vector2( 288, 736 )

[node name="Spider" parent="TileMap/Obstacles" index="25" instance=ExtResource( 11 )]
position = Vector2( 1616, 952 )

[node name="Spider2" parent="TileMap/Obstacles" index="26" instance=ExtResource( 11 )]
position = Vector2( 1784, 992 )

[node name="Spider3" parent="TileMap/Obstacles" index="27" instance=ExtResource( 11 )]
position = Vector2( 1864, 984 )

[node name="Spider4" parent="TileMap/Obstacles" index="28" instance=ExtResource( 11 )]
position = Vector2( 1688, 1000 )

[node name="Tiny" parent="TileMap/Obstacles" index="29" instance=ExtResource( 11 )]
position = Vector2( 1736, 1040 )
scale = Vector2( 0.5, 0.5 )

[node name="Tiny2" parent="TileMap/Obstacles" index="30" instance=ExtResource( 11 )]
position = Vector2( 1664, 968 )
rotation = 1.82038
scale = Vector2( 0.5, 0.5 )

[node name="Fire3" parent="TileMap/Obstacles" index="31" instance=ExtResource( 5 )]
position = Vector2( 224, 736 )

[node name="Tiger" parent="TileMap/Obstacles" index="32" instance=ExtResource( 14 )]
position = Vector2( 1952, 1056 )

[node name="Tiger2" parent="TileMap/Obstacles" index="33" instance=ExtResource( 14 )]
position = Vector2( 32, 96 )

[node name="KillBox13" parent="TileMap/Obstacles" index="34" instance=ExtResource( 16 )]
position = Vector2( 2976, 1568 )
rotation = 0.459247
shape = SubResource( 1 )

[node name="Umbrella" parent="TileMap/Tools" index="0" instance=ExtResource( 2 )]
position = Vector2( 408, 96 )

[node name="Bread" parent="TileMap/Tools" index="1" instance=ExtResource( 15 )]
position = Vector2( 2081.62, 1727.89 )

[node name="Start" parent="TileMap" index="4"]
position = Vector2( 161.027, 134.673 )

[node name="Goal" parent="TileMap" index="5"]
position = Vector2( 2584, 1730.59 )

[node name="Node2D" type="Node2D" parent="TileMap/Waypoints" index="0"]
position = Vector2( 2208, 1720 )

[node name="Node2D2" type="Node2D" parent="TileMap/Waypoints" index="1"]
position = Vector2( 1776, 1448 )

[node name="Node2D3" type="Node2D" parent="TileMap/Waypoints" index="2"]
position = Vector2( 1504, 1288 )

[node name="Node2D4" type="Node2D" parent="TileMap/Waypoints" index="3"]
position = Vector2( 1136, 1288 )

[node name="Node2D5" type="Node2D" parent="TileMap/Waypoints" index="4"]
position = Vector2( 1136, 1000 )

[node name="Node2D6" type="Node2D" parent="TileMap/Waypoints" index="5"]
position = Vector2( 528, 1000 )

[node name="Node2D7" type="Node2D" parent="TileMap/Waypoints" index="6"]
position = Vector2( 528, 128 )

[node name="Leabes" type="Node" parent="TileMap/Foreground" index="0"]

[node name="HBoxContainer" parent="CanvasLayer/UI/Hotbar/Container" index="0"]
margin_left = 498.0
margin_right = 782.0

[node name="Frog" parent="CanvasLayer/UI/Hotbar/Container/HBoxContainer" index="0"]
quantity = 4

[node name="SuperFrog" parent="CanvasLayer/UI/Hotbar/Container/HBoxContainer" index="1"]
visible = false

[node name="Eagle" parent="CanvasLayer/UI/Hotbar/Container/HBoxContainer" index="2"]
margin_left = 96.0
margin_right = 188.0
quantity = 2

[node name="SuperEagle" parent="CanvasLayer/UI/Hotbar/Container/HBoxContainer" index="3"]
visible = false

[node name="Blocker" parent="CanvasLayer/UI/Hotbar/Container/HBoxContainer" index="4"]
margin_left = 192.0
margin_right = 284.0
quantity = 3

[node name="Umbrella" parent="CanvasLayer/UI/Hotbar/Container/HBoxContainer" index="5"]
visible = false
margin_left = 384.0
margin_right = 476.0

[editable path="TileMap/Obstacles/KillBox"]

[editable path="TileMap/Obstacles/KillBox2"]

[editable path="TileMap/Obstacles/KillBox3"]

[editable path="TileMap/Obstacles/KillBox4"]

[editable path="TileMap/Obstacles/KillBox5"]

[editable path="TileMap/Obstacles/KillBox6"]

[editable path="TileMap/Obstacles/KillBox7"]

[editable path="TileMap/Obstacles/KillBox8"]

[editable path="TileMap/Obstacles/KillBox9"]

[editable path="TileMap/Obstacles/KillBox10"]

[editable path="TileMap/Obstacles/KillBox11"]

[editable path="TileMap/Obstacles/KillBox12"]

[editable path="CanvasLayer/UI/Hotbar"]
