site_ID,lat,long,date,lab_name,sample_organism,sampling_lead,reporting_lead,access_point,safety_hazards,notes
CH01066,31.415127,-100.438067,06/04/2021,perkin,Campostoma_anomalum,elkins,elkins,accesspoint1,none,none
,,,,,,,,,,
,,,,,,,,,,
