{
	"_id": "507f1f77bcf86cd799439011",
	"firstName": "John",
	"lastName": "Smith",
	"email": "johnsmith@email.com",
	"password": "johnhandsome",
	"isAdmin": false,
	"mobileNumber": 091035888000,
	"dateTimeRegistered": "2020-03-15T15:00:00.00Z",
	"enrollment": []
}