{
    "name": "ComponentWrapper.UnityExtensions",
    "rootNamespace": "",
    "references": [
        "ComponentWrapper"
    ],
    "includePlatforms": [],
    "excludePlatforms": [],
    "allowUnsafeCode": false,
    "overrideReferences": false,
    "precompiledReferences": [],
    "autoReferenced": true,
    "defineConstraints": [],
    "versionDefines": [],
    "noEngineReferences": false
}