%YAML 1.1
%TAG !u! tag:unity3d.com,2011:
--- !u!114 &11400000
MonoBehaviour:
  m_ObjectHideFlags: 0
  m_CorrespondingSourceObject: {fileID: 0}
  m_PrefabInstance: {fileID: 0}
  m_PrefabAsset: {fileID: 0}
  m_GameObject: {fileID: 0}
  m_Enabled: 1
  m_EditorHideFlags: 0
  m_Script: {fileID: 11500000, guid: 3d328d83b7fc4677b8b1d8dc3def6e27, type: 3}
  m_Name: 5
  m_EditorClassIdentifier: 
  _id: 5
  _childs:
  - {fileID: 11400000, guid: d2821dcf600474a469b6ca1054b127de, type: 2}
  _title: "\u0420\u0430\u0441\u043A\u0440\u044B\u0442\u0438\u0435"
  _description: "\u041D\u0430\u0445\u043E\u0434\u044F\u0441\u044C \u0437\u0430 \u0449\u0438\u0442\u043E\u043C,
    \u0441\u0434\u0435\u043B\u0430\u0439\u0442\u0435 \u0432\u044B\u043F\u0430\u0434
    \u0438 \u043D\u0430\u043D\u0435\u0441\u0438\u0442\u0435 \u0432\u043D\u0435\u0437\u0430\u043F\u043D\u044B\u0439
    \u0443\u0434\u0430\u0440."
  _price:
    value: 5
