%YAML 1.1
%TAG !u! tag:unity3d.com,2011:
--- !u!114 &11400000
MonoBehaviour:
  m_ObjectHideFlags: 0
  m_CorrespondingSourceObject: {fileID: 0}
  m_PrefabInstance: {fileID: 0}
  m_PrefabAsset: {fileID: 0}
  m_GameObject: {fileID: 0}
  m_Enabled: 1
  m_EditorHideFlags: 0
  m_Script: {fileID: 11500000, guid: 3d328d83b7fc4677b8b1d8dc3def6e27, type: 3}
  m_Name: 2
  m_EditorClassIdentifier: 
  _id: 2
  _childIds:
  - {fileID: 11400000, guid: 4522b1bf94d2594448765ed6ed5c087a, type: 2}
  _title: "\u041F\u0440\u044B\u0436\u043E\u043A"
  _description: "\u041F\u043E\u043C\u043E\u0433\u0430\u0435\u0442 \u043F\u0440\u0435\u043E\u0434\u043E\u043B\u0435\u0432\u0430\u0442\u044C
    \u043E\u0431\u0440\u044B\u0432\u044B \u0438 \u043F\u0440\u0435\u043F\u044F\u0442\u0441\u0442\u0432\u0438\u044F."
  _price:
    value: 2
