PR1,Score
1,13.00
0.3,6.80
0.3,8.00
0,8.00
0,6.00
0,8.00
0,13.00
0,13.00
0,10.00
1,8.00
0,12.80
1,9.00
1,9.50
1,11.30
0,7.30
0,10.00
1,8.00
0.3,9.5
0,12.8
0,7.3
0.3,13
0.8,13.8
1,9
1,12
0,11
1,13
0,11
1,10
0.6,13.8
0,8.5
0.8,10.3
0.8,11.8
0,10.5
1,12.8
0,10.8
0,10
0.1,12.8
0,10
0.1,10
1.00,0.8
0.3,10.50
0.6,9.80
0,5.80
0.8,4.00
0,9.00
0.3,10.80
0,10.30
0.7,11.80
0,6.80
0,8.00
0,10.50
0,11.80
1,6.50
1,6.80
1,8.00
0.7,0
1,11.50
1,9.80
0,5.80
0.6,0
1,9.80
0,4.80