%YAML 1.1
%TAG !u! tag:unity3d.com,2011:
--- !u!114 &11400000
MonoBehaviour:
  m_ObjectHideFlags: 0
  m_CorrespondingSourceObject: {fileID: 0}
  m_PrefabInstance: {fileID: 0}
  m_PrefabAsset: {fileID: 0}
  m_GameObject: {fileID: 0}
  m_Enabled: 1
  m_EditorHideFlags: 0
  m_Script: {fileID: 11500000, guid: 9acaa184bbc24db5aa558d664ccae31b, type: 3}
  m_Name: GameConfig
  m_EditorClassIdentifier: 
  _wheelItem:
  - Key: 1
    Value: 50
  - Key: 3
    Value: 20
  - Key: 4
    Value: 15
  - Key: 2
    Value: 15
  _wheelRotationTime: 2
  _wheelEase: 21
  _wheelTurnsCount: 5
  bonusCoinsCount: 100
  _itemPrice: 80
  _gridItemsCount: 30
  _maxSpinCount: 99
  _startupCoinsCount: 200
  _maxLastRewardsCount: 4
