%YAML 1.1
%TAG !u! tag:unity3d.com,2011:
--- !u!1045 &1
EditorBuildSettings:
  m_ObjectHideFlags: 0
  serializedVersion: 2
  m_Scenes:
  - enabled: 1
    path: Assets/Scenes/MainMenu.unity
    guid: a1caf17d1d4037a42a3d41a25404acbf
  - enabled: 1
    path: Assets/Scenes/Game.unity
    guid: 5d9e7da7f91bc2a4b83bb9fca39c4c7b
  m_configObjects: {}
