{
  "header": {
    "version": 4,
    "description": "Karaoke Mugen Karaoke Data File"
  },
  "medias": [
    {
      "version": "Default",
      "filename": "FRE - Kate Ryan - MV - Voyage Voyage ~ Cover Vers.mp4",
      "audiogain": -3.03,
      "loudnorm": "-13.54,-3.29,4.80,-23.67,-1.07",
      "filesize": 16929575,
      "duration": 189,
      "default": true,
      "lyrics": [
        {
          "filename": "FRE - Kate Ryan - MV - Voyage Voyage ~ Cover Vers.ass",
          "default": true,
          "version": "Default",
          "subchecksum": "55203a9d7307ebdb1e9df3d676f3371e"
        }
      ]
    }
  ],
  "data": {
    "created_at": "2021-06-05T19:16:26.461Z",
    "kid": "d6eda597-0aaa-4540-820a-873fd012fc1c",
    "modified_at": "2021-06-05T19:24:06.453Z",
    "repository": "world.karaokes.moe",
    "tags": {
      "authors": [
        "ea28a818-4f57-42c3-a03a-a350233978f1"
      ],
      "creators": [
        "f963181a-1214-47f8-b6f9-1705cbc33779"
      ],
      "families": [
        "5391f9fe-638c-415f-8dc9-958e3a2c5787"
      ],
      "groups": [
        "3c14c864-533c-49e6-a3cc-6969f1233775"
      ],
      "langs": [
        "fd8072b7-4d9b-45d4-8f5b-a931a830edef"
      ],
      "singers": [
        "56791dc3-5580-4629-9324-8d7f3a5d082e"
      ],
      "songtypes": [
        "7be1b15c-cff8-4b37-a649-5c90f3d569a9"
      ],
      "songwriters": [
        "273f5c8e-56a1-4fc5-b89d-9c18a665b8db",
        "2b434ff8-3723-4f4c-9c5d-a0a1ac9f9166"
      ],
      "versions": [
        "03e1e1d2-8641-47b7-bbcb-39a3df9ff21c"
      ]
    },
    "title": "Voyage Voyage",
    "titles": {
      "eng": "Voyage Voyage"
    },
    "year": 2007
  }
}