{
  "header": {
    "description": "Karaoke Mugen Tag File",
    "version": 1
  },
  "tag": {
    "i18n": {
      "eng": "AATW"
    },
    "modified_at": "2021-05-23T23:22:13.356Z",
    "name": "AATW",
    "repository": "world.karaokes.moe",
    "tid": "c6bea900-1938-415d-90d8-86eb97402ee4",
    "types": [
      "creators"
    ]
  }
}