{
  "header": {
    "description": "Karaoke Mugen Tag File",
    "version": 1
  },
  "tag": {
    "i18n": {
      "eng": "Sergey Stepanov"
    },
    "modified_at": "2021-07-25T00:09:29.245Z",
    "name": "Sergey Stepanov",
    "repository": "world.karaokes.moe",
    "tid": "80c3d02e-6f49-4d70-9ab4-fc3376272fba",
    "types": [
      "songwriters"
    ]
  }
}