{
  "header": {
    "description": "Karaoke Mugen Tag File",
    "version": 1
  },
  "tag": {
    "i18n": {
      "eng": "Sony BMG"
    },
    "modified_at": "2020-06-01T22:11:26.556Z",
    "name": "Sony BMG",
    "repository": "world.karaokes.moe",
    "tid": "4554e7df-8edb-40a8-87e7-fd7a1e0aef0c",
    "types": [
      "creators"
    ]
  }
}