{
  "header": {
    "description": "Karaoke Mugen Tag File",
    "version": 1
  },
  "tag": {
    "i18n": {
      "eng": "Superbus"
    },
    "modified_at": "2021-05-21T18:39:33.915Z",
    "name": "Superbus",
    "repository": "world.karaokes.moe",
    "tid": "4b59d1b2-a90d-4937-9fe0-d9379690211b",
    "types": [
      "singers"
    ]
  }
}