{
  "header": {
    "description": "Karaoke Mugen Tag File",
    "version": 1
  },
  "tag": {
    "i18n": {
      "eng": "Barclay"
    },
    "modified_at": "2020-07-11T21:42:49.451Z",
    "name": "Barclay",
    "repository": "world.karaokes.moe",
    "tid": "dee008b3-9388-4984-89a0-08935ecddc0d",
    "types": [
      "creators"
    ]
  }
}