{
  "header": {
    "description": "Karaoke Mugen Tag File",
    "version": 1
  },
  "tag": {
    "i18n": {
      "eng": "Wally De Backer"
    },
    "name": "Wally De Backer",
    "repository": "world.karaokes.moe",
    "tid": "54af98d4-e8c0-4fc7-b353-70efe5e2d392",
    "types": [
      "songwriters"
    ]
  }
}