{
  "header": {
    "description": "Karaoke Mugen Tag File",
    "version": 1
  },
  "tag": {
    "i18n": {
      "eng": "dagged"
    },
    "name": "dagged",
    "repository": "world.karaokes.moe",
    "tid": "0e9b1204-bd70-4c9c-8b22-471fa101fa7b",
    "types": [
      "authors"
    ]
  }
}