{
  "header": {
    "version": 4,
    "description": "Karaoke Mugen Karaoke Data File"
  },
  "medias": [
    {
      "version": "Default",
      "filename": "RUM - O-Zone - MV - Dragostea Din Tei.mp4",
      "audiogain": -8.69,
      "loudnorm": "-8.46,2.06,13.80,-19.30,-0.89",
      "filesize": 36212009,
      "duration": 285,
      "default": true,
      "lyrics": [
        {
          "filename": "RUM - O-Zone - MV - Dragostea Din Tei.ass",
          "default": true,
          "version": "Default",
          "subchecksum": "05e8e3564c09b44f93b163fda208dddc"
        }
      ]
    }
  ],
  "data": {
    "created_at": "2020-06-01T16:21:06.359Z",
    "kid": "22c01f2b-a081-486c-be7a-8a0b861ba986",
    "modified_at": "2021-02-25T14:53:01.804Z",
    "repository": "world.karaokes.moe",
    "tags": {
      "authors": [
        "568285fd-64fc-4faa-8331-c0a847024008",
        "e3c3ae60-5602-4765-8456-fd0ab28e2041"
      ],
      "creators": [
        "bb3bb300-6b4f-4c52-9364-f26346dfe2d1"
      ],
      "families": [
        "5391f9fe-638c-415f-8dc9-958e3a2c5787"
      ],
      "groups": [
        "3c14c864-533c-49e6-a3cc-6969f1233775"
      ],
      "langs": [
        "f47f3a40-732c-49de-b4b9-abdc33d10d7d"
      ],
      "singers": [
        "da99b9e3-6b6e-41f7-9f87-385f516e555c"
      ],
      "songtypes": [
        "7be1b15c-cff8-4b37-a649-5c90f3d569a9"
      ],
      "songwriters": [
        "87955698-6cd2-420c-bf28-398869323592",
        "9dbabc53-0f04-4554-8184-d56ac044ad5c"
      ]
    },
    "title": "Dragostea Din Tei",
    "titles": {
      "eng": "Dragostea Din Tei"
    },
    "year": 2003
  }
}