{
  "header": {
    "version": 4,
    "description": "Karaoke Mugen Karaoke Data File"
  },
  "medias": [
    {
      "version": "Default",
      "filename": "ENG - WWE Monday Night RAW - OP3 - Thorn in your Eye.mp4",
      "audiogain": -2.75,
      "loudnorm": "-14.43,-3.75,1.90,-24.50,0.11",
      "filesize": 7075495,
      "duration": 23,
      "default": true,
      "lyrics": [
        {
          "filename": "ENG - WWE Monday Night RAW - OP3 - Thorn in your Eye.ass",
          "default": true,
          "version": "Default",
          "subchecksum": "a3a1c5fe3f49f48fa6902286893232a9"
        }
      ]
    }
  ],
  "data": {
    "created_at": "2019-03-31T20:27:16.000Z",
    "kid": "97dab5f6-8e57-4365-9993-dc4750bfcae3",
    "modified_at": "2021-02-25T14:50:59.530Z",
    "repository": "world.karaokes.moe",
    "songorder": 3,
    "tags": {
      "authors": [
        "5a629611-96b4-422c-b309-ba7a58e263a2"
      ],
      "creators": [
        "cb9424d8-75d2-458a-9904-48afacca9d23"
      ],
      "families": [
        "5391f9fe-638c-415f-8dc9-958e3a2c5787"
      ],
      "groups": [
        "3c14c864-533c-49e6-a3cc-6969f1233775"
      ],
      "langs": [
        "de5eda1c-5fb3-46a6-9606-d4554fc5a1d6"
      ],
      "origins": [
        "8dd8d2a4-913a-4b0b-a555-1121cc603a57"
      ],
      "series": [
        "6922a01d-a529-474d-83b8-56d3eb3b60dc"
      ],
      "singers": [
        "d2f34f37-e9e4-4d86-9bf2-5f212aab4726",
        "e89dc8a6-f841-4994-88c6-0311a0754b4b"
      ],
      "songtypes": [
        "f02ad9b3-0bd9-4aad-85b3-9976739ba0e4"
      ],
      "songwriters": [
        "13fb046c-fa1d-4bc5-8d85-d384451e96d6"
      ]
    },
    "title": "Thorn in your Eye",
    "titles": {
      "eng": "Thorn in your Eye"
    },
    "year": 2001
  }
}