{
  "header": {
    "description": "Karaoke Mugen Tag File",
    "version": 1
  },
  "tag": {
    "i18n": {
      "eng": "Sony Music Records"
    },
    "modified_at": "2020-03-31T19:04:37.663Z",
    "name": "Sony Music Records",
    "repository": "world.karaokes.moe",
    "tid": "9f10c180-4ed1-4a4e-9e39-c37e09b91d5f",
    "types": [
      "creators"
    ]
  }
}