{
  "header": {
    "description": "Karaoke Mugen Tag File",
    "version": 1
  },
  "tag": {
    "i18n": {
      "eng": "Aaron Spelling"
    },
    "modified_at": "2020-06-21T21:00:25.802Z",
    "name": "Aaron Spelling",
    "repository": "world.karaokes.moe",
    "tid": "b06abcd4-22cd-45de-88d5-6eaaa9985a11",
    "types": [
      "creators"
    ]
  }
}