{
  "header": {
    "description": "Karaoke Mugen Tag File",
    "version": 1
  },
  "tag": {
    "i18n": {
      "eng": "Dr. Luke"
    },
    "modified_at": "2021-10-23T21:44:56.738Z",
    "name": "Dr. Luke",
    "repository": "world.karaokes.moe",
    "tid": "7d980b44-3f55-4917-a92a-0fa48385c592",
    "types": [
      "songwriters"
    ]
  }
}