{
  "header": {
    "version": 4,
    "description": "Karaoke Mugen Karaoke Data File"
  },
  "medias": [
    {
      "version": "Default",
      "filename": "FRE - Daniel Balavoine - MV - Mon fils ma bataille.mp4",
      "audiogain": -4.16,
      "loudnorm": "-14.29,-2.29,5.10,-24.48,-0.91",
      "filesize": 21128357,
      "duration": 241,
      "default": true,
      "lyrics": [
        {
          "filename": "FRE - Daniel Balavoine - MV - Mon fils ma bataille.ass",
          "default": true,
          "version": "Default",
          "subchecksum": "e56c84bda7fdd30134dcd81d6646c047"
        }
      ]
    }
  ],
  "data": {
    "created_at": "2020-08-15T19:31:11.871Z",
    "kid": "48fa89a9-1f7c-4a52-ad7f-2599707e3176",
    "modified_at": "2021-05-20T17:41:18.272Z",
    "repository": "world.karaokes.moe",
    "tags": {
      "authors": [
        "90414ca0-ab36-4879-8810-b032c6bfdab0"
      ],
      "creators": [
        "dee008b3-9388-4984-89a0-08935ecddc0d"
      ],
      "families": [
        "5391f9fe-638c-415f-8dc9-958e3a2c5787"
      ],
      "groups": [
        "7792cc27-9ff9-4d47-9287-2338b7db1575"
      ],
      "langs": [
        "fd8072b7-4d9b-45d4-8f5b-a931a830edef"
      ],
      "singers": [
        "c7f13ac7-c592-4fc0-888d-aeee059bf9f3"
      ],
      "songtypes": [
        "7be1b15c-cff8-4b37-a649-5c90f3d569a9"
      ],
      "songwriters": [
        "c7f13ac7-c592-4fc0-888d-aeee059bf9f3"
      ]
    },
    "title": "Mon fils ma bataille",
    "titles": {
      "eng": "Mon fils ma bataille"
    },
    "year": 1980
  }
}