{
  "header": {
    "version": 4,
    "description": "Karaoke Mugen Karaoke Data File"
  },
  "medias": [
    {
      "version": "Default",
      "filename": "ENG - Rammstein - MV - Engel.mp4",
      "audiogain": -9,
      "loudnorm": "-8.79,1.61,9.70,-18.92,-0.88",
      "filesize": 271207020,
      "duration": 265,
      "default": true,
      "lyrics": [
        {
          "filename": "ENG - Rammstein - MV - Engel.ass",
          "default": true,
          "version": "Default",
          "subchecksum": "978bd6ef2147d7c711db342a7cb90a9e"
        }
      ]
    }
  ],
  "data": {
    "created_at": "2020-07-11T23:12:42.736Z",
    "kid": "db2cf72a-1438-489e-ac17-246f3ad90c80",
    "modified_at": "2021-02-25T14:50:39.984Z",
    "repository": "world.karaokes.moe",
    "tags": {
      "authors": [
        "f9d6f119-844b-406e-bcfd-4b9c3ba3e885"
      ],
      "creators": [
        "d5aec01e-d1f7-4a1a-bbd5-6f6dcea0f385"
      ],
      "families": [
        "5391f9fe-638c-415f-8dc9-958e3a2c5787"
      ],
      "groups": [
        "24db50aa-a126-4d34-a48a-e45db79c4245"
      ],
      "langs": [
        "de5eda1c-5fb3-46a6-9606-d4554fc5a1d6"
      ],
      "singers": [
        "239ddf58-bd82-40c0-b783-7ed4e5aad61a"
      ],
      "songtypes": [
        "7be1b15c-cff8-4b37-a649-5c90f3d569a9"
      ],
      "songwriters": [
        "2b7d7eec-af1f-489d-aba7-136d6e0002c2",
        "6f6f8580-104e-4a53-b9bc-665dbbf645ee",
        "74dfb7de-a467-4f89-83be-d0334e1c32c0",
        "859de12f-b53c-4bc4-8206-2f7b167d9d7c",
        "a28ff534-66a3-4874-bb1e-c4cba8606023",
        "bae7369b-0278-4a58-be8c-295500eeb6b8"
      ]
    },
    "title": "Engel",
    "titles": {
      "eng": "Engel"
    },
    "year": 1997
  }
}