{
  "header": {
    "description": "Karaoke Mugen Tag File",
    "version": 1
  },
  "tag": {
    "i18n": {
      "eng": "The Cranberries"
    },
    "modified_at": "2020-05-07T17:54:11.018Z",
    "name": "The Cranberries",
    "repository": "world.karaokes.moe",
    "tid": "da356f57-ab51-4d6c-9ff8-91b6d3c7f2be",
    "types": [
      "singers"
    ]
  }
}