{
  "header": {
    "description": "Karaoke Mugen Tag File",
    "version": 1
  },
  "tag": {
    "i18n": {
      "eng": "50s"
    },
    "modified_at": "2020-03-31T19:04:33.242Z",
    "name": "50s",
    "repository": "world.karaokes.moe",
    "tid": "de0c8e96-9934-4251-9142-b7a5ee70dd6f",
    "types": [
      "groups"
    ]
  }
}