{
  "header": {
    "description": "Karaoke Mugen Tag File",
    "version": 1
  },
  "tag": {
    "i18n": {
      "eng": "Santiano"
    },
    "modified_at": "2021-03-18T23:11:34.590Z",
    "name": "Santiano",
    "repository": "world.karaokes.moe",
    "tid": "b6e92f3f-994d-42d1-b9df-e6d700216eda",
    "types": [
      "songwriters",
      "singers"
    ]
  }
}