{
  "header": {
    "description": "Karaoke Mugen Tag File",
    "version": 1
  },
  "tag": {
    "i18n": {
      "eng": "Matt Aitken"
    },
    "name": "Matt Aitken",
    "repository": "world.karaokes.moe",
    "tid": "4ca4829a-9ae5-4d55-900e-8471ba382b32",
    "types": [
      "songwriters"
    ]
  }
}