{
  "header": {
    "description": "Karaoke Mugen Tag File",
    "version": 1
  },
  "tag": {
    "i18n": {
      "eng": "Motor"
    },
    "modified_at": "2020-07-11T23:07:37.367Z",
    "name": "Motor",
    "repository": "world.karaokes.moe",
    "tid": "d5aec01e-d1f7-4a1a-bbd5-6f6dcea0f385",
    "types": [
      "creators"
    ]
  }
}