{
  "header": {
    "description": "Karaoke Mugen Tag File",
    "version": 1
  },
  "tag": {
    "aliases": [
      "Lee Seung-hyun"
    ],
    "i18n": {
      "eng": "Seungri"
    },
    "modified_at": "2021-11-13T12:57:59.242Z",
    "name": "Seungri",
    "repository": "world.karaokes.moe",
    "tid": "40dd7277-3c52-41f2-9e90-92aba7b5db1c",
    "types": [
      "singers"
    ]
  }
}