{
  "header": {
    "description": "Karaoke Mugen Tag File",
    "version": 1
  },
  "tag": {
    "aliases": [
      "Calogero Joseph Salvatore Maurici"
    ],
    "i18n": {
      "eng": "Calogero"
    },
    "modified_at": "2021-06-05T20:13:30.424Z",
    "name": "Calogero",
    "repository": "world.karaokes.moe",
    "tid": "0423c76b-2993-4e9a-b672-cca55a14d5ef",
    "types": [
      "songwriters",
      "singers"
    ]
  }
}