{
  "header": {
    "description": "Karaoke Mugen Tag File",
    "version": 1
  },
  "tag": {
    "i18n": {
      "eng": "Top Kaorin"
    },
    "modified_at": "2020-05-07T17:56:44.322Z",
    "name": "Top Kaorin",
    "repository": "world.karaokes.moe",
    "tid": "9a8e0fbc-dcae-4989-be82-7cad3436f1f5",
    "types": [
      "groups"
    ]
  }
}