{
  "header": {
    "description": "Karaoke Mugen Tag File",
    "version": 1
  },
  "tag": {
    "i18n": {
      "eng": "Maria Smith"
    },
    "modified_at": "2021-11-13T12:57:59.703Z",
    "name": "Maria Smith",
    "repository": "world.karaokes.moe",
    "tid": "d9bdbfb6-7aff-4fd4-813f-f18ce05b4b85",
    "types": [
      "songwriters"
    ]
  }
}