{
  "header": {
    "version": 4,
    "description": "Karaoke Mugen Karaoke Data File"
  },
  "medias": [
    {
      "version": "Default",
      "filename": "ENG - Scorpions - MV - Still Loving You.mp4",
      "audiogain": -2.88,
      "loudnorm": "-15.65,-3.04,14.20,-26.41,-2.05",
      "filesize": 20369651,
      "duration": 288,
      "default": true,
      "lyrics": [
        {
          "filename": "ENG - Scorpions - MV - Still Loving You.ass",
          "default": true,
          "version": "Default"
        }
      ]
    }
  ],
  "data": {
    "created_at": "2022-01-22T20:01:16.769Z",
    "ignoreHooks": false,
    "kid": "5557e9a2-a4e3-46c4-84fe-0f1fa162a48c",
    "modified_at": "2022-01-22T23:30:05.992Z",
    "repository": "world.karaokes.moe",
    "tags": {
      "authors": [
        "3846f34c-f5af-4f6d-b8ce-524dc0337d8f"
      ],
      "creators": [
        "078ec016-e167-49bf-ba43-af95adfc4c51"
      ],
      "families": [
        "5391f9fe-638c-415f-8dc9-958e3a2c5787"
      ],
      "groups": [
        "7792cc27-9ff9-4d47-9287-2338b7db1575"
      ],
      "langs": [
        "de5eda1c-5fb3-46a6-9606-d4554fc5a1d6"
      ],
      "singers": [
        "88af9430-4c88-4792-b602-97b79ee0c828"
      ],
      "songtypes": [
        "7be1b15c-cff8-4b37-a649-5c90f3d569a9"
      ],
      "songwriters": [
        "790c8568-d919-4f21-9b8e-7196a03e99d7",
        "92d0b797-39dd-40f9-8558-be8125359765"
      ]
    },
    "titles": {
      "eng": "Still Loving You"
    },
    "title": "Still Loving You",
    "year": 1984
  }
}