{
  "header": {
    "description": "Karaoke Mugen Tag File",
    "version": 1
  },
  "tag": {
    "i18n": {
      "eng": "Junior Torello"
    },
    "modified_at": "2021-05-21T20:14:34.720Z",
    "name": "Junior Torello",
    "repository": "world.karaokes.moe",
    "tid": "0b24ca8e-2ee7-4c11-b363-49528bcc2f2d",
    "types": [
      "songwriters"
    ]
  }
}