{
  "header": {
    "description": "Karaoke Mugen Tag File",
    "version": 1
  },
  "tag": {
    "i18n": {
      "eng": "Patrice Locci"
    },
    "name": "Patrice Locci",
    "repository": "world.karaokes.moe",
    "tid": "377d64a9-ffe2-4328-9cad-f647d041eff2",
    "types": [
      "songwriters"
    ]
  }
}