{
  "header": {
    "description": "Karaoke Mugen Tag File",
    "version": 1
  },
  "tag": {
    "i18n": {
      "eng": "The Union Underground"
    },
    "modified_at": "2020-07-16T16:31:56.911Z",
    "name": "The Union Underground",
    "repository": "world.karaokes.moe",
    "tid": "00a0d20e-ff5d-469c-99a0-8e6b8cd06792",
    "types": [
      "singers"
    ]
  }
}