{
  "header": {
    "version": 4,
    "description": "Karaoke Mugen Karaoke Data File"
  },
  "medias": [
    {
      "version": "Default",
      "filename": "FRE - K. Maro - MV - Femme Like U.mp4",
      "audiogain": -8.36,
      "loudnorm": "-8.71,1.37,7.10,-18.93,-0.69",
      "filesize": 69348607,
      "duration": 236,
      "default": true,
      "lyrics": [
        {
          "filename": "FRE - K. Maro - MV - Femme Like U.ass",
          "default": true,
          "version": "Default",
          "subchecksum": "5f4545f129ac21453e7bb2cf3f65af72"
        }
      ]
    }
  ],
  "data": {
    "created_at": "2020-07-09T18:14:01.312Z",
    "kid": "152836e7-c76e-4dcf-b001-2df136209a5d",
    "modified_at": "2021-02-25T14:52:03.050Z",
    "repository": "world.karaokes.moe",
    "tags": {
      "authors": [
        "568285fd-64fc-4faa-8331-c0a847024008"
      ],
      "creators": [
        "bd43efab-3cf4-4b4b-8888-dda16ecd0e04"
      ],
      "families": [
        "5391f9fe-638c-415f-8dc9-958e3a2c5787"
      ],
      "groups": [
        "3c14c864-533c-49e6-a3cc-6969f1233775"
      ],
      "langs": [
        "fd8072b7-4d9b-45d4-8f5b-a931a830edef"
      ],
      "singers": [
        "d8ffcec7-9d09-44aa-8d78-6f1601096be5"
      ],
      "songtypes": [
        "7be1b15c-cff8-4b37-a649-5c90f3d569a9"
      ],
      "songwriters": [
        "d8ffcec7-9d09-44aa-8d78-6f1601096be5"
      ]
    },
    "title": "Femme Like U",
    "titles": {
      "eng": "Femme Like U"
    },
    "year": 2004
  }
}