{
  "header": {
    "version": 4,
    "description": "Karaoke Mugen Karaoke Data File"
  },
  "medias": [
    {
      "version": "Default",
      "filename": "ENG - GoonRock, LMFAO, Lauren Bennett - MV - Party Rock Anthem.mp4",
      "audiogain": -4.43,
      "loudnorm": "-13.35,-1.43,5.50,-23.41,-0.73",
      "filesize": 60324921,
      "duration": 273,
      "default": true,
      "lyrics": [
        {
          "filename": "ENG - GoonRock, LMFAO, Lauren Bennett - MV - Party Rock Anthem.ass",
          "default": true,
          "version": "Default",
          "subchecksum": "b9bae28df630faeb805091c2db3a3c86"
        }
      ]
    }
  ],
  "data": {
    "created_at": "2021-05-21T20:31:02.192Z",
    "kid": "fd5759a4-3a47-44d3-8c77-21dc2ebe9f2f",
    "modified_at": "2021-05-21T20:49:52.045Z",
    "repository": "world.karaokes.moe",
    "tags": {
      "authors": [
        "aea68e75-e469-45bd-be80-67f2af0e6b2d"
      ],
      "creators": [
        "1dd831cf-c4f4-4489-9021-e0c2633a824a",
        "5ccd3d6d-03de-448a-9bb8-fadb30db6be1",
        "ed7689db-cc8f-4f27-a860-8cc7dde10c17"
      ],
      "families": [
        "5391f9fe-638c-415f-8dc9-958e3a2c5787"
      ],
      "groups": [
        "ae613721-1fbe-480d-ba6b-d6d0702b184d"
      ],
      "langs": [
        "de5eda1c-5fb3-46a6-9606-d4554fc5a1d6"
      ],
      "misc": [
        "86705d4b-24e4-4756-9687-2b9c98bcf366"
      ],
      "singers": [
        "4d2e3c5b-e31d-4d23-a06c-f6e5b9b15fd2",
        "a95c335c-84c0-49a3-b055-377bbe1299a9",
        "b4200fcf-a8c2-470d-9487-13cdfb2d58a3"
      ],
      "songtypes": [
        "7be1b15c-cff8-4b37-a649-5c90f3d569a9"
      ],
      "songwriters": [
        "2ff69cd9-a55f-44f4-af0d-d063c9667953",
        "7b74fa15-f9a7-4054-8760-e4e3f5d4506f",
        "a38f1809-300d-4686-86e4-d8ff9a547904",
        "b7a9211d-f8fc-4d53-9870-cc31be152f12"
      ]
    },
    "title": "Party Rock Anthem",
    "titles": {
      "eng": "Party Rock Anthem"
    },
    "year": 2011
  }
}