{
  "header": {
    "description": "Karaoke Mugen Tag File",
    "version": 1
  },
  "tag": {
    "i18n": {
      "afr": "Duits",
      "alb": "Gjermane",
      "amh": "ጀርመን",
      "ara": "الألمانية",
      "arm": "Գերմաներեն",
      "aze": "Alman",
      "bak": "Алман теле",
      "baq": "German",
      "bel": "Нямецкі",
      "ben": "জার্মান",
      "bos": "Njemački",
      "bul": "Немски",
      "cat": "Alemany",
      "chi": "德",
      "cze": "Němčina",
      "dan": "Tysk",
      "dut": "Duits",
      "eng": "German",
      "epo": "La germana",
      "est": "Saksamaa",
      "fin": "Saksa",
      "fre": "Allemand",
      "geo": "გერმანული",
      "ger": "Deutsch",
      "gla": "Gearmailteach",
      "gle": "Gearmáinis",
      "glg": "Alemán",
      "gre": "Γερμανικά",
      "guj": "જર્મન",
      "hat": "Alman",
      "heb": "גרמנית",
      "hin": "जर्मन",
      "hrv": "Njemački",
      "hun": "Német",
      "ice": "Þýska",
      "ind": "Jerman",
      "ita": "Tedesco",
      "jav": "Jerman",
      "jpn": "ドイツ",
      "kan": "ಜರ್ಮನ್",
      "kaz": "Неміс",
      "kir": "Немецкий",
      "kor": "독일",
      "lat": "German",
      "lav": "Vācu",
      "lit": "Vokiečių",
      "mac": "Германски",
      "mal": "ജർമ്മൻ",
      "mao": "Tiamana",
      "mar": "जर्मनमधील रहीवासी",
      "may": "Jerman",
      "mlg": "Deutsch",
      "mlt": "Ġermaniż",
      "mon": "Герман",
      "nep": "जर्मन",
      "nor": "Tysk",
      "pan": "ਜਰਮਨ",
      "per": "آلمانی",
      "pol": "Niemiecki",
      "por": "Alemão",
      "rum": "Germană",
      "rus": "Немецкий",
      "sin": "ජර්මානු",
      "slo": "Nemecký",
      "slv": "Nemški",
      "spa": "Alemán",
      "srp": "Немачки",
      "sun": "Jerman",
      "swa": "Ujerumani",
      "swe": "Tyska",
      "tam": "ஜெர்மன்",
      "tat": "Алман теле",
      "tel": "జర్మన్",
      "tgk": "Олмон",
      "tgl": "Aleman",
      "tha": "เยอรมัน",
      "tur": "Almanca",
      "ukr": "Німецький",
      "urd": "جرمن",
      "uzb": "Nemis",
      "vie": "Đức",
      "wel": "Almaeneg",
      "xho": "Isijamani",
      "yid": "דייַטש"
    },
    "modified_at": "2021-03-17T23:05:38.397Z",
    "name": "ger",
    "repository": "world.karaokes.moe",
    "tid": "b39ffaee-d9cd-44b0-bf35-b019327c3336",
    "types": [
      "langs"
    ]
  }
}