{
  "header": {
    "description": "Karaoke Mugen Tag File",
    "version": 1
  },
  "tag": {
    "i18n": {
      "eng": "Molly Lewis"
    },
    "modified_at": "2020-08-19T10:26:41.610Z",
    "name": "Molly Lewis",
    "repository": "world.karaokes.moe",
    "tid": "80f80f3c-474f-4ed9-a93b-9b04929b8254",
    "types": [
      "singers"
    ]
  }
}