{
  "header": {
    "description": "Karaoke Mugen Tag File",
    "version": 1
  },
  "tag": {
    "i18n": {
      "eng": "Éric Lévi"
    },
    "modified_at": "2020-03-31T19:04:34.312Z",
    "name": "Éric Lévi",
    "repository": "world.karaokes.moe",
    "tid": "7e7a0c22-a57a-4559-97d0-18c0d210455c",
    "types": [
      "songwriters"
    ]
  }
}