{
  "header": {
    "version": 4,
    "description": "Karaoke Mugen Karaoke Data File"
  },
  "medias": [
    {
      "version": "Default",
      "filename": "GER - Santiano - MV - Konnt ihr mich horen.mp4",
      "audiogain": -8.64,
      "loudnorm": "-8.57,0.16,4.40,-18.71,-0.68",
      "filesize": 68775566,
      "duration": 272,
      "default": true,
      "lyrics": [
        {
          "filename": "GER - Santiano - MV - Konnt ihr mich horen.ass",
          "default": true,
          "version": "Default",
          "subchecksum": "f62aaa835b11b6e35c379683f52fd07b"
        }
      ]
    }
  ],
  "data": {
    "created_at": "2021-03-19T21:45:50.778Z",
    "kid": "e7a5d4d8-c205-4360-bb5b-b2153da4519a",
    "modified_at": "2021-03-19T22:00:38.235Z",
    "repository": "world.karaokes.moe",
    "tags": {
      "authors": [
        "64935141-c7c3-487c-995d-fa35bf8d08ab"
      ],
      "creators": [
        "e18ce236-7944-471a-9dad-86af600bafb8"
      ],
      "families": [
        "5391f9fe-638c-415f-8dc9-958e3a2c5787"
      ],
      "groups": [
        "ae613721-1fbe-480d-ba6b-d6d0702b184d"
      ],
      "langs": [
        "b39ffaee-d9cd-44b0-bf35-b019327c3336"
      ],
      "singers": [
        "b6e92f3f-994d-42d1-b9df-e6d700216eda"
      ],
      "songtypes": [
        "7be1b15c-cff8-4b37-a649-5c90f3d569a9"
      ],
      "songwriters": [
        "b6e92f3f-994d-42d1-b9df-e6d700216eda"
      ]
    },
    "title": "Könnt ihr mich hören",
    "titles": {
      "eng": "Könnt ihr mich hören"
    },
    "year": 2017
  }
}