{
  "header": {
    "description": "Karaoke Mugen Tag File",
    "version": 1
  },
  "tag": {
    "i18n": {
      "eng": "Bon Scott"
    },
    "modified_at": "2020-07-11T21:54:36.739Z",
    "name": "Bon Scott",
    "repository": "world.karaokes.moe",
    "tid": "ed15bd24-b7ea-4334-9203-1c3acbab8f0f",
    "types": [
      "songwriters"
    ]
  }
}