{
  "header": {
    "description": "Karaoke Mugen Tag File",
    "version": 1
  },
  "tag": {
    "i18n": {
      "eng": "Beneblade"
    },
    "modified_at": "2021-03-18T23:22:18.863Z",
    "name": "Beneblade",
    "repository": "world.karaokes.moe",
    "tid": "3d443636-e0b9-46f1-950e-357043331c46",
    "types": [
      "authors"
    ]
  }
}