{
  "header": {
    "description": "Karaoke Mugen Tag File",
    "version": 1
  },
  "tag": {
    "i18n": {
      "afr": "Tsjetsjeense",
      "amh": "Chechen",
      "ara": "الشيشان",
      "aze": "Чеченец",
      "bak": "Чеченец",
      "bel": "Чачэнец",
      "bul": "Чеченец",
      "ben": "চেচেন",
      "bos": "Čečenskih",
      "cat": "Txetxè",
      "cze": "Čečenští",
      "wel": "Chechen",
      "dan": "Tjetjenske",
      "ger": "Tschetschenien",
      "gre": "Τσέτσνιαν",
      "eng": "Chechen",
      "epo": "Ĉeĉena",
      "spa": "Chechenia",
      "est": "Tšetšeeni",
      "baq": "Txetxeniera",
      "per": "چچن",
      "fin": "Chechen",
      "fre": "Tchétchène",
      "gle": "Sisinis",
      "gla": "Chechen",
      "glg": "Checheno",
      "guj": "ચેચન",
      "heb": "הצ ' צ ' נים",
      "hin": "चेचन",
      "hrv": "Чеченец",
      "hat": "Chenchen",
      "hun": "Csecsen",
      "arm": "Չեչեն",
      "ind": "Chechnya",
      "ice": "Tétenska",
      "ita": "Ceceno",
      "jpn": "チェチェン",
      "jav": "Chechen",
      "geo": "ჩეჩენი",
      "kaz": "Шешен",
      "kan": "ಎರ್ಝ್ಯಾ",
      "kor": "체첸",
      "kir": "Чеченец",
      "lat": "Chechen",
      "lit": "Čečėnijos",
      "lav": "Čečenijas",
      "mlg": "Tsetsenina",
      "mao": "Cantonese",
      "mac": "Чеченско",
      "mal": "ഭൂമിശാസ്ത്രം",
      "mon": "Chechen",
      "mar": "Chechen",
      "may": "Chechen",
      "mlt": "}",
      "nep": "चेचेन name",
      "dut": "Tsjetsjeens",
      "nor": "Tsjetsjenske",
      "pan": "ਚੇਚਨ",
      "pol": "Czeczeniec",
      "por": "Checheno",
      "rum": "Cecenia",
      "rus": "Чеченец",
      "sin": "චෙච්නියානු",
      "slo": "Čečenskej",
      "slv": "Čečenskih",
      "alb": "Çeçen",
      "srp": "Чеченски",
      "sun": "Chechen",
      "swe": "Tjetjenska",
      "swa": "Chechen",
      "tam": "செசென்",
      "tel": "చెచెన్",
      "tgk": "Чеченец",
      "tha": "ภาษาเชเชน name",
      "tgl": "Chechen",
      "tur": "Çeçen",
      "tat": "Чеченец",
      "ukr": "Чеченець",
      "urd": "چیچن",
      "uzb": "Chechen",
      "vie": "Chechen",
      "xho": "Chechen",
      "yid": "טשעטשען",
      "chi": "车臣"
    },
    "name": "che",
    "tid": "3674d3b1-469f-4da6-8c71-615a1cf64512",
    "types": [
      "langs"
    ],
    "repository": "world.karaokes.moe",
    "modified_at": "2020-03-31T19:04:33.883Z"
  }
}