{
  "header": {
    "description": "Karaoke Mugen Tag File",
    "version": 1
  },
  "tag": {
    "i18n": {
      "eng": "Dominique Nicolas"
    },
    "modified_at": "2020-06-01T22:11:26.616Z",
    "name": "Dominique Nicolas",
    "repository": "world.karaokes.moe",
    "tid": "8d6399fc-c9ab-471a-8f67-cc1e9dfcf953",
    "types": [
      "songwriters"
    ]
  }
}