{
  "header": {
    "description": "Karaoke Mugen Tag File",
    "version": 1
  },
  "tag": {
    "i18n": {
      "eng": "Dee Dee Halligan"
    },
    "modified_at": "2021-05-21T20:14:34.661Z",
    "name": "Dee Dee Halligan",
    "repository": "world.karaokes.moe",
    "tid": "c3bf548c-a686-4cee-966b-b8c2ee645b64",
    "types": [
      "songwriters"
    ]
  }
}