{
  "header": {
    "version": 4,
    "description": "Karaoke Mugen Karaoke Data File"
  },
  "medias": [
    {
      "version": "Default",
      "filename": "FRE - Telephone - MV - Cendrillon.mp4",
      "audiogain": -1.08,
      "loudnorm": "-16.32,0.90,7.10,-26.51,-1.32",
      "filesize": 39627879,
      "duration": 238,
      "default": true,
      "lyrics": [
        {
          "filename": "FRE - Telephone - MV - Cendrillon.ass",
          "default": true,
          "version": "Default",
          "subchecksum": "1279ddd99451edb75de33acde30a0d78"
        }
      ]
    }
  ],
  "data": {
    "created_at": "2020-06-01T16:09:11.284Z",
    "kid": "852074d5-18cf-49e1-9dfb-61f35c2f997e",
    "modified_at": "2021-05-20T17:41:27.868Z",
    "repository": "world.karaokes.moe",
    "tags": {
      "authors": [
        "90414ca0-ab36-4879-8810-b032c6bfdab0",
        "966e02e9-ed3c-403e-82ba-a9f40aa01b57"
      ],
      "creators": [
        "4a4d4107-5002-48c8-a776-060ff61ecb0c"
      ],
      "families": [
        "5391f9fe-638c-415f-8dc9-958e3a2c5787"
      ],
      "groups": [
        "7792cc27-9ff9-4d47-9287-2338b7db1575"
      ],
      "langs": [
        "fd8072b7-4d9b-45d4-8f5b-a931a830edef"
      ],
      "singers": [
        "8e3acba8-0f8c-4dba-87e3-885ca8b77a77"
      ],
      "songtypes": [
        "7be1b15c-cff8-4b37-a649-5c90f3d569a9"
      ],
      "songwriters": [
        "55060455-7df0-4cd8-92fe-67a29f2f13d8"
      ]
    },
    "title": "Cendrillon",
    "titles": {
      "eng": "Cendrillon"
    },
    "year": 1982
  }
}