{
  "header": {
    "description": "Karaoke Mugen Tag File",
    "version": 1
  },
  "tag": {
    "i18n": {
      "afr": "Luxemburgse, Letzeburgesch",
      "amh": "Luxembourgish, Letzeburgesch",
      "ara": "اللوكسمبرجية ، Letzeburgesch",
      "aze": "Люксембургский Edir",
      "bak": "Люксембург Теле, Тупланған",
      "bel": "Люксембургскі, Змяшчае",
      "bul": "Люксембургската Съдържа",
      "ben": "লুক্সেমবার্গীয়, Letzeburgesch",
      "bos": "Luksemburški, Letzeburgesch",
      "cat": "Luxemburguès, Letzeburgesch",
      "cze": "Lucemburské, Letzeburgesch",
      "wel": "Luxembourgish, Letzeburgesch",
      "dan": "Luxembourgsk, Sprogunderstøttelse",
      "ger": "Luxemburgisch, > Luxemburgisch",
      "gre": "Λουξεμβουργιανά, Λουξεμβουργιανά",
      "eng": "Luxembourgish, Letzeburgesch",
      "epo": "Luksemburga Lingvo, Letzeburgesch",
      "spa": "El Luxemburgués, Letzeburgesch",
      "est": "Letseburgi, Letzeburgesch",
      "baq": "Luxembourgish, Letzeburgesch",
      "per": "فارویی های Letzeburgesch",
      "fin": "Luxemburgin, Letzeburgesch",
      "fre": "Le Luxembourgeois, Langue Luxembourgeoise",
      "gle": "Leitseabuirgis, Letzeburgesch",
      "gla": "Lugsamburgais, Letzeburgesch",
      "glg": "Luxemburgués, Letzeburgesch",
      "guj": "લક્ઝેમબર્ગિશ Letzeburgesch",
      "heb": "לוקסמבורגיתname, Letzeburgesch",
      "hin": "लक्ष्ज़ेमबर्गिश, Letzeburgesch",
      "hrv": "Luksemburški Sadrži",
      "hat": "Luxembourgish, Letzeburgesch",
      "hun": "Luxemburgi, Letzeburgesch",
      "arm": "Լյուքսեմբուրգերեն, Պարունակում Է",
      "ind": "Luksemburg, Letzeburgesch",
      "ice": "Íslenska, Letzeburgesch",
      "ita": "Il Lussemburghese, Il Lussemburghese",
      "jpn": "Luxembourgishは、Letzeburgesch",
      "jav": "Luxembourgish, Letzeburgesch",
      "geo": "კეჩუა, Letzeburgesch",
      "kaz": "Люксембург, Құрамында",
      "kan": "ಲಕ್ಸಂಬರ್ಗ್, Letzeburgesch",
      "kor": "룩셈부르크,Letzeburgesch",
      "kir": "Люксембургский Камтыйт",
      "lat": "Luxembourgish, Letzeburgesch",
      "lit": "Liuksemburgiečių, Letzeburgesch",
      "lav": "Luksemburgas, Luksemburgiešu",
      "mlg": "Zavatra, Letzeburgesch",
      "mao": "Luxembourgish, Letzeburgesch",
      "mac": "Luxembourgish, Letzeburgesch",
      "mal": "Luxembourgish, Letzeburgesch",
      "mon": "Luxembourgish, Letzeburgesch",
      "mar": "प्यिमाँती, Letzeburgesch",
      "may": "Luxembourg, Letzeburgesch",
      "mlt": "Lussemburgiż, Letzeburgesch",
      "nep": "Luxembourgish, Letzeburgesch",
      "dut": "Luxemburgs, Letzeburgesch",
      "nor": "Luxembourgske, Letzeburgesch",
      "pan": "ਲਕਸਮਬਰਗੀ, Letzeburgesch",
      "pol": "Luksemburski, Zawiera",
      "por": "Luxemburguês, Letzeburgesch",
      "rum": "Luxemburgheză, Letzeburgesch",
      "rus": "Люксембургский, Содержит",
      "sin": "Luxembourgish, Letzeburgesch",
      "slo": "Luxemburský, Letzeburgesch",
      "slv": "Luksemburški, Maldivijščino",
      "alb": "Luxembourgish, Letzeburgesch",
      "srp": "Луксембуршки, Садржи",
      "sun": "Luxembourgish, Letzeburgesch",
      "swe": "Luxemburgiska, Luxemburgska",
      "swa": "Luxembourgish, Letzeburgesch",
      "tam": "லக்க்ஷெம்பர்கிஷ், Letzeburgesch",
      "tel": "లుక్సంబర్గిష్, Letzeburgesch",
      "tgk": "Люксембургский, Дорои",
      "tha": "ภาษาลักเซมเบอร์ก Name,Letzeburgesch",
      "tgl": "Luxembourgish, Letzeburgesch",
      "tur": "Lüksemburgca, Letzeburgesch",
      "tat": "Люксембург Теле, Тупланган",
      "ukr": "Люксембурзька, Містить",
      "urd": "لگژمبرگ کا باشندہ Letzeburgesch",
      "uzb": "Luxembourgish, Letzeburgesch",
      "vie": "Luxembourg, Letzeburgesch",
      "xho": "Luxembourgname, Letzeburgesch",
      "yid": "Luxembourgish, Letzeburgesch",
      "chi": "卢森堡文，Letzeburgesch"
    },
    "name": "ltz",
    "tid": "52c4c92f-fef8-4a50-ad48-b6d533fa0697",
    "types": [
      "langs"
    ],
    "repository": "world.karaokes.moe",
    "modified_at": "2020-03-31T19:04:35.877Z"
  }
}