{
  "header": {
    "description": "Karaoke Mugen Tag File",
    "version": 1
  },
  "tag": {
    "i18n": {
      "eng": "Julie Bergan"
    },
    "modified_at": "2021-11-13T12:57:59.239Z",
    "name": "Julie Bergan",
    "repository": "world.karaokes.moe",
    "tid": "7eb1c5a5-0754-4690-9002-bad6e033e7a5",
    "types": [
      "singers"
    ]
  }
}