{
  "header": {
    "description": "Karaoke Mugen Tag File",
    "version": 1
  },
  "tag": {
    "i18n": {
      "eng": "Damon Albarn"
    },
    "modified_at": "2020-07-05T18:25:38.737Z",
    "name": "Damon Albarn",
    "repository": "world.karaokes.moe",
    "tid": "db410c6a-e5e3-44d9-8133-038b99122e80",
    "types": [
      "songwriters"
    ]
  }
}