{
  "header": {
    "description": "Karaoke Mugen Tag File",
    "version": 1
  },
  "tag": {
    "i18n": {
      "eng": "Achilles"
    },
    "modified_at": "2021-03-19T21:52:05.001Z",
    "name": "Achilles",
    "repository": "world.karaokes.moe",
    "tid": "64935141-c7c3-487c-995d-fa35bf8d08ab",
    "types": [
      "authors"
    ]
  }
}