{
  "header": {
    "description": "Karaoke Mugen Tag File",
    "version": 1
  },
  "tag": {
    "i18n": {
      "afr": "Masedonies",
      "amh": "ማከዶኒኛ",
      "ara": "المقدونية",
      "aze": "Makedoniyalı",
      "bak": "Македон теле",
      "bel": "Македонская",
      "bul": "Македонски",
      "ben": "মেসিডোনিয়ান",
      "bos": "Makedonskog",
      "cat": "Macedònia",
      "cze": "Makedonština",
      "wel": "Macedonian",
      "dan": "Makedonske",
      "ger": "Mazedonisch",
      "gre": "Μακεδονικό",
      "eng": "Macedonian",
      "epo": "Makedona",
      "spa": "Macedonio",
      "est": "Makedoonia",
      "baq": "Mazedoniera",
      "per": "مقدونی",
      "fin": "Macedonian",
      "fre": "Le macédonien",
      "gle": "Macadóinis",
      "gla": "Masadonais",
      "glg": "Macedonio",
      "guj": "મેસેડોનિયન",
      "heb": "מקדוניה",
      "hin": "मकदूनियाई",
      "hrv": "Makedonski",
      "hat": "Masedonyen",
      "hun": "Macedón",
      "arm": "Մակեդոներեն",
      "ind": "Macedonia",
      "ice": "Makedóníu",
      "ita": "Macedone",
      "jpn": "マケドニア",
      "jav": "Makedonia",
      "geo": "მაკედონიის",
      "kaz": "Македон",
      "kan": "ಮೆಸಿಡೋನಿಯನ್",
      "kor": "마케도니아",
      "kir": "Македонский",
      "lat": "Macedonum",
      "lit": "Makedonų",
      "lav": "Maķedoniešu",
      "mlg": "Makedoniana",
      "mao": "Makeronia",
      "mac": "Македонски",
      "mal": "തതാരി",
      "mon": "Македон",
      "mar": "मॅसेडोनियन",
      "may": "Macedonia",
      "mlt": "Maċedonjan",
      "nep": "म्यासेडोनियन",
      "dut": "Macedonisch",
      "nor": "Makedonske",
      "pan": "ਮਕਦੂਨੀ",
      "pol": "Macedoński",
      "por": "Macedónio",
      "rum": "Macedonean",
      "rus": "Македонский",
      "sin": "මැසිඩෝනියානු",
      "slo": "Macedónska",
      "slv": "Makedonski",
      "alb": "Maqedonase",
      "srp": "Македонски",
      "sun": "Makedonia",
      "swe": "Makedonska",
      "swa": "Kimasedonia",
      "tam": "மாஸிடோனியன்",
      "tel": "మసడోనియన్",
      "tgk": "Мақдунӣ",
      "tha": "ภาษามาเซโดเนีย name",
      "tgl": "Macedonian",
      "tur": "Makedon",
      "tat": "Македон теле",
      "ukr": "Македонська",
      "urd": "مقدونیائی",
      "uzb": "Makedoniya",
      "vie": "Macedonia",
      "xho": "Macedonian",
      "yid": "מאַקעדאָניש",
      "chi": "马其顿"
    },
    "name": "mac",
    "tid": "0f61f696-2ae0-4f99-a0d5-a51989d84dbd",
    "types": [
      "langs"
    ],
    "repository": "world.karaokes.moe",
    "modified_at": "2020-03-31T19:04:35.907Z"
  }
}