{
  "header": {
    "description": "Karaoke Mugen Tag File",
    "version": 1
  },
  "tag": {
    "i18n": {
      "eng": "Billie Joe Armstrong"
    },
    "modified_at": "2020-08-15T19:57:14.851Z",
    "name": "Billie Joe Armstrong",
    "repository": "world.karaokes.moe",
    "tid": "1d3ce353-4730-499d-9444-d33c3a48e95b",
    "types": [
      "songwriters"
    ]
  }
}