{
  "header": {
    "description": "Karaoke Mugen Tag File",
    "version": 1
  },
  "tag": {
    "i18n": {
      "afr": "Oromo",
      "amh": "ኦሮሞዎች",
      "ara": "الأورومو",
      "aze": "Oromo",
      "bak": "Оромо теле",
      "bel": "Арам",
      "bul": "Оромо",
      "ben": "Oromo",
      "bos": "Oromo",
      "cat": "Oromo",
      "cze": "Oromo",
      "wel": "Oromo",
      "dan": "Oromo",
      "ger": "Oromo",
      "gre": "Oromo",
      "eng": "Oromo",
      "epo": "Angla",
      "spa": "Oromo",
      "est": "Oromo",
      "baq": "Oromo",
      "per": "اورومی",
      "fin": "Oromo",
      "fre": "Oromo",
      "gle": "Oromo",
      "gla": "Oromo",
      "glg": "Pomo",
      "guj": "ઓરોમો",
      "heb": "אורומוname",
      "hin": "ओरोमो",
      "hrv": "Oromo",
      "hat": "Oromo",
      "hun": "Oromo",
      "arm": "Oromo",
      "ind": "Oromo",
      "ice": "Íslenska",
      "ita": "Oromo",
      "jpn": "オロモ",
      "jav": "Oromo",
      "geo": "Oromo",
      "kaz": "Оромо",
      "kan": "Oromo",
      "kor": "Oromo",
      "kir": "Оромо",
      "lat": "Oromo",
      "lit": "Oromo",
      "lav": "Oromo",
      "mlg": "Oromo",
      "mao": "Oromo",
      "mac": "Oromo",
      "mal": "ഖുര്ആന് പാരായണം",
      "mon": "Oromo",
      "mar": "Oromo",
      "may": "Oromo",
      "mlt": "Oromo",
      "nep": "Oromo",
      "dut": "Oromo",
      "nor": "Oromo",
      "pan": "Oromo",
      "pol": "Оромо",
      "por": "Oromo",
      "rum": "Oromo",
      "rus": "Оромо",
      "sin": "Oromo",
      "slo": "Oromo",
      "slv": "Gelščino",
      "alb": "Oromo",
      "srp": "Оромо",
      "sun": "Oromo",
      "swe": "Oromo",
      "swa": "Oromo",
      "tam": "Oromo",
      "tel": "Oromo",
      "tgk": "Оромо",
      "tha": "ภาษาโอโรโม name",
      "tgl": "Oromo",
      "tur": "Oromo",
      "tat": "Оромо теле",
      "ukr": "Оромо",
      "urd": "اورومو",
      "uzb": "Oromo",
      "vie": "Bosnia",
      "xho": "Oromo",
      "yid": "Oromo",
      "chi": "奥罗莫"
    },
    "name": "orm",
    "tid": "cbe12325-941d-4b6f-ae9d-d16010eaffed",
    "types": [
      "langs"
    ],
    "repository": "world.karaokes.moe",
    "modified_at": "2020-03-31T19:04:36.833Z"
  }
}