{
  "header": {
    "description": "Karaoke Mugen Tag File",
    "version": 1
  },
  "tag": {
    "aliases": [
      "Adele Adkins"
    ],
    "i18n": {
      "eng": "Adele"
    },
    "modified_at": "2021-03-11T22:59:43.991Z",
    "name": "Adele",
    "repository": "world.karaokes.moe",
    "tid": "352bcfc0-88ee-465c-8f2e-3e1d07b610cd",
    "types": [
      "songwriters",
      "singers"
    ]
  }
}