{
  "header": {
    "description": "Karaoke Mugen Tag File",
    "version": 1
  },
  "tag": {
    "i18n": {
      "eng": "Soramimi"
    },
    "name": "Soramimi",
    "repository": "world.karaokes.moe",
    "tid": "1db1738f-acdc-42fc-aec3-60f4bddf660d",
    "types": [
      "authors"
    ]
  }
}