{
  "header": {
    "version": 4,
    "description": "Karaoke Mugen Karaoke Data File"
  },
  "medias": [
    {
      "version": "Default",
      "filename": "FRE - Mozart l'Opera Rock - LIVE - Dors mon ange.mp4",
      "audiogain": -8.12,
      "loudnorm": "-10.65,1.42,13.70,-21.63,-1.53",
      "filesize": 13535442,
      "duration": 154,
      "default": true,
      "lyrics": [
        {
          "filename": "FRE - Mozart l'Opera Rock - LIVE - Dors mon ange.ass",
          "default": true,
          "version": "Default"
        }
      ]
    }
  ],
  "data": {
    "created_at": "2022-01-23T09:49:17.046Z",
    "ignoreHooks": false,
    "kid": "c590c0f6-b39b-40ac-acdf-7515541c613f",
    "modified_at": "2022-01-23T12:09:16.857Z",
    "repository": "world.karaokes.moe",
    "tags": {
      "authors": [
        "0275191e-6efa-4aee-b15c-74f594274dd3"
      ],
      "creators": [
        "6664a8ea-4dd4-416c-aaaf-2739cf34ead6",
        "be6050d0-f2bf-43cb-a646-6e600bdb383c"
      ],
      "families": [
        "5391f9fe-638c-415f-8dc9-958e3a2c5787"
      ],
      "groups": [
        "3c14c864-533c-49e6-a3cc-6969f1233775"
      ],
      "langs": [
        "fd8072b7-4d9b-45d4-8f5b-a931a830edef"
      ],
      "series": [
        "91f0c410-bb44-4a25-8087-e0f2bc2439f9"
      ],
      "singers": [
        "fb7c1953-406e-4b91-b6c2-b47d7d2d2fc4"
      ],
      "songtypes": [
        "a0167949-580c-4de3-bf13-497e462e02f3"
      ],
      "songwriters": [
        "6664a8ea-4dd4-416c-aaaf-2739cf34ead6",
        "bc20ec46-2198-4369-b638-cf93b7989ba0"
      ]
    },
    "titles": {
      "eng": "Dors mon ange",
      "fre": "Dors mon ange"
    },
    "title": "Dors mon ange",
    "year": 2009
  }
}