{
  "header": {
    "version": 4,
    "description": "Karaoke Mugen Karaoke Data File"
  },
  "medias": [
    {
      "version": "Default",
      "filename": "ENG - Nathan Evans, Santiano - MV - Wellerman.mp4",
      "audiogain": -8.41,
      "loudnorm": "-8.45,1.19,4.30,-18.59,-0.62",
      "filesize": 63980871,
      "duration": 187,
      "default": true,
      "lyrics": [
        {
          "filename": "ENG - Nathan Evans, Santiano - MV - Wellerman.ass",
          "default": true,
          "version": "Default",
          "subchecksum": "f72ff3e72d7b3f9d72c244c14d10dfb4"
        }
      ]
    }
  ],
  "data": {
    "created_at": "2021-05-20T17:36:24.260Z",
    "kid": "56d58bd6-7430-4e68-8ba5-39c084533ec2",
    "modified_at": "2021-05-20T17:44:06.843Z",
    "repository": "world.karaokes.moe",
    "tags": {
      "authors": [
        "90414ca0-ab36-4879-8810-b032c6bfdab0"
      ],
      "creators": [
        "e18ce236-7944-471a-9dad-86af600bafb8"
      ],
      "families": [
        "5391f9fe-638c-415f-8dc9-958e3a2c5787"
      ],
      "groups": [
        "8e209ae4-4381-438f-89dc-1b21752027d2"
      ],
      "langs": [
        "de5eda1c-5fb3-46a6-9606-d4554fc5a1d6"
      ],
      "singers": [
        "69bab806-be0a-4273-9873-0b284faa0d01",
        "b6e92f3f-994d-42d1-b9df-e6d700216eda"
      ],
      "songtypes": [
        "7be1b15c-cff8-4b37-a649-5c90f3d569a9"
      ]
    },
    "title": "Wellerman",
    "titles": {
      "eng": "Wellerman"
    },
    "year": 2021
  }
}