{
  "header": {
    "description": "Karaoke Mugen Tag File",
    "version": 1
  },
  "tag": {
    "i18n": {
      "eng": "Eric Bass"
    },
    "modified_at": "2020-07-16T16:39:04.760Z",
    "name": "Eric Bass",
    "repository": "world.karaokes.moe",
    "tid": "4dda2634-b11c-4d5e-a435-785b09de06f3",
    "types": [
      "songwriters"
    ]
  }
}