{
  "header": {
    "description": "Karaoke Mugen Tag File",
    "version": 1
  },
  "tag": {
    "i18n": {
      "eng": "Serj Tankian"
    },
    "name": "Serj Tankian",
    "repository": "world.karaokes.moe",
    "tid": "51d283ed-eab7-418f-85a9-aa8707c1bc5f",
    "types": [
      "singers",
      "songwriters"
    ]
  }
}