{
  "header": {
    "version": 4,
    "description": "Karaoke Mugen Karaoke Data File"
  },
  "medias": [
    {
      "version": "Default",
      "filename": "FRE - Mozart l'Opera Rock - LIVE - Les solos sous les draps.mp4",
      "audiogain": -3.7,
      "loudnorm": "-14.27,-3.32,10.80,-24.66,-1.44",
      "filesize": 56903976,
      "duration": 220,
      "default": true,
      "lyrics": [
        {
          "filename": "FRE - Mozart l'Opera Rock - LIVE - Les solos sous les draps.ass",
          "default": true,
          "version": "Default"
        }
      ]
    }
  ],
  "data": {
    "created_at": "2022-01-23T10:15:36.482Z",
    "ignoreHooks": false,
    "kid": "3ec23dfd-94ae-4ef1-b693-5f2217b9aae2",
    "modified_at": "2022-01-23T12:09:46.075Z",
    "repository": "world.karaokes.moe",
    "tags": {
      "authors": [
        "0275191e-6efa-4aee-b15c-74f594274dd3"
      ],
      "creators": [
        "6664a8ea-4dd4-416c-aaaf-2739cf34ead6",
        "be6050d0-f2bf-43cb-a646-6e600bdb383c"
      ],
      "families": [
        "5391f9fe-638c-415f-8dc9-958e3a2c5787"
      ],
      "groups": [
        "3c14c864-533c-49e6-a3cc-6969f1233775"
      ],
      "langs": [
        "fd8072b7-4d9b-45d4-8f5b-a931a830edef"
      ],
      "series": [
        "91f0c410-bb44-4a25-8087-e0f2bc2439f9"
      ],
      "singers": [
        "f01b8ec6-f08a-4453-8463-ba4a7f4e5ecf",
        "fb7c1953-406e-4b91-b6c2-b47d7d2d2fc4"
      ],
      "songtypes": [
        "a0167949-580c-4de3-bf13-497e462e02f3"
      ],
      "songwriters": [
        "bc20ec46-2198-4369-b638-cf93b7989ba0",
        "f76f4633-95e2-40ff-a52c-cc735f48aaad"
      ]
    },
    "titles": {
      "eng": "Les solos sous les draps",
      "fre": "Les solos sous les draps"
    },
    "title": "Les solos sous les draps",
    "year": 2009
  }
}