{
  "header": {
    "description": "Karaoke Mugen Tag File",
    "version": 1
  },
  "tag": {
    "i18n": {
      "eng": "Coppo"
    },
    "modified_at": "2020-07-12T14:49:12.235Z",
    "name": "Coppo",
    "repository": "world.karaokes.moe",
    "tid": "ad7338c3-cd2b-459b-8849-e22df5cdadae",
    "types": [
      "authors"
    ]
  }
}