{
  "header": {
    "description": "Karaoke Mugen Tag File",
    "version": 1
  },
  "tag": {
    "i18n": {
      "afr": "Sango",
      "amh": "Sango",
      "ara": "سانغو",
      "aze": "Санго",
      "bak": "Санго",
      "bel": "Санг",
      "bul": "Санго",
      "ben": "Sango",
      "bos": "Sango",
      "cat": "Sango",
      "cze": "Sango",
      "wel": "Sango",
      "dan": "Sango",
      "ger": "Sango",
      "gre": "Σάνγκο",
      "eng": "Sango",
      "epo": "Sango",
      "spa": "Sango",
      "est": "Sango",
      "baq": "Sangoera",
      "per": "سانگویی",
      "fin": "Sango",
      "fre": "Sango",
      "gle": "Sango",
      "gla": "Sango",
      "glg": "Sango",
      "guj": "Sango",
      "heb": "סאנגוname",
      "hin": "सांगो",
      "hrv": "Sango",
      "hat": "Sango",
      "hun": "Sango",
      "arm": "Санго",
      "ind": "Sango",
      "ice": "Sango",
      "ita": "Sango",
      "jpn": "三郷",
      "jav": "Sango",
      "geo": "Sango",
      "kaz": "Санго",
      "kan": "Sango",
      "kor": "산고",
      "kir": "Санго",
      "lat": "Sango",
      "lit": "Sango",
      "lav": "Sango",
      "mlg": "Sango",
      "mao": "Sango",
      "mac": "Sango",
      "mal": "സങ്കോ",
      "mon": "Sango",
      "mar": "Sango",
      "may": "Sango",
      "mlt": "Is-sango",
      "nep": "Sango",
      "dut": "Sango",
      "nor": "Sango",
      "pan": "Sango",
      "pol": "Sangho",
      "por": "Sango",
      "rum": "Sango",
      "rus": "Санго",
      "sin": "පැවසීය",
      "slo": "Sango",
      "slv": "Sango",
      "alb": "Sango",
      "srp": "Санго",
      "sun": "Kadungora",
      "swe": "Sango",
      "swa": "Sango",
      "tam": "சாங்கோ",
      "tel": "Sango",
      "tgk": "Санго",
      "tha": "ภาษาแซงโก name",
      "tgl": "Sango",
      "tur": "Sango",
      "tat": "Санго",
      "ukr": "Санго",
      "urd": "Sango",
      "uzb": "Sango",
      "vie": "Đây",
      "xho": "Sango",
      "yid": "Sango",
      "chi": "桑戈"
    },
    "name": "sag",
    "tid": "0865ae17-a90e-4198-a79f-e40473dc278f",
    "types": [
      "langs"
    ],
    "repository": "world.karaokes.moe",
    "modified_at": "2020-03-31T19:04:37.271Z"
  }
}