{
  "header": {
    "version": 4,
    "description": "Karaoke Mugen Karaoke Data File"
  },
  "medias": [
    {
      "version": "Default",
      "filename": "ENG - High School Musical 2 - MOVIE IN7 - Gotta Go My Own Way.mp4",
      "audiogain": 0.37,
      "loudnorm": "-18.74,-4.19,8.10,-28.95,-1.21",
      "filesize": 75672026,
      "duration": 203,
      "default": true,
      "lyrics": [
        {
          "filename": "ENG - High School Musical 2 - MOVIE IN7 - Gotta Go My Own Way.ass",
          "default": true,
          "version": "Default",
          "subchecksum": "eb0f2e8f657575aa18ed5198093f93d7"
        }
      ]
    }
  ],
  "data": {
    "created_at": "2020-07-07T17:24:17.682Z",
    "kid": "d7acfa33-ca7b-4e87-9585-8cd9cc97ee2e",
    "modified_at": "2021-02-25T14:49:30.571Z",
    "repository": "world.karaokes.moe",
    "songorder": 7,
    "tags": {
      "authors": [
        "05c1e4ad-32ba-490e-8f3c-5cd491c96d85"
      ],
      "creators": [
        "c800ba78-ac66-4419-9903-fa8fdb3fc377"
      ],
      "families": [
        "5391f9fe-638c-415f-8dc9-958e3a2c5787"
      ],
      "groups": [
        "3c14c864-533c-49e6-a3cc-6969f1233775"
      ],
      "langs": [
        "de5eda1c-5fb3-46a6-9606-d4554fc5a1d6"
      ],
      "origins": [
        "c8ca9dea-d8b4-48fe-8427-d911653232e9"
      ],
      "series": [
        "e463d80b-d141-4192-9430-4688afbe3304"
      ],
      "singers": [
        "152cc20a-ff2b-4c67-b3ec-8e1d26867368"
      ],
      "songtypes": [
        "5e5250d9-351a-4a82-98eb-55db50ad8962"
      ]
    },
    "title": "Gotta Go My Own Way",
    "titles": {
      "eng": "Gotta Go My Own Way"
    },
    "year": 2008
  }
}