{
  "header": {
    "description": "Karaoke Mugen Tag File",
    "version": 1
  },
  "tag": {
    "i18n": {
      "eng": "Bonnie McKee"
    },
    "modified_at": "2020-08-16T16:55:46.579Z",
    "name": "Bonnie McKee",
    "repository": "world.karaokes.moe",
    "tid": "f9e71f65-4088-45e1-9b89-9cbab5d6802d",
    "types": [
      "songwriters"
    ]
  }
}