{
  "header": {
    "version": 4,
    "description": "Karaoke Mugen Karaoke Data File"
  },
  "medias": [
    {
      "version": "Default",
      "filename": "FRE - Desireless - MV - Voyage Voyage.mp4",
      "audiogain": -8.43,
      "loudnorm": "-8.64,2.58,3.40,-18.76,-0.53",
      "filesize": 15825825,
      "duration": 250,
      "default": true,
      "lyrics": [
        {
          "filename": "FRE - Desireless - MV - Voyage Voyage.ass",
          "default": true,
          "version": "Default",
          "subchecksum": "a1802524689259ee1465c8302c9b1b70"
        }
      ]
    }
  ],
  "data": {
    "created_at": "2021-06-05T19:42:19.509Z",
    "kid": "97ae86b3-fbcc-4f5b-a010-3573ec99c2c2",
    "modified_at": "2021-06-05T20:03:21.302Z",
    "repository": "world.karaokes.moe",
    "tags": {
      "authors": [
        "ea28a818-4f57-42c3-a03a-a350233978f1"
      ],
      "creators": [
        "f3dc1c73-8de5-4f6f-bac0-2134986e5dbe"
      ],
      "families": [
        "5391f9fe-638c-415f-8dc9-958e3a2c5787"
      ],
      "groups": [
        "7792cc27-9ff9-4d47-9287-2338b7db1575"
      ],
      "langs": [
        "fd8072b7-4d9b-45d4-8f5b-a931a830edef"
      ],
      "singers": [
        "0e756898-b81f-4492-ac3a-643b3a369ea0"
      ],
      "songtypes": [
        "7be1b15c-cff8-4b37-a649-5c90f3d569a9"
      ],
      "songwriters": [
        "273f5c8e-56a1-4fc5-b89d-9c18a665b8db",
        "2b434ff8-3723-4f4c-9c5d-a0a1ac9f9166"
      ]
    },
    "title": "Voyage Voyage",
    "titles": {
      "eng": "Voyage Voyage"
    },
    "year": 1986
  }
}