{
  "header": {
    "description": "Karaoke Mugen Tag File",
    "version": 1
  },
  "tag": {
    "i18n": {
      "eng": "Bryan Scott"
    },
    "modified_at": "2020-07-16T16:31:56.932Z",
    "name": "Bryan Scott",
    "repository": "world.karaokes.moe",
    "tid": "b3594ca9-17a7-4ff4-93b8-722a8195274b",
    "types": [
      "songwriters"
    ]
  }
}