{
  "header": {
    "description": "Karaoke Mugen Tag File",
    "version": 1
  },
  "tag": {
    "i18n": {
      "eng": "Other",
      "fre": "Divers"
    },
    "karafile_tag": "OT",
    "modified_at": "2021-02-14T15:55:19.306Z",
    "name": "OT",
    "priority": 19,
    "repository": "world.karaokes.moe",
    "tid": "97769615-a2e5-4f36-8c23-b2ce2ce3c460",
    "types": [
      "songtypes"
    ]
  }
}
