{
  "header": {
    "description": "Karaoke Mugen Tag File",
    "version": 1
  },
  "tag": {
    "i18n": {
      "eng": "We Love Music"
    },
    "modified_at": "2021-03-18T23:11:34.861Z",
    "name": "We Love Music",
    "repository": "world.karaokes.moe",
    "tid": "e18ce236-7944-471a-9dad-86af600bafb8",
    "types": [
      "creators"
    ]
  }
}