{
  "header": {
    "description": "Karaoke Mugen Tag File",
    "version": 1
  },
  "tag": {
    "i18n": {
      "eng": "Daniel Lavoie"
    },
    "modified_at": "2020-07-13T11:46:09.890Z",
    "name": "Daniel Lavoie",
    "repository": "world.karaokes.moe",
    "tid": "949bb674-4aff-4e24-80d3-ba89948c437a",
    "types": [
      "singers"
    ]
  }
}