{
  "header": {
    "description": "Karaoke Mugen Tag File",
    "version": 1
  },
  "tag": {
    "i18n": {
      "eng": "Die Toten Hosen"
    },
    "modified_at": "2021-03-19T19:53:15.681Z",
    "name": "Die Toten Hosen",
    "repository": "world.karaokes.moe",
    "tid": "bf94493f-d3b9-4719-99d9-98f4c385a876",
    "types": [
      "singers"
    ]
  }
}