{
  "header": {
    "description": "Karaoke Mugen Tag File",
    "version": 1
  },
  "tag": {
    "i18n": {
      "eng": "Alexander Rybak"
    },
    "name": "Alexander Rybak",
    "repository": "world.karaokes.moe",
    "tid": "ba192798-17ef-485b-bfcc-057f5812ea30",
    "types": [
      "songwriters",
      "singers"
    ]
  }
}