{
  "header": {
    "version": 4,
    "description": "Karaoke Mugen Karaoke Data File"
  },
  "medias": [
    {
      "version": "Default",
      "filename": "ENG - High School Musical 3 - MOVIE IN8 - Walk Away.mp4",
      "audiogain": 3.66,
      "loudnorm": "-22.21,-8.16,11.00,-32.54,-1.89",
      "filesize": 47648127,
      "duration": 135,
      "default": true,
      "lyrics": [
        {
          "filename": "ENG - High School Musical 3 - MOVIE IN8 - Walk Away.ass",
          "default": true,
          "version": "Default",
          "subchecksum": "09301c26f0732fdea0f36abc55a0d430"
        }
      ]
    }
  ],
  "data": {
    "created_at": "2020-07-07T22:18:54.012Z",
    "kid": "3ccf7fa6-cb52-494e-967a-46c0afa5bab8",
    "modified_at": "2021-02-25T14:49:53.389Z",
    "repository": "world.karaokes.moe",
    "songorder": 8,
    "tags": {
      "authors": [
        "05c1e4ad-32ba-490e-8f3c-5cd491c96d85"
      ],
      "creators": [
        "2d3f223d-16d3-4f9a-bfa9-2038765a0ae7"
      ],
      "families": [
        "5391f9fe-638c-415f-8dc9-958e3a2c5787"
      ],
      "groups": [
        "3c14c864-533c-49e6-a3cc-6969f1233775"
      ],
      "langs": [
        "de5eda1c-5fb3-46a6-9606-d4554fc5a1d6"
      ],
      "origins": [
        "c8ca9dea-d8b4-48fe-8427-d911653232e9"
      ],
      "series": [
        "26cb36f1-22f2-4419-b5c7-9758f7bfcc10"
      ],
      "singers": [
        "152cc20a-ff2b-4c67-b3ec-8e1d26867368"
      ],
      "songtypes": [
        "5e5250d9-351a-4a82-98eb-55db50ad8962"
      ]
    },
    "title": "Walk Away",
    "titles": {
      "eng": "Walk Away"
    },
    "year": 2008
  }
}