{
  "header": {
    "description": "Karaoke Mugen Tag File",
    "version": 1
  },
  "tag": {
    "i18n": {
      "eng": "Aeden"
    },
    "name": "Aeden",
    "repository": "world.karaokes.moe",
    "tid": "611aa6ee-ebf8-4ef5-8eed-9f1eaec5117e",
    "types": [
      "authors"
    ]
  }
}