{
  "header": {
    "description": "Karaoke Mugen Tag File",
    "version": 1
  },
  "tag": {
    "i18n": {
      "eng": "Ray Slijngaard"
    },
    "name": "Ray Slijngaard",
    "repository": "world.karaokes.moe",
    "tid": "91781b63-8ffa-4d81-a7ce-07ec6d53c2fa",
    "types": [
      "songwriters"
    ]
  }
}