{
  "header": {
    "description": "Karaoke Mugen Tag File",
    "version": 1
  },
  "tag": {
    "i18n": {
      "eng": "Philippe Mimouni"
    },
    "modified_at": "2021-09-05T21:11:52.403Z",
    "name": "Philippe Mimouni",
    "repository": "world.karaokes.moe",
    "tid": "a4b6daf6-af5d-4073-96d0-3a143f31ab5b",
    "types": [
      "songwriters"
    ]
  }
}