{
  "header": {
    "description": "Karaoke Mugen Tag File",
    "version": 1
  },
  "tag": {
    "i18n": {
      "eng": "The Edge"
    },
    "modified_at": "2020-07-06T20:35:57.269Z",
    "name": "The Edge",
    "repository": "world.karaokes.moe",
    "tid": "949b0938-edae-47ec-b4b4-b3484df704c6",
    "types": [
      "songwriters"
    ]
  }
}