{
  "header": {
    "description": "Karaoke Mugen Tag File",
    "version": 1
  },
  "tag": {
    "aliases": [
      "Jason Quenneville"
    ],
    "i18n": {
      "eng": "DaHeala"
    },
    "modified_at": "2021-06-04T21:07:39.759Z",
    "name": "DaHeala",
    "repository": "world.karaokes.moe",
    "tid": "3c51f82b-bee1-4ccd-bdce-b7c9440e2eb3",
    "types": [
      "songwriters"
    ]
  }
}