{
  "header": {
    "version": 4,
    "description": "Karaoke Mugen Karaoke Data File"
  },
  "medias": [
    {
      "version": "Default",
      "filename": "ENG - Woodkid - MV - Iron.mp4",
      "audiogain": -7.87,
      "loudnorm": "-9.60,1.17,7.50,-19.80,-1.50",
      "filesize": 32234223,
      "duration": 225,
      "default": true,
      "lyrics": [
        {
          "filename": "ENG - Woodkid - MV - Iron.ass",
          "default": true,
          "version": "Default"
        }
      ]
    }
  ],
  "data": {
    "created_at": "2021-11-21T22:24:41.815Z",
    "kid": "429e8f7c-0a47-40e7-bd6e-d324660a5ea5",
    "modified_at": "2021-11-21T22:31:01.901Z",
    "repository": "world.karaokes.moe",
    "tags": {
      "authors": [
        "0081300d-c0f9-4cff-a4f7-e726a293a76b"
      ],
      "creators": [
        "d7ceb8ce-ec67-4bcb-ab8e-a7e4bdd3128f"
      ],
      "families": [
        "5391f9fe-638c-415f-8dc9-958e3a2c5787"
      ],
      "groups": [
        "ae613721-1fbe-480d-ba6b-d6d0702b184d"
      ],
      "langs": [
        "de5eda1c-5fb3-46a6-9606-d4554fc5a1d6"
      ],
      "singers": [
        "1034db7e-31ce-42c3-a593-88807642663c"
      ],
      "songtypes": [
        "7be1b15c-cff8-4b37-a649-5c90f3d569a9"
      ],
      "songwriters": [
        "1034db7e-31ce-42c3-a593-88807642663c"
      ]
    },
    "titles": {
      "eng": "Iron"
    },
    "title": "Iron",
    "year": 2011
  }
}