{
  "header": {
    "description": "Karaoke Mugen Tag File",
    "version": 1
  },
  "tag": {
    "i18n": {
      "eng": "Sanctuaire Sainte Rita"
    },
    "modified_at": "2020-05-07T17:55:04.193Z",
    "name": "Sanctuaire Sainte Rita",
    "repository": "world.karaokes.moe",
    "tid": "6114eff2-b6e9-4aeb-addf-65954ec9c25e",
    "types": [
      "creators"
    ]
  }
}