{
  "header": {
    "description": "Karaoke Mugen Tag File",
    "version": 1
  },
  "tag": {
    "i18n": {
      "eng": "Bruce Dickinson"
    },
    "name": "Bruce Dickinson",
    "repository": "world.karaokes.moe",
    "tid": "9c00893f-a3e0-450b-8487-a2b0bbf9dca6",
    "types": [
      "songwriters"
    ]
  }
}