{
  "header": {
    "version": 4,
    "description": "Karaoke Mugen Karaoke Data File"
  },
  "medias": [
    {
      "version": "Default",
      "filename": "ENG - Arcane League of Legends - ONA MV - Enemy.mp4",
      "audiogain": -0.46,
      "loudnorm": "-17.21,-3.67,9.00,-27.98,-1.17",
      "filesize": 85190019,
      "duration": 213,
      "default": true,
      "lyrics": [
        {
          "filename": "ENG - Arcane League of Legends - ONA MV - Enemy.ass",
          "default": true,
          "version": "Default"
        }
      ]
    }
  ],
  "data": {
    "created_at": "2021-11-11T21:17:28.184Z",
    "kid": "a643dd8a-1e57-4ca1-8569-a39456e69404",
    "modified_at": "2021-12-31T00:08:11.562Z",
    "repository": "world.karaokes.moe",
    "tags": {
      "authors": [
        "611aa6ee-ebf8-4ef5-8eed-9f1eaec5117e",
        "90414ca0-ab36-4879-8810-b032c6bfdab0"
      ],
      "creators": [
        "4d1b9aac-f0ca-42de-a2f0-eff2869ea6e3",
        "ab4a1c5e-2578-4fb9-8913-03d530ea2d45"
      ],
      "families": [
        "0377db02-3af6-43b8-9b08-c759df3d25c3"
      ],
      "groups": [
        "8e209ae4-4381-438f-89dc-1b21752027d2"
      ],
      "langs": [
        "de5eda1c-5fb3-46a6-9606-d4554fc5a1d6"
      ],
      "origins": [
        "8db3e098-06ef-45e5-bba9-cb04a21c1e66"
      ],
      "series": [
        "72381acc-375b-4d40-81b1-3199f7007f83"
      ],
      "singers": [
        "28049ad2-e20c-466c-950c-537552c00858",
        "502ac3c0-ce23-4f9a-9c06-16fae533498e"
      ],
      "songtypes": [
        "7be1b15c-cff8-4b37-a649-5c90f3d569a9"
      ],
      "songwriters": [
        "28049ad2-e20c-466c-950c-537552c00858",
        "c56dea5a-0bc8-45a8-b04c-dda155b9af1a"
      ]
    },
    "titles": {
      "eng": "Enemy"
    },
    "title": "Enemy",
    "year": 2021
  }
}