{
  "header": {
    "description": "Karaoke Mugen Tag File",
    "version": 1
  },
  "tag": {
    "i18n": {
      "eng": "Time Records"
    },
    "modified_at": "2020-06-01T16:27:09.864Z",
    "name": "Time Records",
    "repository": "world.karaokes.moe",
    "tid": "bb3bb300-6b4f-4c52-9364-f26346dfe2d1",
    "types": [
      "creators"
    ]
  }
}