{
  "header": {
    "description": "Karaoke Mugen Tag File",
    "version": 1
  },
  "tag": {
    "i18n": {
      "afr": "Deense",
      "amh": "ዴኒሽ",
      "ara": "الدنماركية",
      "aze": "Danimarka",
      "bak": "Дания теле",
      "bel": "Дацкая",
      "bul": "Датски",
      "ben": "ড্যানিশ",
      "bos": "Danski",
      "cat": "Danès",
      "cze": "Dánština",
      "wel": "Daneg",
      "dan": "Dansk",
      "ger": "Dänisch",
      "gre": "Δανική",
      "eng": "Danish",
      "epo": "Dana",
      "spa": "Danés",
      "est": "Taani",
      "baq": "Danimarkako",
      "per": "کرون",
      "fin": "Tanskan",
      "fre": "Danois",
      "gle": "Coróin",
      "gla": "Danish",
      "glg": "Coroa",
      "guj": "ડેનિશ",
      "heb": "דנית",
      "hin": "डेनिश",
      "hrv": "Danski",
      "hat": "Danwa",
      "hun": "Dán",
      "arm": "Դանիերեն",
      "ind": "Denmark",
      "ice": "Danskir",
      "ita": "Danese",
      "jpn": "デンマーク",
      "jav": "Denmark",
      "geo": "დანიის",
      "kaz": "Дат",
      "kan": "ಡ್ಯಾನಿಶ್",
      "kor": "덴마크",
      "kir": "Датский",
      "lat": "Danorum",
      "lit": "Danų",
      "lav": "Dāņu",
      "mlg": "Danoà",
      "mao": "Danish",
      "mac": "Данска",
      "mal": "ഡാനിഷ്",
      "mon": "Дани",
      "mar": "खूप गरम कामुक मुलगी",
      "may": "Denmark",
      "mlt": "Daniż",
      "nep": "डैनीश",
      "dut": "Deens",
      "nor": "Dansk",
      "pan": "ਡੈੱਨਮਾਰਕੀ",
      "pol": "Duński",
      "por": "Dinamarquês",
      "rum": "Daneză",
      "rus": "Датский",
      "sin": "ඩෙන්මාර්ක්",
      "slo": "Dánsky",
      "slv": "Danski",
      "alb": "Daneze",
      "srp": "Дански",
      "sun": "Denmark",
      "swe": "Danska",
      "swa": "Kideni",
      "tam": "டேனிஷ்",
      "tel": "డానిష్",
      "tgk": "Датский",
      "tha": "ภาษาเดนมาร์ก name",
      "tgl": "Danish",
      "tur": "Danimarka",
      "tat": "Дания теле",
      "ukr": "Данська",
      "urd": "ڈینش",
      "uzb": "Daniya",
      "vie": "Đan mạch",
      "xho": "Isidanish",
      "yid": "דאַניש",
      "chi": "丹麦"
    },
    "name": "dan",
    "tid": "314a4e1e-8028-45e5-90b1-dda2327916be",
    "types": [
      "langs"
    ],
    "repository": "world.karaokes.moe",
    "modified_at": "2020-03-31T19:04:34.084Z"
  }
}