{
  "header": {
    "description": "Karaoke Mugen Tag File",
    "version": 1
  },
  "tag": {
    "i18n": {
      "afr": "Portugees",
      "amh": "ፖርቹጋልኛ",
      "ara": "البرتغالية",
      "aze": "Portuqaliya",
      "bak": "Португал теле",
      "bel": "Партугальская",
      "bul": "Португалски",
      "ben": "পর্তুগিজ",
      "bos": "Portugalski",
      "cat": "Portuguès",
      "cze": "Portugalština",
      "wel": "Portiwgaleg",
      "dan": "Portugisisk",
      "ger": "Portugiesisch",
      "gre": "Πορτογαλικά",
      "eng": "Portuguese",
      "epo": "La portugala",
      "spa": "El portugués",
      "est": "Portugali keel",
      "baq": "Portugesa",
      "per": "پرتغالی",
      "fin": "Portugali",
      "fre": "Portugais",
      "gle": "Portaingéilis",
      "gla": "Portagailis",
      "glg": "Portugués",
      "guj": "પોર્ટુગીઝ",
      "heb": "פורטוגזית",
      "hin": "पुर्तगाली",
      "hrv": "Portugalski",
      "hat": "Pòtigè",
      "hun": "Portugál",
      "arm": "Պորտուգալերեն",
      "ind": "Portugis",
      "ice": "Portúgalska",
      "ita": "Portoghese",
      "jpn": "ポルトガル語",
      "jav": "Portugis",
      "geo": "პორტუგალიის",
      "kaz": "Португал",
      "kan": "ಪೋರ್ಚುಗೀಸ್",
      "kor": "포르투갈어",
      "kir": "Португальский",
      "lat": "Portuguese",
      "lit": "Portugalų",
      "lav": "Portugāles",
      "mlg": "Teny portiogey",
      "mao": "Pōtikī",
      "mac": "Португалски",
      "mal": "പോർച്ചുഗീസ്",
      "mon": "Португалийн",
      "mar": "पोर्तुगीज",
      "may": "Portugis",
      "mlt": "Il-portugiż",
      "nep": "पोर्चुगिज",
      "dut": "Portugees",
      "nor": "Portugisisk",
      "pan": "ਪੁਰਤਗਾਲੀ",
      "pol": "Portugalski",
      "por": "Portuguesa",
      "rum": "Portugheză",
      "rus": "Португальский",
      "sin": "පෘතුගීසි",
      "slo": "Portugalský",
      "slv": "Portugalski",
      "alb": "Portugalisht",
      "srp": "Португалски",
      "sun": "Portugis",
      "swe": "Portugisiska",
      "swa": "Kireno",
      "tam": "போர்த்துகீசியம்",
      "tel": "పోర్చుగీస్",
      "tgk": "Португалӣ",
      "tha": "ภาษาโปรตุเกสเป็นบ้าง",
      "tgl": "Portuges",
      "tur": "Portekizce",
      "tat": "Португал теле",
      "ukr": "Португальська",
      "urd": "پرتگالی",
      "uzb": "Portugal",
      "vie": "Bồ đào nha",
      "xho": "Isiphuthukezi",
      "yid": "פּאָרטוגעזיש",
      "chi": "葡萄牙"
    },
    "name": "por",
    "tid": "b9b63757-658e-4837-b743-fe7bc08d8d27",
    "types": [
      "langs"
    ],
    "repository": "world.karaokes.moe",
    "modified_at": "2020-03-31T19:04:36.967Z"
  }
}