{
  "header": {
    "description": "Karaoke Mugen Tag File",
    "version": 1
  },
  "tag": {
    "i18n": {
      "eng": "Fred Chichin"
    },
    "modified_at": "2020-07-11T20:56:07.959Z",
    "name": "Fred Chichin",
    "repository": "world.karaokes.moe",
    "tid": "dfa56b39-b8bf-4070-bef1-265cc811cfaa",
    "types": [
      "songwriters"
    ]
  }
}