{
  "header": {
    "description": "Karaoke Mugen Tag File",
    "version": 1
  },
  "tag": {
    "i18n": {
      "eng": "Francis Vacher"
    },
    "name": "Francis Vacher",
    "repository": "world.karaokes.moe",
    "tid": "fbd24b8f-6570-4b7b-84b6-71a76ad310b6",
    "types": [
      "songwriters"
    ]
  }
}