{
  "header": {
    "description": "Karaoke Mugen Tag File",
    "version": 1
  },
  "tag": {
    "i18n": {
      "eng": "Rita Mitsouko"
    },
    "modified_at": "2020-07-11T20:56:07.681Z",
    "name": "Rita Mitsouko",
    "repository": "world.karaokes.moe",
    "tid": "aad674de-db0b-42f4-918b-5121009985dd",
    "types": [
      "singers"
    ]
  }
}