{
  "header": {
    "description": "Karaoke Mugen Tag File",
    "version": 1
  },
  "tag": {
    "i18n": {
      "afr": "Bambara",
      "amh": "Bambara",
      "ara": "البامبارا",
      "aze": "Бамбара",
      "bak": "Амбар",
      "bel": "Бамбара",
      "bul": "Бамбара",
      "ben": "আসামি",
      "bos": "Fipa",
      "cat": "Bambara",
      "cze": "Bambara",
      "wel": "Bambara",
      "dan": "Bambara",
      "ger": "Bambara",
      "gre": "Μπαμπάρα",
      "eng": "Bambara",
      "epo": "Bambara",
      "spa": "Bambara",
      "est": "Bambara",
      "baq": "Bambara",
      "per": "بامبارا",
      "fin": "Bambara",
      "fre": "Bambara",
      "gle": "Bambara",
      "gla": "Amharais",
      "glg": "Bambara",
      "guj": "બામ્બારા",
      "heb": "תיאטרון",
      "hin": "बाम्बारा",
      "hrv": "Bambara",
      "hat": "Bambara",
      "hun": "Bambara",
      "arm": "Бамбара",
      "ind": "Bambara",
      "ice": "Bambara",
      "ita": "Bambara",
      "jpn": "複",
      "jav": "Bambara",
      "geo": "Bambara",
      "kaz": "Бамбара",
      "kan": "ಬಂಬಾರಾ",
      "kor": "밤바라",
      "kir": "Бамбара",
      "lat": "Bambara",
      "lit": "Bambara",
      "lav": "Bambara",
      "mlg": "Fas",
      "mao": "Lîsteya ferhengan",
      "mac": "Bambara",
      "mal": "ബംബറാ",
      "mon": "Bambara",
      "mar": "Bambara",
      "may": "Bambara",
      "mlt": "}",
      "nep": "बाम्बारी",
      "dut": "Bambara",
      "nor": "Bambara",
      "pan": "Bambara",
      "pol": "Бамбара",
      "por": "Feijão",
      "rum": "Bambara",
      "rus": "Бамбара",
      "sin": "Bambara",
      "slo": "Bambara",
      "slv": "Bambara",
      "alb": "Bambara",
      "srp": "Бамбара",
      "sun": "Bambara",
      "swe": "Bambara",
      "swa": "Bambara",
      "tam": "பம்பாரா",
      "tel": "బంబారా",
      "tgk": "Бамбара",
      "tha": "Bambara",
      "tgl": "Bambara",
      "tur": "Bambara",
      "tat": "Бамбара",
      "ukr": "Бамбара",
      "urd": "Bambara",
      "uzb": "Bambara",
      "vie": "Trung",
      "xho": "Bambara",
      "yid": "באַמבאַראַ",
      "chi": "班巴拉"
    },
    "name": "bam",
    "tid": "e451090c-7c7a-40d7-86d7-4d1fe797ceba",
    "types": [
      "langs"
    ],
    "repository": "world.karaokes.moe",
    "modified_at": "2020-03-31T19:04:33.678Z"
  }
}