{
  "header": {
    "description": "Karaoke Mugen Tag File",
    "version": 1
  },
  "tag": {
    "i18n": {
      "eng": "Barry Gibb"
    },
    "modified_at": "2020-06-01T21:49:48.811Z",
    "name": "Barry Gibb",
    "repository": "world.karaokes.moe",
    "tid": "b6aaab61-894a-4ce5-a977-ac443c19419a",
    "types": [
      "songwriters"
    ]
  }
}