{
  "header": {
    "description": "Karaoke Mugen Tag File",
    "version": 1
  },
  "tag": {
    "i18n": {
      "eng": "Go_A"
    },
    "modified_at": "2021-06-14T16:43:52.084Z",
    "name": "Go_A",
    "repository": "world.karaokes.moe",
    "tid": "74d32f8f-41c6-449b-9fd6-d67dcb404069",
    "types": [
      "singers"
    ]
  }
}