{
  "header": {
    "description": "Karaoke Mugen Tag File",
    "version": 1
  },
  "tag": {
    "i18n": {
      "eng": "Karaoke Mugen"
    },
    "modified_at": "2020-05-11T22:47:38.000Z",
    "name": "Karaoke Mugen",
    "repository": "world.karaokes.moe",
    "tid": "5bdaba57-27f8-4568-8806-76a807728766",
    "types": [
      "authors"
    ]
  }
}