{
  "header": {
    "description": "Karaoke Mugen Tag File",
    "version": 1
  },
  "tag": {
    "i18n": {
      "eng": "Cédric Soubiron"
    },
    "modified_at": "2020-05-23T21:36:56.647Z",
    "name": "Cédric Soubiron",
    "repository": "world.karaokes.moe",
    "tid": "5f69f296-f2f7-434a-8e7d-ccccf7bc56ff",
    "types": [
      "songwriters"
    ]
  }
}