{
  "header": {
    "description": "Karaoke Mugen Tag File",
    "version": 1
  },
  "tag": {
    "i18n": {
      "afr": "Albanese",
      "amh": "ልቤኒኛ",
      "ara": "الألبانية",
      "aze": "Alban",
      "bak": "Албан теле",
      "bel": "Албанская",
      "bul": "Албански",
      "ben": "আলবেনীয়",
      "bos": "Albanski",
      "cat": "Albanès",
      "cze": "Albánština",
      "wel": "Albaneg",
      "dan": "Albanske",
      "ger": "Albanisch",
      "gre": "Αλβανικά",
      "eng": "Albanian",
      "epo": "Albana",
      "spa": "Albanés",
      "est": "Albaania",
      "baq": "Albanian",
      "per": "آلبانیایی",
      "fin": "Albanian",
      "fre": "Albanais",
      "gle": "Albáinis",
      "gla": "Afrikaans",
      "glg": "Albanian",
      "guj": "Albanian",
      "heb": "אלבנית",
      "hin": "अल्बानियाई",
      "hrv": "Albanski",
      "hat": "Albanyen",
      "hun": "Albán",
      "arm": "Ալբաներեն",
      "ind": "Albania",
      "ice": "Albanska",
      "ita": "Albanese",
      "jpn": "アルバニア",
      "jav": "Albania",
      "geo": "ალბანეთის",
      "kaz": "Албан",
      "kan": "Albanian",
      "kor": "알바니아",
      "kir": "Албанский",
      "lat": "Arabica",
      "lit": "Albanų",
      "lav": "Albāņu",
      "mlg": "Albaney",
      "mao": "Albanian",
      "mac": "Албански",
      "mal": "അൽബേനിയൻ",
      "mon": "Албани",
      "mar": "Albanian",
      "may": "Albania",
      "mlt": "Albaniż",
      "nep": "अल्बेनियाली",
      "dut": "Albanese",
      "nor": "Albanske",
      "pan": "ਅਲਬਾਨੀ",
      "pol": "Albański",
      "por": "Albanês",
      "rum": "Albaneză",
      "rus": "Албанский",
      "sin": "ඇල්බේනියානු",
      "slo": "Albánsky",
      "slv": "Albanski",
      "alb": "Shqiptare",
      "srp": "Албански",
      "sun": "Albania",
      "swe": "Albanska",
      "swa": "Kialbeni",
      "tam": "அல்பானியன்",
      "tel": "అల్బేనియన్",
      "tgk": "Албанский",
      "tha": "ภาษาอัลเบเนีย name",
      "tgl": "Albanian",
      "tur": "Arnavut",
      "tat": "Албан теле",
      "ukr": "Албанська",
      "urd": "البانی",
      "uzb": "Alban",
      "vie": "Albanian",
      "xho": "Isialbania",
      "yid": "אַלבאַניש",
      "chi": "阿尔巴尼亚"
    },
    "name": "alb",
    "tid": "c5c76437-4a68-456e-bf9a-04d0c0cb81d6",
    "types": [
      "langs"
    ],
    "repository": "world.karaokes.moe",
    "modified_at": "2020-03-31T19:04:33.421Z"
  }
}