{
  "header": {
    "description": "Karaoke Mugen Tag File",
    "version": 1
  },
  "tag": {
    "i18n": {
      "eng": "U2"
    },
    "modified_at": "2020-07-06T20:35:57.016Z",
    "name": "U2",
    "repository": "world.karaokes.moe",
    "tid": "d1c6cd68-74a2-4877-9e5f-6e7d0f4a0afa",
    "types": [
      "songwriters",
      "singers"
    ]
  }
}