{
  "header": {
    "version": 4,
    "description": "Karaoke Mugen Karaoke Data File"
  },
  "medias": [
    {
      "version": "Default",
      "filename": "ENG - Les Guignols - MV - We fuck the world.mp4",
      "audiogain": -5.65,
      "loudnorm": "-12.96,0.35,3.80,-23.30,0.32",
      "filesize": 22239621,
      "duration": 88,
      "default": true,
      "lyrics": [
        {
          "filename": "ENG - Les Guignols - MV - We fuck the world.ass",
          "default": true,
          "version": "Default",
          "subchecksum": "d2180d74b77917d85fee4ab12f014b61"
        }
      ]
    }
  ],
  "data": {
    "created_at": "2017-10-11T17:01:11.000Z",
    "kid": "3bbcc93d-b0e5-4b00-8fb3-49b4cc2a7fd4",
    "modified_at": "2021-02-25T14:49:57.882Z",
    "repository": "world.karaokes.moe",
    "tags": {
      "authors": [
        "05c1e4ad-32ba-490e-8f3c-5cd491c96d85"
      ],
      "creators": [
        "9b320632-3e5b-408b-912b-20f1a816fe96"
      ],
      "families": [
        "5391f9fe-638c-415f-8dc9-958e3a2c5787"
      ],
      "groups": [
        "3c14c864-533c-49e6-a3cc-6969f1233775",
        "f5e7d2fc-0cbb-4fb9-a84a-b25dfb0e9e77"
      ],
      "langs": [
        "de5eda1c-5fb3-46a6-9606-d4554fc5a1d6"
      ],
      "misc": [
        "07af42d1-824e-407e-bf37-7fb84905484b"
      ],
      "origins": [
        "8dd8d2a4-913a-4b0b-a555-1121cc603a57"
      ],
      "series": [
        "1b8e5e82-e2e6-4481-bae4-2c2d65a437b3"
      ],
      "singers": [
        "1b8e5e82-e2e6-4481-bae4-2c2d65a437b3"
      ],
      "songtypes": [
        "7be1b15c-cff8-4b37-a649-5c90f3d569a9"
      ],
      "songwriters": [
        "4b8a7d2b-d109-4c7f-b50b-9a398aea1621",
        "72d3cf5e-b70f-492f-8173-60f44c451c77"
      ]
    },
    "title": "We fuck the world",
    "titles": {
      "eng": "We fuck the world"
    },
    "year": 2001
  }
}