{
  "header": {
    "description": "Karaoke Mugen Tag File",
    "version": 1
  },
  "tag": {
    "i18n": {
      "eng": "Andrew Lloyd Webber"
    },
    "modified_at": "2020-07-11T22:19:26.942Z",
    "name": "Andrew Lloyd Webber",
    "repository": "world.karaokes.moe",
    "tid": "6ff00822-e576-47a2-a086-f8bcc996b3af",
    "types": [
      "songwriters"
    ]
  }
}