{
  "header": {
    "description": "Karaoke Mugen Tag File",
    "version": 1
  },
  "tag": {
    "i18n": {
      "eng": "Warner Music"
    },
    "modified_at": "2020-07-03T22:05:25.336Z",
    "name": "Warner Music",
    "repository": "world.karaokes.moe",
    "tid": "bd43efab-3cf4-4b4b-8888-dda16ecd0e04",
    "types": [
      "creators"
    ]
  }
}