{
  "header": {
    "description": "Karaoke Mugen Tag File",
    "version": 1
  },
  "tag": {
    "i18n": {
      "eng": "Phil Wilde"
    },
    "name": "Phil Wilde",
    "repository": "world.karaokes.moe",
    "tid": "20aaf675-5025-47b6-9142-ab3f638b002f",
    "types": [
      "songwriters"
    ]
  }
}