{
  "header": {
    "description": "Karaoke Mugen Tag File",
    "version": 1
  },
  "tag": {
    "i18n": {
      "eng": "LMFAO"
    },
    "modified_at": "2020-07-12T12:12:34.195Z",
    "name": "LMFAO",
    "repository": "world.karaokes.moe",
    "tid": "4d2e3c5b-e31d-4d23-a06c-f6e5b9b15fd2",
    "types": [
      "singers"
    ]
  }
}