{
  "header": {
    "description": "Karaoke Mugen Tag File",
    "version": 1
  },
  "tag": {
    "i18n": {
      "afr": "Aragonese",
      "amh": "Aragonese",
      "ara": "أراغون",
      "aze": "Aragonese",
      "bak": "Арагон теле",
      "bel": "Арагонская",
      "bul": "Арагонски",
      "ben": "আর্গোনিজ",
      "bos": "Aragonežanski",
      "cat": "Aragonès",
      "cze": "Aragonština",
      "wel": "Aragonese",
      "dan": "Aragonese",
      "ger": "Aragonese",
      "gre": "Αραγκονικά",
      "eng": "Aragonese",
      "epo": "Aragona",
      "spa": "Aragonés",
      "est": "Aragonese",
      "baq": "Aragoiko",
      "per": "آراگونی",
      "fin": "Aragonese",
      "fre": "Aragonais",
      "gle": "Aragonese",
      "gla": "Aragonese",
      "glg": "Aragonés",
      "guj": "અર્ગોનીઝ",
      "heb": "אראגון",
      "hin": "अर्गोनी",
      "hrv": "Aragonese",
      "hat": "Aragonese",
      "hun": "Aragóniai",
      "arm": "Aragonese",
      "ind": "Aragon",
      "ice": "Arabíska",
      "ita": "Aragonese",
      "jpn": "アラゴン",
      "jav": "Aragonese",
      "geo": "Aragonese",
      "kaz": "Арагонский",
      "kan": "ಅರಗೊನೀಸ್",
      "kor": "아라곤",
      "kir": "Арагонский",
      "lat": "Aragonum",
      "lit": "Aragonesų",
      "lav": "Aragonese",
      "mlg": "Zavatra",
      "mao": "Aragonese",
      "mac": "Aragonese",
      "mal": "Aragonese",
      "mon": "Aragonese",
      "mar": "Aragonese",
      "may": "Aragon",
      "mlt": "}",
      "nep": "Aragonese",
      "dut": "Aragonees",
      "nor": "Aragon",
      "pan": "Aragonese",
      "pol": "Aragoński",
      "por": "Aragoneses",
      "rum": "Aragoneză",
      "rus": "Арагонский",
      "sin": "Aragonese",
      "slo": "Aragónčina",
      "slv": "Kde ta paket vsebuje datoteke",
      "alb": "Aragonese",
      "srp": "Арагонески",
      "sun": "Aragonese",
      "swe": "Aragonien",
      "swa": "Aragonese",
      "tam": "ஆர்கோனீஸ்",
      "tel": "అల్బేనియన్",
      "tgk": "Арагонский",
      "tha": "Aragonese",
      "tgl": "Aragonese",
      "tur": "Aragon",
      "tat": "Арагон теле",
      "ukr": "Арагонська",
      "urd": "Aragonese",
      "uzb": "Aragonese",
      "vie": "Aragon",
      "xho": "Aragonese",
      "yid": "אַראַגאָנעסע",
      "chi": "阿拉贡"
    },
    "name": "arg",
    "tid": "b9f3f5ef-8fc6-4fe9-af2a-57de1f5d2c8c",
    "types": [
      "langs"
    ],
    "repository": "world.karaokes.moe",
    "modified_at": "2020-03-31T19:04:33.534Z"
  }
}