{
  "header": {
    "version": 4,
    "description": "Karaoke Mugen Karaoke Data File"
  },
  "medias": [
    {
      "version": "Default",
      "filename": "GER - Dschinghis Khan - MV - Dschinghis Khan.mp4",
      "audiogain": 2.09,
      "loudnorm": "-20.70,-8.40,2.70,-30.73,-0.48",
      "filesize": 23130066,
      "duration": 185,
      "default": true,
      "lyrics": [
        {
          "filename": "GER - Dschinghis Khan - MV - Dschinghis Khan.ass",
          "default": true,
          "version": "Default",
          "subchecksum": "28c077c2dfddd6b2f394624fbd061c40"
        }
      ]
    }
  ],
  "data": {
    "created_at": "2021-03-19T20:47:20.487Z",
    "kid": "09f5b2bf-1bf3-40a0-a2a7-45823e4d1ef5",
    "modified_at": "2021-03-19T21:23:54.468Z",
    "repository": "world.karaokes.moe",
    "tags": {
      "authors": [
        "0c8e4377-ee35-4896-89ed-9d06a1b5acd5"
      ],
      "creators": [
        "3e28e7cf-3f84-4fd9-856a-92ebc8f8475c"
      ],
      "families": [
        "5391f9fe-638c-415f-8dc9-958e3a2c5787"
      ],
      "groups": [
        "57e5e0c0-e02e-4871-a6cb-d48ea604ebab"
      ],
      "langs": [
        "b39ffaee-d9cd-44b0-bf35-b019327c3336"
      ],
      "singers": [
        "f360c570-9f87-4c40-bfd8-97dbdc337b37"
      ],
      "songtypes": [
        "7be1b15c-cff8-4b37-a649-5c90f3d569a9"
      ],
      "songwriters": [
        "0dbca0b1-fa4c-48a3-a197-e74351686410",
        "ff7391aa-49b6-4a98-8d49-4029f90ac467"
      ]
    },
    "title": "Dschinghis Khan",
    "titles": {
      "eng": "Dschinghis Khan"
    },
    "year": 1979
  }
}