{
  "header": {
    "description": "Karaoke Mugen Tag File",
    "version": 1
  },
  "tag": {
    "i18n": {
      "eng": "Claude François"
    },
    "modified_at": "2021-09-05T20:36:39.992Z",
    "name": "Claude François",
    "repository": "world.karaokes.moe",
    "tid": "62bf6a01-ea61-4b89-967d-e4db0b719f75",
    "types": [
      "singers",
      "songwriters"
    ]
  }
}