{
  "header": {
    "description": "Karaoke Mugen Tag File",
    "version": 1
  },
  "tag": {
    "i18n": {
      "eng": "ENSSAT-Japanim"
    },
    "modified_at": "2020-05-14T18:48:04.132Z",
    "name": "ENSSAT-Japanim",
    "repository": "world.karaokes.moe",
    "tid": "60defa7b-774e-4680-8321-51b742c2e009",
    "types": [
      "authors",
      "groups"
    ]
  }
}