{
  "header": {
    "description": "Karaoke Mugen Tag File",
    "version": 1
  },
  "tag": {
    "i18n": {
      "eng": "Sabaton"
    },
    "modified_at": "2021-10-23T21:20:39.460Z",
    "name": "Sabaton",
    "repository": "world.karaokes.moe",
    "tid": "7da8d70f-e2db-432c-8156-301916ad0440",
    "types": [
      "singers"
    ]
  }
}