{
  "header": {
    "description": "Karaoke Mugen Tag File",
    "version": 1
  },
  "tag": {
    "i18n": {
      "eng": "Carrere"
    },
    "modified_at": "2020-07-09T20:13:34.992Z",
    "name": "Carrere",
    "repository": "world.karaokes.moe",
    "tid": "4b6702ca-6199-4553-a145-264ff5b5e518",
    "types": [
      "creators"
    ]
  }
}