{
  "header": {
    "description": "Karaoke Mugen Tag File",
    "version": 1
  },
  "tag": {
    "i18n": {
      "afr": "Duits",
      "alb": "Holandeze",
      "amh": "ደች",
      "ara": "الهولندي",
      "arm": "Հոլանդերեն",
      "aze": "Hollandiya",
      "bak": "Олланд теле",
      "baq": "Holandako",
      "bel": "Галандская",
      "ben": "ডাচ",
      "bos": "Dutch",
      "bul": "Холандски",
      "cat": "Neerlandès",
      "chi": "荷兰",
      "cze": "Holandština",
      "dan": "Hollandsk",
      "dut": "Nederlands",
      "eng": "Dutch",
      "epo": "En la nederlanda",
      "est": "Hollandi keel",
      "fin": "Hollanti",
      "fre": "Néerlandais",
      "geo": "დანიელი",
      "ger": "Niederländisch",
      "gla": "Dutch",
      "gle": "Ollainnis",
      "glg": "Holandés",
      "gre": "Ολλανδικά",
      "guj": "ડચ",
      "hat": "Olandè",
      "heb": "הולנדית",
      "hin": "डच",
      "hrv": "Nizozemski",
      "hun": "Holland",
      "ice": "Dutch",
      "ind": "Belanda",
      "ita": "Olandese",
      "jav": "Walanda",
      "jpn": "オランダ",
      "kan": "ಡಚ್",
      "kaz": "Голланд",
      "kir": "Голландский",
      "kor": "네덜란드",
      "lat": "Dutch",
      "lav": "Holandiešu",
      "lit": "Olandų",
      "mac": "Холандски",
      "mal": "ഡച്ച്",
      "mao": "Tatimana",
      "mar": "भांग भरलेली एक सिगार",
      "may": "Belanda",
      "mlg": "Anarana",
      "mlt": "Olandiż",
      "mon": "Нидерланд",
      "nep": "डच",
      "nor": "Nederlandsk",
      "pan": "ਡੱਚ",
      "per": "هلندی",
      "pol": "Holenderski",
      "por": "Holandês",
      "rum": "Olandeză",
      "rus": "Голландский",
      "sin": "ලන්දේසි",
      "slo": "Holandský",
      "slv": "Nizozemski",
      "spa": "Holandés",
      "srp": "Холандски",
      "sun": "Walanda",
      "swa": "Kiholanzi",
      "swe": "Holländska",
      "tam": "டச்சு",
      "tat": "Һолланд теле",
      "tel": "డచ్",
      "tgk": "Голландский",
      "tgl": "Dutch",
      "tha": "ดัทช์",
      "tur": "Hollanda",
      "ukr": "Голландський",
      "urd": "ڈچ",
      "uzb": "Dutch",
      "vie": "Tiếng hà lan",
      "wel": "Iseldireg",
      "xho": "Isidutch",
      "yid": "האָלענדיש"
    },
    "modified_at": "2020-05-02T19:44:51.973Z",
    "name": "dut",
    "repository": "world.karaokes.moe",
    "tid": "ede42322-0350-437b-a972-d6c802c9fcc7",
    "types": [
      "langs"
    ]
  }
}