{
  "header": {
    "version": 4,
    "description": "Karaoke Mugen Karaoke Data File"
  },
  "medias": [
    {
      "version": "Default",
      "filename": "ENG - Avril Lavigne - MV - Girlfriend.mp4",
      "audiogain": -8.35,
      "loudnorm": "-9.35,0.20,3.80,-19.42,-0.67",
      "filesize": 42074338,
      "duration": 214,
      "default": true,
      "lyrics": [
        {
          "filename": "ENG - Avril Lavigne - MV - Girlfriend.ass",
          "default": true,
          "version": "Default"
        }
      ]
    }
  ],
  "data": {
    "created_at": "2021-10-23T21:42:47.899Z",
    "kid": "0cdbe18e-681e-4b18-9080-16894b25941d",
    "modified_at": "2021-11-11T22:56:21.313Z",
    "repository": "world.karaokes.moe",
    "tags": {
      "authors": [
        "70e26885-c0b5-4a01-b95b-2f492b8a8f10"
      ],
      "creators": [
        "011b3ef8-7a64-4816-b94c-1c21bc24e833"
      ],
      "families": [
        "5391f9fe-638c-415f-8dc9-958e3a2c5787"
      ],
      "groups": [
        "3c14c864-533c-49e6-a3cc-6969f1233775"
      ],
      "langs": [
        "de5eda1c-5fb3-46a6-9606-d4554fc5a1d6"
      ],
      "singers": [
        "abfd3a13-c24a-4679-8c8a-15f19f0bc8c4"
      ],
      "songtypes": [
        "7be1b15c-cff8-4b37-a649-5c90f3d569a9"
      ],
      "songwriters": [
        "7d980b44-3f55-4917-a92a-0fa48385c592",
        "abfd3a13-c24a-4679-8c8a-15f19f0bc8c4"
      ]
    },
    "titles": {
      "eng": "Girlfriend"
    },
    "title": "Girlfriend",
    "year": 2007
  }
}