{
  "header": {
    "version": 4,
    "description": "Karaoke Mugen Karaoke Data File"
  },
  "medias": [
    {
      "version": "Default",
      "filename": "ENG - Placebo - MV - The Bitter End.mp4",
      "audiogain": 0.3,
      "loudnorm": "-18.21,-7.23,5.20,-28.33,-1.22",
      "filesize": 12038325,
      "duration": 192,
      "default": true,
      "lyrics": [
        {
          "filename": "ENG - Placebo - MV - The Bitter End.ass",
          "default": true,
          "version": "Default",
          "subchecksum": "9b559f22b0cdd48bec2d83c3f095047c"
        }
      ]
    }
  ],
  "data": {
    "created_at": "2021-05-21T16:25:28.045Z",
    "kid": "76333684-3011-4253-b238-3bceef419fa6",
    "modified_at": "2021-05-21T16:31:51.421Z",
    "repository": "world.karaokes.moe",
    "tags": {
      "authors": [
        "71ddde56-54fd-41cd-abc1-3275de868e3a"
      ],
      "creators": [
        "d671f0a3-60b3-428e-9161-478265c1f946"
      ],
      "families": [
        "5391f9fe-638c-415f-8dc9-958e3a2c5787"
      ],
      "groups": [
        "3c14c864-533c-49e6-a3cc-6969f1233775"
      ],
      "langs": [
        "de5eda1c-5fb3-46a6-9606-d4554fc5a1d6"
      ],
      "singers": [
        "cbf6c118-e874-4e5a-8b0d-004698308f9d"
      ],
      "songtypes": [
        "7be1b15c-cff8-4b37-a649-5c90f3d569a9"
      ],
      "songwriters": [
        "c8ade018-601e-4444-916e-a57794f5c6f0"
      ]
    },
    "title": "The Bitter End",
    "titles": {
      "eng": "The Bitter End"
    },
    "year": 2003
  }
}