{
  "header": {
    "description": "Karaoke Mugen Tag File",
    "version": 1
  },
  "tag": {
    "i18n": {
      "eng": "Dave Robinson"
    },
    "modified_at": "2021-10-21T18:42:35.825Z",
    "name": "Dave Robinson",
    "repository": "world.karaokes.moe",
    "tid": "39cc5962-1d8f-4883-8fb2-8042cc1a4388",
    "types": [
      "songwriters"
    ]
  }
}