{
  "header": {
    "version": 4,
    "description": "Karaoke Mugen Karaoke Data File"
  },
  "medias": [
    {
      "version": "Default",
      "filename": "ENG - Julie Bergan, Seungri - MV - Ignite.mp4",
      "audiogain": -9.24,
      "loudnorm": "-7.85,2.17,5.20,-17.99,-0.95",
      "filesize": 77951220,
      "duration": 207,
      "default": true,
      "lyrics": [
        {
          "filename": "ENG - Julie Bergan, Seungri - MV - Ignite.ass",
          "default": true,
          "version": "Default"
        }
      ]
    }
  ],
  "data": {
    "created_at": "2021-11-11T20:53:04.917Z",
    "kid": "c7f509f5-8350-46b4-ab13-5665bf3e7f70",
    "modified_at": "2021-11-11T22:58:17.221Z",
    "repository": "world.karaokes.moe",
    "tags": {
      "authors": [
        "b6721ec8-5f6a-46f8-aaba-ce56b822723b"
      ],
      "creators": [
        "54df334c-0860-4a2e-8c82-2c43354d4645",
        "5b29bf8d-93e9-4601-9992-0b2b6d87e27d"
      ],
      "families": [
        "5391f9fe-638c-415f-8dc9-958e3a2c5787"
      ],
      "groups": [
        "ae613721-1fbe-480d-ba6b-d6d0702b184d"
      ],
      "langs": [
        "de5eda1c-5fb3-46a6-9606-d4554fc5a1d6"
      ],
      "singers": [
        "40dd7277-3c52-41f2-9e90-92aba7b5db1c",
        "7eb1c5a5-0754-4690-9002-bad6e033e7a5"
      ],
      "songtypes": [
        "7be1b15c-cff8-4b37-a649-5c90f3d569a9"
      ],
      "songwriters": [
        "31a992c5-15b0-4d4a-97f9-46fdeab39f59",
        "83317de3-d59a-430b-b9e0-83a78af802aa",
        "9acd3266-c0c2-4ab7-82ac-8670feac17ae",
        "d98ac095-9637-490f-a537-b795affe13cf",
        "d9bdbfb6-7aff-4fd4-813f-f18ce05b4b85"
      ]
    },
    "titles": {
      "eng": "Ignite"
    },
    "title": "Ignite",
    "year": 2018
  }
}