{
  "header": {
    "description": "Karaoke Mugen Tag File",
    "version": 1
  },
  "tag": {
    "i18n": {
      "eng": "Chris Colfer"
    },
    "modified_at": "2020-08-15T19:19:47.979Z",
    "name": "Chris Colfer",
    "repository": "world.karaokes.moe",
    "tid": "b1be0264-52c0-457c-a286-fcc9ff75c478",
    "types": [
      "singers"
    ]
  }
}