{
  "header": {
    "description": "Karaoke Mugen Tag File",
    "version": 1
  },
  "tag": {
    "i18n": {
      "eng": "José Luis Perales"
    },
    "name": "José Luis Perales",
    "repository": "world.karaokes.moe",
    "tid": "63b54b22-764f-4160-b992-d0068d59433d",
    "types": [
      "songwriters"
    ]
  }
}