{
  "header": {
    "description": "Karaoke Mugen Tag File",
    "version": 1
  },
  "tag": {
    "i18n": {
      "eng": "Christian Løchstøer"
    },
    "modified_at": "2021-09-12T11:41:16.881Z",
    "name": "Christian Løchstøer",
    "repository": "world.karaokes.moe",
    "tid": "17bc11bc-1d50-4201-ae8a-c4f66f19144a",
    "types": [
      "songwriters"
    ]
  }
}