{
  "header": {
    "description": "Karaoke Mugen Tag File",
    "version": 1
  },
  "tag": {
    "i18n": {
      "afr": "Japanees",
      "alb": "Japoneze",
      "amh": "ጃፓንኛ",
      "ara": "اليابانية",
      "arm": "Ճապոներեն",
      "aze": "Yapon",
      "bak": "Япон теле",
      "baq": "Japoniako",
      "bel": "Японскі",
      "ben": "জাপানি",
      "bos": "Japanci",
      "bul": "Японски",
      "cat": "Japonès",
      "chi": "日本",
      "cze": "Japonské",
      "dan": "Japansk",
      "dut": "Japans",
      "eng": "Japanese",
      "epo": "Japana",
      "est": "Jaapani",
      "fin": "Japanilainen",
      "fre": "Japonais",
      "geo": "იაპონელი",
      "ger": "Japanisch",
      "gla": "Italian",
      "gle": "Seapáinis",
      "glg": "Xaponés",
      "gre": "Ιαπωνικά",
      "guj": "જાપાનીઝ",
      "hat": "Japonè",
      "heb": "יפנית",
      "hin": "जापानी",
      "hrv": "Japanski",
      "hun": "Japán",
      "ice": "Japanska",
      "ind": "Jepang",
      "ita": "Giapponese",
      "jav": "Jepang",
      "jpn": "日本語",
      "kan": "ಜಪಾನೀಸ್",
      "kaz": "Жапон",
      "kir": "Японский",
      "kor": "일본어",
      "lat": "Facilisis",
      "lav": "Japāņu",
      "lit": "Japonų",
      "mac": "Јапонски",
      "mal": "ജാപ്പനീസ്",
      "mao": "Hapanihi",
      "mar": "जपानी",
      "may": "Jepun",
      "mlg": "Japoney",
      "mlt": "Ġappuniż",
      "mon": "Японы",
      "nep": "जापानी",
      "nor": "Japansk",
      "pan": "ਜਪਾਨੀ",
      "per": "ژاپنی",
      "pol": "Japoński",
      "por": "Japonês",
      "rum": "Japoneze",
      "rus": "Японский",
      "sin": "ජපන්",
      "slo": "Japonský",
      "slv": "Japonski",
      "spa": "Japonés",
      "srp": "Јапански",
      "sun": "Jepang",
      "swa": "Kijapani",
      "swe": "Japanska",
      "tam": "ஜப்பனீஸ்",
      "tat": "Япон теле",
      "tel": "జపనీస్",
      "tgk": "Ҷопон",
      "tgl": "Hapon",
      "tha": "ภาษาญี่ปุ่น",
      "tur": "Japon",
      "ukr": "Японський",
      "urd": "جاپانی",
      "uzb": "Yaponiya",
      "vie": "Nhật bản",
      "wel": "Siapan",
      "xho": "Isijapanese",
      "yid": "יאַפּאַניש"
    },
    "name": "jpn",
    "repository": "world.karaokes.moe",
    "tid": "4dcf9614-7914-42aa-99f4-dbce2e059133",
    "types": [
      "langs"
    ]
  }
}