{
  "header": {
    "description": "Karaoke Mugen Tag File",
    "version": 1
  },
  "tag": {
    "i18n": {
      "eng": "Didier Barbelivien"
    },
    "modified_at": "2020-03-31T19:04:34.149Z",
    "name": "Didier Barbelivien",
    "repository": "world.karaokes.moe",
    "tid": "48ff09de-f36d-4a22-a1bd-dcefd8fabcc8",
    "types": [
      "songwriters"
    ]
  }
}