{
  "header": {
    "description": "Karaoke Mugen Tag File",
    "version": 1
  },
  "tag": {
    "aliases": [
      "OMD"
    ],
    "i18n": {
      "eng": "Orchestral Manoeuvres In The Dark"
    },
    "modified_at": "2021-09-05T21:42:48.189Z",
    "name": "Orchestral Manoeuvres In The Dark",
    "repository": "world.karaokes.moe",
    "tid": "34e6d38a-0660-4037-88b2-eed3ce66d56a",
    "types": [
      "singers"
    ]
  }
}