{
  "header": {
    "description": "Karaoke Mugen Tag File",
    "version": 1
  },
  "tag": {
    "i18n": {
      "eng": "Bruno Pelletier"
    },
    "modified_at": "2020-07-03T23:54:55.548Z",
    "name": "Bruno Pelletier",
    "repository": "world.karaokes.moe",
    "tid": "ab6cb110-6c07-4d07-a1fe-ce5e9108251b",
    "types": [
      "singers"
    ]
  }
}