{
  "header": {
    "description": "Karaoke Mugen Tag File",
    "version": 1
  },
  "tag": {
    "i18n": {
      "eng": "Andy McCluskey"
    },
    "modified_at": "2021-09-05T21:30:32.198Z",
    "name": "Andy McCluskey",
    "repository": "world.karaokes.moe",
    "tid": "b33687a9-61b8-402c-9764-34e1882cad6a",
    "types": [
      "songwriters"
    ]
  }
}