{
  "header": {
    "description": "Karaoke Mugen Tag File",
    "version": 1
  },
  "tag": {
    "i18n": {
      "eng": "Olivier Guillot"
    },
    "name": "Olivier Guillot",
    "repository": "world.karaokes.moe",
    "tid": "c4943c6d-55de-45f9-a83d-5e69a10df51c",
    "types": [
      "songwriters"
    ]
  }
}