{
  "header": {
    "description": "Karaoke Mugen Tag File",
    "version": 1
  },
  "tag": {
    "i18n": {
      "eng": "Dan Bălan"
    },
    "modified_at": "2020-06-01T16:29:55.649Z",
    "name": "Dan Bălan",
    "repository": "world.karaokes.moe",
    "tid": "9dbabc53-0f04-4554-8184-d56ac044ad5c",
    "types": [
      "songwriters",
      "singers"
    ]
  }
}