{
  "header": {
    "description": "Karaoke Mugen Tag File",
    "version": 1
  },
  "tag": {
    "i18n": {
      "afr": "Bengali, Bangla",
      "amh": "ቤንጋሊኛ, የታዘዘ",
      "ara": "البنغالية ، البنغالية",
      "aze": "Benqal, Benqal",
      "bak": "Бенгальский, Бенгальский",
      "bel": "Бенгальская, Бенгальская",
      "bul": "Бенгалски, Бенгалски",
      "ben": "বাংলা, বাংলা",
      "bos": "Koja, Bangla",
      "cat": "El Bengalí, El Bangla",
      "cze": "Bengálština, Bengálština",
      "wel": "Bengali, Bangla",
      "dan": "Bengali, Bangla -",
      "ger": "Bengali, Bangla",
      "gre": "Μπενγκάλι, Bangla",
      "eng": "Bengali, Bangla",
      "epo": "La Bengala, La Bengala",
      "spa": "Bengalí, Bangla",
      "est": "Bengali, Bangla",
      "baq": "Bengali, Bangla",
      "per": "بنگالی, بنگلادش",
      "fin": "Bengali, Assami",
      "fre": "Bengali",
      "gle": "Beangáilis, Bangla",
      "gla": "Beangailis, Bangla",
      "glg": "Bengalí, Bangla",
      "guj": "બંગાળી, બાંગ્લા",
      "heb": "בנגלית, אנגלה",
      "hin": "बंगाली, बांग्ला",
      "hrv": "Bengalski, Bengalski",
      "hat": "Bengali, Bangla",
      "hun": "Bengáli, Bangla",
      "arm": "Բուլղարերեն, Բենգալերեն",
      "ind": "Bengali, Bangla",
      "ice": "Íslenska, Bangla",
      "ita": "Il Bengalese, Il Bangla",
      "jpn": "ベンガル語、チ",
      "jav": "Bengali, Bangla",
      "geo": "Bengali, Bangla",
      "kaz": "Бенгал, Бенгал",
      "kan": "ಬೆಂಗಾಲಿ, ಬಾಂಗ್ಲಾ",
      "kor": "벵골어,벵골어",
      "kir": "Бенгальский, Бенгальский",
      "lat": "Bengalica, Bangla",
      "lit": "Bengalų, Bangla",
      "lav": "Bengāļu, Bangla",
      "mlg": "Bengali, Bangla",
      "mao": "Armenian, Bangla",
      "mac": "Бенгалски, Бангла",
      "mal": "ബംഗാളി, ബംഗ്ലാ",
      "mon": "Бенгал, Bangla",
      "mar": "Bengali, Bangla",
      "may": "Bengali, Bangla",
      "mlt": "}, Bangla",
      "nep": "बंगाली, Bangla",
      "dut": "Bengaals, Bangla",
      "nor": "Bengali, Bangla",
      "pan": "ਬੰਗਾਲੀ, ਬੰਗਲਾ",
      "pol": "Bengalski, Bengalski",
      "por": "Bengali, Bangla",
      "rum": "Bengali, Bangla",
      "rus": "Бенгальский, Бенгальский",
      "sin": "බෙංගාලි, බංග්ලා",
      "slo": "Bengálčina, Bengálčina",
      "slv": "Bengalščina, Bangla",
      "alb": "Bengali, Shqip",
      "srp": "Азерски, Бенгалски",
      "sun": "Bengali, Bangla",
      "swe": "Bengali, Bangla",
      "swa": "Kibengali, Bangla",
      "tam": "வங்காளம், பங்களா",
      "tel": "బెంగాలీ, బంగ్లా",
      "tgk": "Бенгалӣ, Бенгалӣ",
      "tha": "ภาษาเบงกาลีย Bangla",
      "tgl": "Bengali, Bangla",
      "tur": "Bengalce Bengalce",
      "tat": "Бенгальский, Бенгальский",
      "ukr": "Бенгальська, Бенгальська",
      "urd": "بنگالی بنگلہ",
      "uzb": "Avar Tili, Bangla",
      "vie": "Bengali, ",
      "xho": "Gujarati, Bangla",
      "yid": "בענגאַליש, באַנגלאַ",
      "chi": "孟加拉语、孟加拉"
    },
    "name": "ben",
    "tid": "b59ed811-f34c-401a-8f67-808024021b54",
    "types": [
      "langs"
    ],
    "repository": "world.karaokes.moe",
    "modified_at": "2020-03-31T19:04:33.710Z"
  }
}