{
  "header": {
    "version": 4,
    "description": "Karaoke Mugen Karaoke Data File"
  },
  "medias": [
    {
      "version": "Default",
      "filename": "ENG - Coolio, L.V. - MV - Gangsta's Paradise.mp4",
      "audiogain": -6.2,
      "loudnorm": "-10.89,0.50,3.50,-20.93,-0.40",
      "filesize": 38193581,
      "duration": 256,
      "default": true,
      "lyrics": [
        {
          "filename": "ENG - Coolio, L.V. - MV - Gangsta's Paradise.ass",
          "default": true,
          "version": "Default",
          "subchecksum": "26e27e65a340d255c388d608cfcb1ed1"
        }
      ]
    }
  ],
  "data": {
    "created_at": "2021-07-23T21:30:38.383Z",
    "kid": "7fd6f39a-2348-4efc-bceb-b1f51d9ed9b0",
    "modified_at": "2021-07-23T21:38:58.764Z",
    "repository": "world.karaokes.moe",
    "tags": {
      "authors": [
        "9cdf3b70-3550-457c-bdb9-038f3253c6ad"
      ],
      "creators": [
        "56ac0b1e-0cc6-4083-9456-9c12df4658ce"
      ],
      "families": [
        "5391f9fe-638c-415f-8dc9-958e3a2c5787"
      ],
      "groups": [
        "24db50aa-a126-4d34-a48a-e45db79c4245"
      ],
      "langs": [
        "de5eda1c-5fb3-46a6-9606-d4554fc5a1d6"
      ],
      "singers": [
        "05c49359-885f-44eb-ab82-2776827bd258",
        "b2d3d926-bac2-40b0-83ea-94c732d6292d"
      ],
      "songtypes": [
        "7be1b15c-cff8-4b37-a649-5c90f3d569a9"
      ],
      "songwriters": [
        "05c49359-885f-44eb-ab82-2776827bd258",
        "b2d3d926-bac2-40b0-83ea-94c732d6292d",
        "c2cc507a-59ef-4036-845d-45ebc5301508",
        "d0f5ff76-7ca5-4349-90ec-e48a53c061da"
      ]
    },
    "title": "Gangsta's Paradise",
    "titles": {
      "eng": "Gangsta's Paradise"
    },
    "year": 1995
  }
}