{
  "header": {
    "description": "Karaoke Mugen Tag File",
    "version": 1
  },
  "tag": {
    "i18n": {
      "eng": "Evanescence"
    },
    "modified_at": "2020-07-11T22:51:17.023Z",
    "name": "Evanescence",
    "repository": "world.karaokes.moe",
    "tid": "577b6388-43db-451b-af8d-ba66caea7e7a",
    "types": [
      "singers"
    ]
  }
}