{
  "header": {
    "description": "Karaoke Mugen Tag File",
    "version": 1
  },
  "tag": {
    "i18n": {
      "eng": "Zac Efron"
    },
    "modified_at": "2020-03-31T19:04:38.861Z",
    "name": "Zac Efron",
    "repository": "world.karaokes.moe",
    "tid": "35b526c2-798d-471f-a060-b63fe13007a5",
    "types": [
      "singers"
    ]
  }
}