{
  "header": {
    "version": 4,
    "description": "Karaoke Mugen Karaoke Data File"
  },
  "medias": [
    {
      "version": "Default",
      "filename": "ENG - Boney M - MV - Rasputin.mp4",
      "audiogain": -2.92,
      "loudnorm": "-14.58,-0.95,2.80,-24.60,-0.63",
      "filesize": 23137491,
      "duration": 269,
      "default": true,
      "lyrics": [
        {
          "filename": "ENG - Boney M - MV - Rasputin.ass",
          "default": true,
          "version": "Default"
        }
      ]
    }
  ],
  "data": {
    "created_at": "2022-03-19T16:31:21.644Z",
    "ignoreHooks": false,
    "kid": "1ae65028-d6df-48b2-bf53-5f83b7c65977",
    "modified_at": "2022-03-19T16:37:46.444Z",
    "repository": "world.karaokes.moe",
    "tags": {
      "authors": [
        "2ca6b53a-1b53-4535-b275-d3030b79172d"
      ],
      "creators": [
        "4f14f747-746f-4dbf-985e-107d52261bb9"
      ],
      "families": [
        "5391f9fe-638c-415f-8dc9-958e3a2c5787"
      ],
      "groups": [
        "2b4e9972-5e17-481b-99f5-d0787c0ada56",
        "57e5e0c0-e02e-4871-a6cb-d48ea604ebab"
      ],
      "langs": [
        "de5eda1c-5fb3-46a6-9606-d4554fc5a1d6"
      ],
      "singers": [
        "68d3eb00-d3ba-4e7d-8921-2af94b9c6bbd"
      ],
      "songtypes": [
        "7be1b15c-cff8-4b37-a649-5c90f3d569a9"
      ],
      "songwriters": [
        "f065c6f5-3c92-40c1-b9cf-7c6a43e88ccc",
        "290c12bf-2c01-4b22-913e-300d8282140e",
        "a81038a8-65f0-49f6-993f-837d6fd66fcb"
      ]
    },
    "titles": {
      "eng": "Rasputin"
    },
    "title": "Rasputin",
    "year": 1978
  }
}