{
  "header": {
    "description": "Karaoke Mugen Tag File",
    "version": 1
  },
  "tag": {
    "i18n": {
      "eng": "Skarsnik"
    },
    "modified_at": "2021-03-17T23:05:38.389Z",
    "name": "Skarsnik",
    "repository": "world.karaokes.moe",
    "tid": "1efdaf5b-3fa4-4628-8dd9-6f796f795b1f",
    "types": [
      "authors"
    ]
  }
}