{
  "header": {
    "description": "Karaoke Mugen Tag File",
    "version": 1
  },
  "tag": {
    "i18n": {
      "eng": "Jean-Louis Pujade"
    },
    "modified_at": "2021-09-05T21:11:52.523Z",
    "name": "Jean-Louis Pujade",
    "repository": "world.karaokes.moe",
    "tid": "2dc93c9b-fec4-4bec-bfa7-adb93824f9fb",
    "types": [
      "songwriters"
    ]
  }
}