{
  "header": {
    "version": 4,
    "description": "Karaoke Mugen Karaoke Data File"
  },
  "medias": [
    {
      "version": "Default",
      "filename": "ENG - Wham! - MV - Last Christmas.mp4",
      "audiogain": -1.07,
      "loudnorm": "-16.45,-0.82,4.40,-26.81,-0.82",
      "filesize": 30434533,
      "duration": 277,
      "default": true,
      "lyrics": [
        {
          "filename": "ENG - Wham! - MV - Last Christmas.ass",
          "default": true,
          "version": "Default",
          "subchecksum": "93e4bf21f17723cb6d63cf86bf3cdd0f"
        }
      ]
    }
  ],
  "data": {
    "created_at": "2020-07-04T15:22:16.007Z",
    "kid": "6ab7397f-8751-4f5e-9bba-ef97d8d20fa0",
    "modified_at": "2021-02-25T14:51:05.541Z",
    "repository": "world.karaokes.moe",
    "tags": {
      "authors": [
        "568285fd-64fc-4faa-8331-c0a847024008"
      ],
      "creators": [
        "1cd2f13e-05cb-49b5-b42f-96260f7a162b"
      ],
      "families": [
        "5391f9fe-638c-415f-8dc9-958e3a2c5787"
      ],
      "groups": [
        "7792cc27-9ff9-4d47-9287-2338b7db1575"
      ],
      "langs": [
        "de5eda1c-5fb3-46a6-9606-d4554fc5a1d6"
      ],
      "singers": [
        "4824aeb4-9e51-4419-9c4e-79dc30edcbcf"
      ],
      "songtypes": [
        "7be1b15c-cff8-4b37-a649-5c90f3d569a9"
      ],
      "songwriters": [
        "45df453a-c794-493a-9940-26e61d1badff"
      ]
    },
    "title": "Last Christmas",
    "titles": {
      "eng": "Last Christmas"
    },
    "year": 1984
  }
}