{
  "header": {
    "description": "Karaoke Mugen Tag File",
    "version": 1
  },
  "tag": {
    "i18n": {
      "eng": "Angry"
    },
    "modified_at": "2020-07-06T20:35:57.203Z",
    "name": "Angry",
    "repository": "world.karaokes.moe",
    "tid": "01391b7c-dbd0-47a4-98a8-f94c7ed4f316",
    "types": [
      "authors"
    ]
  }
}