{
  "header": {
    "description": "Karaoke Mugen Tag File",
    "version": 1
  },
  "tag": {
    "i18n": {
      "eng": "Harriet Jay"
    },
    "modified_at": "2020-03-31T19:04:34.629Z",
    "name": "Harriet Jay",
    "repository": "world.karaokes.moe",
    "tid": "4e8dd313-5600-408e-8311-8314cbdd18a4",
    "types": [
      "singers"
    ]
  }
}