{
  "header": {
    "description": "Karaoke Mugen Tag File",
    "version": 1
  },
  "tag": {
    "i18n": {
      "eng": "CF0$"
    },
    "modified_at": "2020-07-16T16:37:13.328Z",
    "name": "CF0$",
    "repository": "world.karaokes.moe",
    "tid": "cf36466b-4d20-4c05-b5d3-4dc03abe4b46",
    "types": [
      "singers"
    ]
  }
}