{
  "header": {
    "description": "Karaoke Mugen Tag File",
    "version": 1
  },
  "tag": {
    "i18n": {
      "eng": "Michelangelo Loconte"
    },
    "name": "Michelangelo Loconte",
    "repository": "world.karaokes.moe",
    "tid": "d6db1757-478e-4617-8db3-dee820ff1f86",
    "types": [
      "singers"
    ]
  }
}