{
  "header": {
    "description": "Karaoke Mugen Tag File",
    "version": 1
  },
  "tag": {
    "i18n": {
      "afr": "Yoruba",
      "amh": "Yoruba",
      "ara": "اليوروبية",
      "aze": "Yoruba",
      "bak": "Йоруба теле",
      "bel": "Yoruba",
      "bul": "Йоруба",
      "ben": "ইওরুবা",
      "bos": "Ukrajinski",
      "cat": "Ioruba",
      "cze": "Jorubština",
      "wel": "Iorwba",
      "dan": "Yoruba",
      "ger": "Yoruba",
      "gre": "Γιορούμπα",
      "eng": "Yoruba",
      "epo": "Joruba",
      "spa": "Yoruba",
      "est": "Yoruba",
      "baq": "Yoruba",
      "per": "یوروبایی",
      "fin": "Yoruba",
      "fre": "Yoruba",
      "gle": "Yoruba",
      "gla": "Yoruba",
      "glg": "Ioruba",
      "guj": "યોરૂબા",
      "heb": "יורובה",
      "hin": "योरूबा",
      "hrv": "Joruba",
      "hat": "Yowouba",
      "hun": "Joruba",
      "arm": "Յորուբա",
      "ind": "Yoruba",
      "ice": "Íslenska",
      "ita": "Yoruba",
      "jpn": "ヨルバ語",
      "jav": "Yoruba",
      "geo": "Yoruba",
      "kaz": "Йоруба",
      "kan": "ಯೊರುಬಾ",
      "kor": "벨라루",
      "kir": "Йоруба",
      "lat": "Agit",
      "lit": "Yoruba",
      "lav": "Yoruba",
      "mlg": "Yoruba",
      "mao": "Yoruba",
      "mac": "Yoruba",
      "mal": "യൊറുബ",
      "mon": "Yoruba",
      "mar": "हिब्रू हौसा",
      "may": "Zulu",
      "mlt": "}",
      "nep": "मोटु",
      "dut": "Yoruba",
      "nor": "Yorubaspråket",
      "pan": "ਯੋਰੂਬਾ",
      "pol": "Joruba",
      "por": "Yoruba",
      "rum": "Yoruba",
      "rus": "Йоруба",
      "sin": "යොරුබා",
      "slo": "Gtktextview",
      "slv": "V inuktituščino",
      "alb": "Yoruba",
      "srp": "Јоруба",
      "sun": "Yoruba",
      "swe": "Yoruba",
      "swa": "Yoruba",
      "tam": "யோருப்பா",
      "tel": "యోరుబా",
      "tgk": "Yoruba",
      "tha": "ภาษาโยรูบา name",
      "tgl": "Yoruba",
      "tur": "Yoruba",
      "tat": "Йоруба теле",
      "ukr": "Йоруба",
      "urd": "یوروبا",
      "uzb": "Yoruba",
      "vie": "Tiếng yiddish",
      "xho": "Yoruba",
      "yid": "יאָרובאַ",
      "chi": "约鲁巴语"
    },
    "name": "yor",
    "tid": "df5061a8-05c5-4744-b1b6-83112ca9b92a",
    "types": [
      "langs"
    ],
    "repository": "world.karaokes.moe",
    "modified_at": "2020-03-31T19:04:38.564Z"
  }
}