{
  "header": {
    "description": "Karaoke Mugen Tag File",
    "version": 1
  },
  "tag": {
    "i18n": {
      "eng": "Coconut"
    },
    "modified_at": "2021-05-21T20:14:34.594Z",
    "name": "Coconut",
    "repository": "world.karaokes.moe",
    "tid": "853ef7ea-3e0b-4d9f-8307-b354623f7711",
    "types": [
      "creators"
    ]
  }
}