{
  "header": {
    "version": 4,
    "description": "Karaoke Mugen Karaoke Data File"
  },
  "medias": [
    {
      "version": "Default",
      "filename": "ENG - High School Musical 3 - MOVIE IN2 - Right Here, Right Now.mp4",
      "audiogain": 4.37,
      "loudnorm": "-22.77,-9.02,13.20,-33.52,-1.48",
      "filesize": 40125017,
      "duration": 145,
      "default": true,
      "lyrics": [
        {
          "filename": "ENG - High School Musical 3 - MOVIE IN2 - Right Here, Right Now.ass",
          "default": true,
          "version": "Default",
          "subchecksum": "6e6e7d96d28a71efdf333f9bd90ff7bd"
        }
      ]
    }
  ],
  "data": {
    "created_at": "2020-07-07T19:51:03.499Z",
    "kid": "8b7c8e92-baaf-4905-8ef3-dedd91aee249",
    "modified_at": "2021-02-25T14:49:38.692Z",
    "repository": "world.karaokes.moe",
    "songorder": 2,
    "tags": {
      "authors": [
        "05c1e4ad-32ba-490e-8f3c-5cd491c96d85"
      ],
      "creators": [
        "2d3f223d-16d3-4f9a-bfa9-2038765a0ae7"
      ],
      "families": [
        "5391f9fe-638c-415f-8dc9-958e3a2c5787"
      ],
      "groups": [
        "3c14c864-533c-49e6-a3cc-6969f1233775"
      ],
      "langs": [
        "de5eda1c-5fb3-46a6-9606-d4554fc5a1d6"
      ],
      "misc": [
        "1d6ceadf-a885-47e5-b23b-c07bf668a424"
      ],
      "origins": [
        "c8ca9dea-d8b4-48fe-8427-d911653232e9"
      ],
      "series": [
        "26cb36f1-22f2-4419-b5c7-9758f7bfcc10"
      ],
      "singers": [
        "152cc20a-ff2b-4c67-b3ec-8e1d26867368",
        "35b526c2-798d-471f-a060-b63fe13007a5"
      ],
      "songtypes": [
        "5e5250d9-351a-4a82-98eb-55db50ad8962"
      ]
    },
    "title": "Right Here, Right Now",
    "titles": {
      "eng": "Right Here, Right Now"
    },
    "year": 2008
  }
}