{
  "header": {
    "description": "Karaoke Mugen Tag File",
    "version": 1
  },
  "tag": {
    "i18n": {
      "eng": "Shuki Levy"
    },
    "modified_at": "2020-06-21T21:00:25.806Z",
    "name": "Shuki Levy",
    "repository": "world.karaokes.moe",
    "tid": "cf9d5b37-8ab5-4050-a145-ea7cc943904b",
    "types": [
      "songwriters",
      "singers"
    ]
  }
}