{
  "header": {
    "version": 4,
    "description": "Karaoke Mugen Karaoke Data File"
  },
  "medias": [
    {
      "version": "Default",
      "filename": "ENG - High School Musical 2 - MOVIE IN5 - I Don't Dance.mp4",
      "audiogain": -2.04,
      "loudnorm": "-15.82,-0.32,4.30,-25.84,-0.18",
      "filesize": 148015730,
      "duration": 231,
      "default": true,
      "lyrics": [
        {
          "filename": "ENG - High School Musical 2 - MOVIE IN5 - I Don't Dance.ass",
          "default": true,
          "version": "Default",
          "subchecksum": "4169bd0472217bc0d328c42532161866"
        }
      ]
    }
  ],
  "data": {
    "created_at": "2020-07-09T16:10:34.301Z",
    "kid": "59fe0eda-e675-424d-980e-1d4a4c611273",
    "modified_at": "2021-02-25T14:49:25.716Z",
    "repository": "world.karaokes.moe",
    "songorder": 5,
    "tags": {
      "authors": [
        "05c1e4ad-32ba-490e-8f3c-5cd491c96d85"
      ],
      "creators": [
        "c800ba78-ac66-4419-9903-fa8fdb3fc377"
      ],
      "families": [
        "5391f9fe-638c-415f-8dc9-958e3a2c5787"
      ],
      "groups": [
        "3c14c864-533c-49e6-a3cc-6969f1233775"
      ],
      "langs": [
        "de5eda1c-5fb3-46a6-9606-d4554fc5a1d6"
      ],
      "misc": [
        "1d6ceadf-a885-47e5-b23b-c07bf668a424"
      ],
      "origins": [
        "c8ca9dea-d8b4-48fe-8427-d911653232e9"
      ],
      "series": [
        "e463d80b-d141-4192-9430-4688afbe3304"
      ],
      "singers": [
        "903f07d0-1e3a-4bc5-8b78-6149324690f6",
        "94f92e19-27e7-430e-a5c4-f96b2e9e317f"
      ],
      "songtypes": [
        "5e5250d9-351a-4a82-98eb-55db50ad8962"
      ]
    },
    "title": "I Don't Dance",
    "titles": {
      "eng": "I Don't Dance"
    },
    "year": 2007
  }
}