{
  "header": {
    "description": "Karaoke Mugen Tag File",
    "version": 1
  },
  "tag": {
    "i18n": {
      "eng": "Bisquette"
    },
    "name": "Bisquette",
    "repository": "world.karaokes.moe",
    "tid": "dd4f1279-de1b-4d06-b80d-29c4878bfd8e",
    "types": [
      "authors"
    ]
  }
}