{
  "header": {
    "version": 4,
    "description": "Karaoke Mugen Karaoke Data File"
  },
  "medias": [
    {
      "version": "Default",
      "filename": "ENG - Skyfall - MOVIE MV - Skyfall.mp4",
      "audiogain": -11.71,
      "loudnorm": "-5.84,3.18,18.70,-16.85,-1.53",
      "filesize": 46480267,
      "duration": 289,
      "default": true,
      "lyrics": [
        {
          "filename": "ENG - Skyfall - MOVIE MV - Skyfall.ass",
          "default": true,
          "version": "Default",
          "subchecksum": "c79881e0a33881c812a0a0850e9c6403"
        }
      ]
    }
  ],
  "data": {
    "created_at": "2021-03-11T22:55:11.927Z",
    "kid": "7470a5f7-871b-469f-a773-1852fc9dfa62",
    "modified_at": "2021-03-11T23:04:09.173Z",
    "repository": "world.karaokes.moe",
    "tags": {
      "authors": [
        "9bea7e05-2dec-434e-92ff-fcb53f69fdb7"
      ],
      "creators": [
        "5b29bf8d-93e9-4601-9992-0b2b6d87e27d"
      ],
      "families": [
        "5391f9fe-638c-415f-8dc9-958e3a2c5787"
      ],
      "groups": [
        "ae613721-1fbe-480d-ba6b-d6d0702b184d"
      ],
      "langs": [
        "de5eda1c-5fb3-46a6-9606-d4554fc5a1d6"
      ],
      "origins": [
        "c8ca9dea-d8b4-48fe-8427-d911653232e9"
      ],
      "series": [
        "86360e35-05db-412e-a813-bdff82ee8061"
      ],
      "singers": [
        "352bcfc0-88ee-465c-8f2e-3e1d07b610cd"
      ],
      "songtypes": [
        "7be1b15c-cff8-4b37-a649-5c90f3d569a9"
      ],
      "songwriters": [
        "352bcfc0-88ee-465c-8f2e-3e1d07b610cd",
        "d99079b3-e2e5-45ae-bc5d-8351850f286a"
      ]
    },
    "title": "Skyfall",
    "titles": {
      "eng": "Skyfall"
    },
    "year": 2012
  }
}