{
  "header": {
    "description": "Karaoke Mugen Tag File",
    "version": 1
  },
  "tag": {
    "i18n": {
      "eng": "J.I.D"
    },
    "name": "J.I.D",
    "repository": "world.karaokes.moe",
    "tid": "502ac3c0-ce23-4f9a-9c06-16fae533498e",
    "types": [
      "singers"
    ]
  }
}