{
  "header": {
    "version": 4,
    "description": "Karaoke Mugen Karaoke Data File"
  },
  "medias": [
    {
      "version": "Default",
      "filename": "FRE - orelsan - MV - Tout va bien.mp4",
      "audiogain": -8.88,
      "loudnorm": "-8.63,3.89,7.50,-19.16,-0.77",
      "filesize": 35000495,
      "duration": 157,
      "default": true,
      "lyrics": [
        {
          "filename": "FRE - orelsan - MV - Tout va bien.ass",
          "default": true,
          "version": "Default",
          "subchecksum": "7c48d6b4c141b6b46ff0fa40a3c1ffa1"
        }
      ]
    }
  ],
  "data": {
    "created_at": "2020-07-12T13:20:10.630Z",
    "kid": "c2c169a8-0664-4235-ae6a-3ce46ebec004",
    "modified_at": "2021-02-25T14:52:41.201Z",
    "repository": "world.karaokes.moe",
    "tags": {
      "authors": [
        "3637fdbd-0a33-4f53-8000-c825b6044221"
      ],
      "creators": [
        "46babdf8-9641-4054-b729-9ae570f10d2c"
      ],
      "families": [
        "5391f9fe-638c-415f-8dc9-958e3a2c5787"
      ],
      "groups": [
        "ae613721-1fbe-480d-ba6b-d6d0702b184d"
      ],
      "langs": [
        "fd8072b7-4d9b-45d4-8f5b-a931a830edef"
      ],
      "singers": [
        "b38fa8ad-8882-436d-a86b-b006b5e032c7"
      ],
      "songtypes": [
        "7be1b15c-cff8-4b37-a649-5c90f3d569a9"
      ],
      "songwriters": [
        "8ad6b487-f173-45c2-bf98-3bfe19a20061",
        "b38fa8ad-8882-436d-a86b-b006b5e032c7",
        "be015d85-abfc-4814-8f25-ba52a80ddaeb"
      ]
    },
    "title": "Tout va bien",
    "titles": {
      "eng": "Tout va bien"
    },
    "year": 2017
  }
}