{
  "header": {
    "description": "Karaoke Mugen Tag File",
    "version": 1
  },
  "tag": {
    "i18n": {
      "eng": "Pierre CAMILLI"
    },
    "modified_at": "2020-05-23T21:37:35.274Z",
    "name": "Pierre CAMILLI",
    "repository": "world.karaokes.moe",
    "tid": "5e93f02a-bcd1-40a9-ba7a-91ada6683aea",
    "types": [
      "authors"
    ]
  }
}