{
  "header": {
    "description": "Karaoke Mugen Tag File",
    "version": 1
  },
  "tag": {
    "i18n": {
      "afr": "Akan",
      "amh": "Akan",
      "ara": "اكان",
      "aze": "Beynəlxalq",
      "bak": "Акан теле",
      "bel": "Акання",
      "bul": "Ще проучим",
      "ben": "আকান",
      "bos": "Akan",
      "cat": "Akan",
      "cze": "Akan",
      "wel": "Akan",
      "dan": "Akan",
      "ger": "Akan",
      "gre": "Akan",
      "eng": "Akan",
      "epo": "Akan",
      "spa": "Akan",
      "est": "Akan",
      "baq": "Akan",
      "per": "Akan",
      "fin": "Akan",
      "fre": "Akan",
      "gle": "Akan",
      "gla": "Akan",
      "glg": "Akan",
      "guj": "Akan",
      "heb": "אקאן",
      "hin": "अकान",
      "hrv": "Akan",
      "hat": "Akan",
      "hun": "Akan",
      "arm": "Akan",
      "ind": "Akan",
      "ice": "Akan",
      "ita": "Akan",
      "jpn": "阿寒",
      "jav": "Akan",
      "geo": "Akan",
      "kaz": "Ақан",
      "kan": "Akan",
      "kor": "아칸",
      "kir": "Акан",
      "lat": "Akan",
      "lit": "Akan",
      "lav": "Akan",
      "mlg": "Akan",
      "mao": "Akan",
      "mac": "Akan",
      "mal": "Akan",
      "mon": "Akan",
      "mar": "Akan",
      "may": "Akan",
      "mlt": "Akan",
      "nep": "Akan",
      "dut": "Akan",
      "nor": "Akan",
      "pan": "Akan",
      "pol": "Akan",
      "por": "Akan",
      "rum": "Akan",
      "rus": "Акан",
      "sin": "Akan",
      "slo": "Akan",
      "slv": "Akan",
      "alb": "Akan",
      "srp": "Акан",
      "sun": "Akan",
      "swe": "Akan",
      "swa": "Akan",
      "tam": "Akan",
      "tel": "Akan",
      "tgk": "Акан",
      "tha": "คุณชื่ออะไร?-อาร์คัน",
      "tgl": "Akan",
      "tur": "Akan",
      "tat": "Акан теле",
      "ukr": "Акан",
      "urd": "Akan",
      "uzb": "Akan",
      "vie": "Tiếng",
      "xho": "Akan",
      "yid": "Akan",
      "chi": "阿寒"
    },
    "name": "aka",
    "tid": "81f934cb-ae7b-4f09-b659-555983a2a6dd",
    "types": [
      "langs"
    ],
    "repository": "world.karaokes.moe",
    "modified_at": "2020-03-31T19:04:33.337Z"
  }
}