{
  "header": {
    "description": "Karaoke Mugen Tag File",
    "version": 1
  },
  "tag": {
    "count": 1,
    "i18n": {
      "eng": "Elvis Crespo"
    },
    "modified_at": "2021-11-13T20:01:27.875Z",
    "name": "Elvis Crespo",
    "repository": "world.karaokes.moe",
    "tid": "49b87c5a-7fa5-400d-8f30-08dbbcfca1aa",
    "types": [
      "songwriters",
      "singers"
    ]
  }
}