{
  "header": {
    "version": 4,
    "description": "Karaoke Mugen Karaoke Data File"
  },
  "medias": [
    {
      "version": "1977.",
      "filename": "RUS - Choeurs de l'Armee rouge - AUDIO - Hymne de l'Union sovietique ~ 1977 Vers.mp3",
      "audiogain": -8.6,
      "loudnorm": "-8.66,1.79,3.50,-18.74,-0.37",
      "filesize": 6631626,
      "duration": 224,
      "default": true,
      "lyrics": [
        {
          "filename": "RUS - Choeurs de l'Armee rouge - AUDIO - Hymne de l'Union sovietique ~ 1977 Vers.ass",
          "default": true,
          "version": "Default",
          "subchecksum": "fa20688de0b50053ae578b44806e5d72"
        }
      ]
    }
  ],
  "data": {
    "created_at": "2019-05-02T01:25:50.000Z",
    "kid": "a5a04243-9e66-48ad-a082-957ae909119d",
    "modified_at": "2021-02-25T14:53:02.514Z",
    "repository": "world.karaokes.moe",
    "tags": {
      "authors": [
        "affbc2db-10d5-4c51-b2f6-61686dfbc1b1"
      ],
      "creators": [
        "9a0dfb9b-83e3-4d9f-9da8-6d356f81e3dc"
      ],
      "groups": [
        "57e5e0c0-e02e-4871-a6cb-d48ea604ebab"
      ],
      "langs": [
        "f7ac64d8-9317-45b9-a4b4-cf32e4eb527a"
      ],
      "singers": [
        "fd83944a-fed7-462d-a05e-931ada3532fb"
      ],
      "songtypes": [
        "42a262ae-acba-4ab5-a446-c5789c96c821"
      ],
      "songwriters": [
        "2c9413cf-c247-4b12-bb0f-242608ed3e54",
        "6ce73724-e124-42e4-92b9-1d22ffe0968c",
        "c9bdce5e-2b7f-45ef-a339-76a99ce2fb40"
      ]
    },
    "title": "Hymne de l'Union soviétique ~ 1977 Vers.",
    "titles": {
      "eng": "Hymne de l'Union soviétique ~ 1977 Vers."
    },
    "year": 1977
  }
}