{
  "header": {
    "description": "Karaoke Mugen Tag File",
    "version": 1
  },
  "tag": {
    "i18n": {
      "eng": "G.M. Robertson"
    },
    "modified_at": "2020-07-12T12:12:34.584Z",
    "name": "G.M. Robertson",
    "repository": "world.karaokes.moe",
    "tid": "378c98e6-f6c4-41b3-8510-69c66e4a1e5a",
    "types": [
      "songwriters"
    ]
  }
}