{
  "header": {
    "description": "Karaoke Mugen Tag File",
    "version": 1
  },
  "tag": {
    "i18n": {
      "eng": "Saturday Night Fever",
      "fre": "La Fièvre du samedi soir"
    },
    "modified_at": "2020-06-01T21:53:46.319Z",
    "name": "Saturday Night Fever",
    "repository": "world.karaokes.moe",
    "tid": "219d3334-61a3-4558-a577-793130b93b7b",
    "types": [
      "series"
    ]
  }
}