{
  "header": {
    "version": 4,
    "description": "Karaoke Mugen Karaoke Data File"
  },
  "medias": [
    {
      "version": "Default",
      "filename": "ENG - High School Musical - MOVIE IN9 - We're All In This Together.mp4",
      "audiogain": 6.39,
      "loudnorm": "-24.88,-10.41,3.10,-34.88,-0.66",
      "filesize": 182764808,
      "duration": 234,
      "default": true,
      "lyrics": [
        {
          "filename": "ENG - High School Musical - MOVIE IN9 - We're All In This Together.ass",
          "default": true,
          "version": "Default",
          "subchecksum": "3b929cbd4a77f88e96b367829ef35afc"
        }
      ]
    }
  ],
  "data": {
    "created_at": "2020-07-07T10:40:44.812Z",
    "kid": "cd53120e-0c74-4d19-ad04-f3078e418781",
    "modified_at": "2021-02-25T14:49:11.374Z",
    "repository": "world.karaokes.moe",
    "songorder": 9,
    "tags": {
      "authors": [
        "05c1e4ad-32ba-490e-8f3c-5cd491c96d85"
      ],
      "creators": [
        "c800ba78-ac66-4419-9903-fa8fdb3fc377"
      ],
      "families": [
        "5391f9fe-638c-415f-8dc9-958e3a2c5787"
      ],
      "groups": [
        "3c14c864-533c-49e6-a3cc-6969f1233775"
      ],
      "langs": [
        "de5eda1c-5fb3-46a6-9606-d4554fc5a1d6"
      ],
      "origins": [
        "c8ca9dea-d8b4-48fe-8427-d911653232e9"
      ],
      "series": [
        "3d91b3cf-1935-44a3-ad9a-7b46f038a26e"
      ],
      "singers": [
        "152cc20a-ff2b-4c67-b3ec-8e1d26867368",
        "7f32d821-78ee-4373-a229-0b9a3e16af15",
        "8cf63063-0887-474a-86e0-998f591e19ce",
        "903f07d0-1e3a-4bc5-8b78-6149324690f6"
      ],
      "songtypes": [
        "5e5250d9-351a-4a82-98eb-55db50ad8962"
      ]
    },
    "title": "We're All In This Together",
    "titles": {
      "eng": "We're All In This Together"
    },
    "year": 2006
  }
}