{
  "header": {
    "version": 4,
    "description": "Karaoke Mugen Karaoke Data File"
  },
  "medias": [
    {
      "version": "Default",
      "filename": "ENG - WWE Monday Night RAW - OP2 - I Like It Raw.mp4",
      "audiogain": -8.12,
      "loudnorm": "-6.93,0.17,2.40,-16.99,-0.45",
      "filesize": 13332658,
      "duration": 54,
      "default": true,
      "lyrics": [
        {
          "filename": "ENG - WWE Monday Night RAW - OP2 - I Like It Raw.ass",
          "default": true,
          "version": "Default",
          "subchecksum": "9cacbe50eb1e9796069a24b8c618608e"
        }
      ]
    }
  ],
  "data": {
    "created_at": "2019-03-31T20:24:29.000Z",
    "kid": "107726f0-2df1-4353-9639-a9d91d7a0757",
    "modified_at": "2021-02-25T14:51:00.130Z",
    "repository": "world.karaokes.moe",
    "songorder": 2,
    "tags": {
      "authors": [
        "5a629611-96b4-422c-b309-ba7a58e263a2"
      ],
      "creators": [
        "cb9424d8-75d2-458a-9904-48afacca9d23"
      ],
      "families": [
        "5391f9fe-638c-415f-8dc9-958e3a2c5787"
      ],
      "groups": [
        "24db50aa-a126-4d34-a48a-e45db79c4245"
      ],
      "langs": [
        "de5eda1c-5fb3-46a6-9606-d4554fc5a1d6"
      ],
      "origins": [
        "8dd8d2a4-913a-4b0b-a555-1121cc603a57"
      ],
      "series": [
        "6922a01d-a529-474d-83b8-56d3eb3b60dc"
      ],
      "singers": [
        "13fb046c-fa1d-4bc5-8d85-d384451e96d6"
      ],
      "songtypes": [
        "f02ad9b3-0bd9-4aad-85b3-9976739ba0e4"
      ],
      "songwriters": [
        "13fb046c-fa1d-4bc5-8d85-d384451e96d6"
      ]
    },
    "title": "I Like It Raw",
    "titles": {
      "eng": "I Like It Raw"
    },
    "year": 1995
  }
}