{
  "header": {
    "version": 4,
    "description": "Karaoke Mugen Karaoke Data File"
  },
  "medias": [
    {
      "version": "Default",
      "filename": "ENG - Queen - LIVE - We Will Rock You We Are the Champions.mp4",
      "audiogain": -9.98,
      "loudnorm": "-7.78,1.92,6.40,-17.85,-0.45",
      "filesize": 66267360,
      "duration": 337,
      "default": true,
      "lyrics": [
        {
          "filename": "ENG - Queen - LIVE - We Will Rock You We Are the Champions.ass",
          "default": true,
          "version": "Default",
          "subchecksum": "be56424f7e7be866ecd561aa0e4d5270"
        }
      ]
    }
  ],
  "data": {
    "created_at": "2020-07-09T21:59:15.602Z",
    "kid": "a59216e0-8f89-4d71-8e76-68d8061879be",
    "modified_at": "2021-02-25T14:50:34.152Z",
    "repository": "world.karaokes.moe",
    "tags": {
      "authors": [
        "611aa6ee-ebf8-4ef5-8eed-9f1eaec5117e"
      ],
      "creators": [
        "078ec016-e167-49bf-ba43-af95adfc4c51"
      ],
      "families": [
        "5391f9fe-638c-415f-8dc9-958e3a2c5787"
      ],
      "groups": [
        "7792cc27-9ff9-4d47-9287-2338b7db1575"
      ],
      "langs": [
        "de5eda1c-5fb3-46a6-9606-d4554fc5a1d6"
      ],
      "misc": [
        "86705d4b-24e4-4756-9687-2b9c98bcf366"
      ],
      "singers": [
        "c25013e3-dbc3-4614-bb61-007748729633"
      ],
      "songtypes": [
        "a0167949-580c-4de3-bf13-497e462e02f3"
      ],
      "songwriters": [
        "20cd819d-d273-430c-9894-22eed6d14fb0",
        "7289dbf3-d6d5-461e-8474-8763fa66b693"
      ]
    },
    "title": "We Will Rock You / We Are the Champions",
    "titles": {
      "eng": "We Will Rock You / We Are the Champions"
    },
    "year": 1981
  }
}