{
  "header": {
    "version": 4,
    "description": "Karaoke Mugen Karaoke Data File"
  },
  "medias": [
    {
      "version": "Default",
      "filename": "ENG - High School Musical - MOVIE IN6 - When There Was Me And You.mp4",
      "audiogain": 7.79,
      "loudnorm": "-27.22,-14.11,6.00,-37.45,-1.04",
      "filesize": 46458794,
      "duration": 173,
      "default": true,
      "lyrics": [
        {
          "filename": "ENG - High School Musical - MOVIE IN6 - When There Was Me And You.ass",
          "default": true,
          "version": "Default",
          "subchecksum": "7d3405da7fd4bc9706d6dc83c6627acb"
        }
      ]
    }
  ],
  "data": {
    "created_at": "2020-07-07T09:31:38.148Z",
    "kid": "46125a48-e23c-4bb3-a51c-487f4da10c01",
    "modified_at": "2021-02-25T14:49:05.262Z",
    "repository": "world.karaokes.moe",
    "songorder": 6,
    "tags": {
      "authors": [
        "05c1e4ad-32ba-490e-8f3c-5cd491c96d85"
      ],
      "creators": [
        "c800ba78-ac66-4419-9903-fa8fdb3fc377"
      ],
      "families": [
        "5391f9fe-638c-415f-8dc9-958e3a2c5787"
      ],
      "groups": [
        "3c14c864-533c-49e6-a3cc-6969f1233775"
      ],
      "langs": [
        "de5eda1c-5fb3-46a6-9606-d4554fc5a1d6"
      ],
      "origins": [
        "c8ca9dea-d8b4-48fe-8427-d911653232e9"
      ],
      "series": [
        "3d91b3cf-1935-44a3-ad9a-7b46f038a26e"
      ],
      "singers": [
        "152cc20a-ff2b-4c67-b3ec-8e1d26867368"
      ],
      "songtypes": [
        "5e5250d9-351a-4a82-98eb-55db50ad8962"
      ]
    },
    "title": "When There Was Me And You",
    "titles": {
      "eng": "When There Was Me And You"
    },
    "year": 2006
  }
}