{
  "header": {
    "description": "Karaoke Mugen Tag File",
    "version": 1
  },
  "tag": {
    "i18n": {
      "afr": "Die noorse",
      "amh": "ኖርዌጂያን",
      "ara": "النرويجية",
      "aze": "Norveç",
      "bak": "Норвег теле",
      "bel": "Нарвежская",
      "bul": "Норвежки",
      "ben": "নরওয়েজিয়ান",
      "bos": "Norveški",
      "cat": "El noruec",
      "cze": "Norština",
      "wel": "Norwyaidd",
      "dan": "Norsk",
      "ger": "Norwegisch",
      "gre": "Νορβηγικά",
      "eng": "Norwegian",
      "epo": "Norvega",
      "spa": "Noruega",
      "est": "Norra",
      "baq": "Norvegiako",
      "per": "نروژی",
      "fin": "Norja",
      "fre": "Norvégien",
      "gle": "Ioruais",
      "gla": "Comhairle nan eilean siar",
      "glg": "Coroa",
      "guj": "નોર્વેજીયન બોકમાલ",
      "heb": "נורווגית",
      "hin": "नार्वेजियन",
      "hrv": "Norveški",
      "hat": "Nòvejyen",
      "hun": "Norvég",
      "arm": "Նորվեգերեն",
      "ind": "Norwegia",
      "ice": "Norska",
      "ita": "Norvegese",
      "jpn": "ノルウェー",
      "jav": "Norwegia",
      "geo": "ნორვეგიის",
      "kaz": "Норвег",
      "kan": "ನಾರ್ವೇಜಿಯನ್",
      "kor": "노르웨이",
      "kir": "Норвегия",
      "lat": "Norwegian",
      "lit": "Norvegų",
      "lav": "Norvēģu",
      "mlg": "Norvejiana",
      "mao": "Norwegian",
      "mac": "Норвешка",
      "mal": "നോർവീജിയൻ",
      "mon": "Норвеги",
      "mar": "Norwegian",
      "may": "Norway",
      "mlt": "Norveġiżi",
      "nep": "नर्वे",
      "dut": "Noors",
      "nor": "Norsk",
      "pan": "ਨਾਰਵੇਈ",
      "pol": "Norweski",
      "por": "Norueguês",
      "rum": "Norvegiană",
      "rus": "Норвежский",
      "sin": "නෝර්වේ",
      "slo": "Nórsky",
      "slv": "Norveški",
      "alb": "Norvegjeze",
      "srp": "Норвешки",
      "sun": "Norwegia",
      "swe": "Norska",
      "swa": "Kinorwe",
      "tam": "நோர்வே",
      "tel": "నార్వేజియన్",
      "tgk": "Норвежский",
      "tha": "ษานอร์เวย์",
      "tgl": "Norwegian",
      "tur": "Norveç",
      "tat": "Норвег теле",
      "ukr": "Норвезька",
      "urd": "ناروے",
      "uzb": "Norvegiya",
      "vie": "Na uy",
      "xho": "Isithai",
      "yid": "נאָרוועגיש",
      "chi": "挪威"
    },
    "name": "nor",
    "tid": "ab3a8dd4-c704-4469-befc-285b2e98c121",
    "types": [
      "langs"
    ],
    "repository": "world.karaokes.moe",
    "modified_at": "2020-03-31T19:04:36.749Z"
  }
}