{
  "header": {
    "description": "Karaoke Mugen Tag File",
    "version": 1
  },
  "tag": {
    "i18n": {
      "afr": "Limburgan, Limburgan, Limburger",
      "amh": "Limburgish, Limburgan, Limburger",
      "ara": "الليمبرجيشية ، Limburgan, يمبرجر",
      "aze": "Лимбургский, Keçid, Лимбургер",
      "bak": "Лимбург Теле, Үткәүел, Лимбург",
      "bel": "Limburgan, Пераходны, Лимбургер",
      "bul": "Лимбургский, Преходен, Лимбургер",
      "ben": "লিম্বুর্গিশ, Limburgan, Limburger",
      "bos": "Limburgiš, Limburgan, Mesni",
      "cat": "Limburgish, Limburgan, Limburger",
      "cze": "Limburština, Limburgan, Limburger",
      "wel": "Limburgan, Limburgan, Limburger",
      "dan": "Limburgsk, Limburgan, Limburger",
      "ger": "Limburgisch, Limburgan, Limburger",
      "gre": "Λιμβουργιανά, Limburgan, Τυρί",
      "eng": "Limburgish, Limburgan, Limburger",
      "epo": "Limburgia, Limburganame, Limburger",
      "spa": "Limburgués, Limburgan, Limburger",
      "est": "Limburgi, Limburgan, Limburger",
      "baq": "Limburgish, Limburgan, Limburger",
      "per": "لیمبورگی های Limburgan های لیمبرگر",
      "fin": "Limburgish, Limburgan, Muikku",
      "fre": "Limbourgeois, Limburgan, Limburger",
      "gle": "Limburgan, Liombuirgisname, Limburger",
      "gla": "Limburgish, Limburgan, Limburger",
      "glg": "Limburgan, Limburgan, Limburger",
      "guj": "લિંબૂર્ગિશ, Limburgan, Limburger",
      "heb": "Limburgish, לימבורגיתname, לימבורגר",
      "hin": "Limburgish, Limburgan, Limburger",
      "hrv": "Limburški, Tranzicije, Лимбургер",
      "hat": "Limburgish, Limburgan, Limburger",
      "hun": "Limburgi, Limburgan, Limburger",
      "arm": "Limburgan, Անցումային, Лимбургер",
      "ind": "Limburgia, Limburgan, Limburger",
      "ice": "Limbúrgíska, Limburgan, Limburger",
      "ita": "Limburg, Limburghese, Limburger",
      "jpn": "Limburgishは、Limburganは、Limburger",
      "jav": "Limburgish, Limburgan, Limburger",
      "geo": "ისლანდიური, Limburgan, Limburger",
      "kaz": "Лимбургский, Өтпелі, Лимбургер",
      "kan": "ಲಿಂಬರ್ಗಿಶ್, Limburgan, Limburger",
      "kor": "림,Limburgan,Limburger",
      "kir": "Лимбургский, Өткөөл, Лимбургер",
      "lat": "Limburgish, Limburgan, Limburger",
      "lit": "Limburgish, Limburgan, Limburger",
      "lav": "Krievu Limburgiešu, Limburgan, Limburger",
      "mlg": "Limburgish, Limburgan, Limburger",
      "mao": "Limburgish, Limburgan, Limburger",
      "mac": "Limburgish, Limburgan, Limburger",
      "mal": "Limburgish, ലിമ്ബ്ബൂര്ഗ്ഗന്name, Limburger",
      "mon": "Limburgish, Limburgan, Limburger",
      "mar": "Limburgish, लिम्बर्गनname, Limburger",
      "may": "Limburgan, Limburgan, Limburger",
      "mlt": "}, Limburgan, Limburger",
      "nep": "Limburgish, लिम्बुरगनname, Limburger",
      "dut": "Limburgs, Limburgan, Limburger",
      "nor": "Limburgish, Limburgan, Limburger",
      "pan": "ਲਿਮਬੁਰਗੀ, Limburgan, Limburger",
      "pol": "Limburgijski, Przejściowy, Limburger",
      "por": "Limburguês, Limburgan, Limburger",
      "rum": "Limburgheză, Limburgan, Limburger",
      "rus": "Лимбургский, Переходный, Лимбургер",
      "sin": "Limburgish, Limburgan, Limburger",
      "slo": "Limburský, Limburgan, Limburger",
      "slv": "Limburgish, Grščino, Limburger",
      "alb": "Limburgish, Limburgan, Limburger",
      "srp": "Лимбургский, Прелазни, Лимбургер",
      "sun": "Limburgish, Limburgan, Limburger",
      "swe": "Limburgiska, Limburgan, Limburger",
      "swa": "Kiswahili, Limburgan, Limburger",
      "tam": "லிம்பர்கிஷ், Limburgan, Limburger",
      "tel": "లిమ్బర్గిష్, లింబర్గన్name, Limburger",
      "tgk": "Лимбургский, Давраи Гузариш, Лимбургер",
      "tha": "Limburgish,ภาษาลิมเบอร์กัน Name,Limburger",
      "tgl": "Limburgan, Limburgan, Limburger",
      "tur": "Limburgish, Limburgan, Limburger",
      "tat": "Лимбург Теле, Күчеш, Лимбургер",
      "ukr": "Лімбургійська, Перехідний, Лімбургер",
      "urd": "Limburgan Limburgan, Limburger",
      "uzb": "Limburgish, Limburgan, Limburger",
      "vie": "Tiếng Ba Tư, Limburgan, Tạo",
      "xho": "Limburgish, Limburganname, Limburger",
      "yid": "Limburgish, Limburgan, Limburger",
      "chi": "淋布尔吉文，Limburgan的，林堡"
    },
    "name": "lim",
    "tid": "2fb57d13-6985-4521-9e8b-f37b3e3e57b5",
    "types": [
      "langs"
    ],
    "repository": "world.karaokes.moe",
    "modified_at": "2020-03-31T19:04:35.825Z"
  }
}