{
  "header": {
    "description": "Karaoke Mugen Tag File",
    "version": 1
  },
  "tag": {
    "i18n": {
      "eng": "Ryan Lott"
    },
    "modified_at": "2021-11-21T21:53:39.477Z",
    "name": "Ryan Lott",
    "repository": "world.karaokes.moe",
    "tid": "9687d9f9-f72b-48f3-8048-21864f715480",
    "types": [
      "songwriters"
    ]
  }
}