{
  "header": {
    "description": "Karaoke Mugen Tag File",
    "version": 1
  },
  "tag": {
    "i18n": {
      "eng": "DragonForce"
    },
    "modified_at": "2020-07-10T22:29:01.222Z",
    "name": "DragonForce",
    "repository": "world.karaokes.moe",
    "tid": "417a94e5-46c6-4681-8b19-1d49d5542f19",
    "types": [
      "singers"
    ]
  }
}