{
  "header": {
    "description": "Karaoke Mugen Tag File",
    "version": 1
  },
  "tag": {
    "i18n": {
      "eng": "Stefan Kendal Gordy"
    },
    "modified_at": "2020-07-12T12:12:34.411Z",
    "name": "Stefan Kendal Gordy",
    "repository": "world.karaokes.moe",
    "tid": "2ff69cd9-a55f-44f4-af0d-d063c9667953",
    "types": [
      "songwriters"
    ]
  }
}