{
  "header": {
    "description": "Karaoke Mugen Tag File",
    "version": 1
  },
  "tag": {
    "i18n": {
      "afr": "Noordelike Sami",
      "amh": "በመስጠት ላይ",
      "ara": "السامي الشمالي",
      "aze": "Северносаамский",
      "bak": "Северский",
      "bel": "Northern sami",
      "bul": "Северносаамский",
      "ben": "উত্তরাঞ্চলীয় সামি",
      "bos": "Severni Sami",
      "cat": "Sami Del Nord",
      "cze": "Severní Sami",
      "wel": "Northern Sami",
      "dan": "Nordsamisk",
      "ger": "Nord-Sami",
      "gre": "Βόρεια Σάμι",
      "eng": "Northern Sami",
      "epo": "Northern Sami",
      "spa": "Sami Del Norte",
      "est": "Põhja-Saami",
      "baq": "Iparraldeko Samiera",
      "per": "سامی شمالی",
      "fin": "Pohjois-Sami",
      "fre": "Sami Du Nord",
      "gle": "Sáimis Thuaidh",
      "gla": "Northern Sami",
      "glg": "Sami Do Norte",
      "guj": "નૉર્થન સામી",
      "heb": "צפון סמי",
      "hin": "उत्तरी सामी",
      "hrv": "Северносаамский",
      "hat": "Northern Sami",
      "hun": "Északi Számi",
      "arm": "Northern sami",
      "ind": "Sami Utara",
      "ice": "Norður-Sami",
      "ita": "Sami Del Nord",
      "jpn": "北ヘルシンキ",
      "jav": "Northern Sami",
      "geo": "Northern Sami",
      "kaz": "Солтүстік сами",
      "kan": "ಉತ್ತರ ಸಾಮಿ",
      "kor": "북 Sami",
      "kir": "Северносаамский",
      "lat": "Septentrionali Sami",
      "lit": "Šiaurės Samių",
      "lav": "Ziemeļu Sami",
      "mlg": "Avaratra Sami",
      "mao": "Northern Sami",
      "mac": "Северна Сами",
      "mal": "വടക്കന് സാമി",
      "mon": "Хойд Sami",
      "mar": "उत्तर सामी",
      "may": "Sami Utara",
      "mlt": "Sami",
      "nep": "उत्तरी सामी",
      "dut": "Noordelijk Sami",
      "nor": "Samisk",
      "pan": "ਉੱਤਰੀ ਸਾਮੀ",
      "pol": "Lapoński północny",
      "por": "Sami Do Norte",
      "rum": "Sami De Nord",
      "rus": "Северносаамский",
      "sin": "උතුරු සාමි",
      "slo": "Severná Saamˇ",
      "slv": "V Vendščino",
      "alb": "Veriore Sami",
      "srp": "Северносаамский",
      "sun": "Northern Sami",
      "swe": "Nordsamiska",
      "swa": "Kisami Cha Kaskazini",
      "tam": "வடக்கு சாமி",
      "tel": "ఉత్తర సామి",
      "tgk": "Северносаамский",
      "tha": "ภาษาซามีตอนเหนือ Name",
      "tgl": "Northern Sami",
      "tur": "Kuzey Sami",
      "tat": "Северносаамский",
      "ukr": "Саамська північна",
      "urd": "شمالی سامی",
      "uzb": "Shimoliy Sami",
      "vie": "Bắc Sami",
      "xho": "Emntla Sami",
      "yid": "Northern Sami",
      "chi": "北萨米"
    },
    "name": "sme",
    "tid": "0c160c14-115a-4fa9-b6b6-bc576f76d74c",
    "types": [
      "langs"
    ],
    "repository": "world.karaokes.moe",
    "modified_at": "2020-03-31T19:04:37.643Z"
  }
}