{
  "header": {
    "description": "Karaoke Mugen Tag File",
    "version": 1
  },
  "tag": {
    "i18n": {
      "eng": "Bee Gees"
    },
    "modified_at": "2020-06-01T21:49:48.813Z",
    "name": "Bee Gees",
    "repository": "world.karaokes.moe",
    "tid": "d5ae44c6-9915-4ff0-9f59-a650518a0d5e",
    "types": [
      "singers"
    ]
  }
}