{
  "header": {
    "version": 4,
    "description": "Karaoke Mugen Karaoke Data File"
  },
  "medias": [
    {
      "version": "Default",
      "filename": "FRE - Lorenzo - MV - Je vous deteste tous.mp4",
      "audiogain": -2.95,
      "loudnorm": "-13.86,-3.95,6.80,-24.09,-1.05",
      "filesize": 57173387,
      "duration": 139,
      "default": true,
      "lyrics": [
        {
          "filename": "FRE - Lorenzo - MV - Je vous deteste tous.ass",
          "default": true,
          "version": "Default",
          "subchecksum": "a16e583717ec260e1ad7d3c60fac1b4a"
        }
      ]
    }
  ],
  "data": {
    "created_at": "2020-07-03T14:27:32.935Z",
    "kid": "1017ebba-4b7d-4500-9259-a7dc575d9427",
    "modified_at": "2021-02-25T14:52:06.452Z",
    "repository": "world.karaokes.moe",
    "tags": {
      "authors": [
        "05c1e4ad-32ba-490e-8f3c-5cd491c96d85"
      ],
      "creators": [
        "a7a837ee-91f6-4941-883f-824807a5b4c2"
      ],
      "families": [
        "0377db02-3af6-43b8-9b08-c759df3d25c3"
      ],
      "groups": [
        "8e209ae4-4381-438f-89dc-1b21752027d2"
      ],
      "langs": [
        "fd8072b7-4d9b-45d4-8f5b-a931a830edef"
      ],
      "singers": [
        "83296ad4-3be2-4463-b544-638cb240df58"
      ],
      "songtypes": [
        "7be1b15c-cff8-4b37-a649-5c90f3d569a9"
      ],
      "songwriters": [
        "2965bb9c-778d-4961-acd4-3f4b4cc6b866"
      ]
    },
    "title": "Je vous déteste tous",
    "titles": {
      "eng": "Je vous déteste tous"
    },
    "year": 2020
  }
}