{
  "header": {
    "description": "Karaoke Mugen Tag File",
    "version": 1
  },
  "tag": {
    "i18n": {
      "eng": "Movie",
      "fre": "Film"
    },
    "karafile_tag": "MOVIE",
    "name": "Movie",
    "tid": "c8ca9dea-d8b4-48fe-8427-d911653232e9",
    "types": [
      "origins"
    ],
    "short": "MOV",
    "repository": "world.karaokes.moe",
    "modified_at": "2020-03-31T19:04:36.510Z"
  }
}
