{
  "header": {
    "description": "Karaoke Mugen Tag File",
    "version": 1
  },
  "tag": {
    "i18n": {
      "eng": "Park Jai-Sang"
    },
    "name": "Park Jai-Sang",
    "repository": "world.karaokes.moe",
    "tid": "aea49184-0d9f-4af0-a9c4-0cfc8b3cf305",
    "types": [
      "songwriters"
    ]
  }
}