{
  "header": {
    "description": "Karaoke Mugen Tag File",
    "version": 1
  },
  "tag": {
    "i18n": {
      "eng": "Tatoon"
    },
    "name": "Tatoon",
    "repository": "world.karaokes.moe",
    "tid": "faa8becc-83b6-45d9-a3d0-a4c2c8b336c8",
    "types": [
      "authors"
    ]
  }
}