{
  "header": {
    "description": "Karaoke Mugen Tag File",
    "version": 1
  },
  "tag": {
    "i18n": {
      "eng": "Vincent Desagnat"
    },
    "modified_at": "2020-06-21T20:59:02.969Z",
    "name": "Vincent Desagnat",
    "repository": "world.karaokes.moe",
    "tid": "157e9924-7776-49a2-8543-e914724a98d9",
    "types": [
      "songwriters"
    ]
  }
}