{
  "header": {
    "description": "Karaoke Mugen Tag File",
    "version": 1
  },
  "tag": {
    "i18n": {
      "eng": "Lucas Grabeel"
    },
    "modified_at": "2020-07-06T06:48:51.291Z",
    "name": "Lucas Grabeel",
    "repository": "world.karaokes.moe",
    "tid": "903f07d0-1e3a-4bc5-8b78-6149324690f6",
    "types": [
      "singers"
    ]
  }
}