{
  "header": {
    "description": "Karaoke Mugen Tag File",
    "version": 1
  },
  "tag": {
    "i18n": {
      "eng": "Liquid State Limited"
    },
    "modified_at": "2021-11-13T12:57:59.704Z",
    "name": "Liquid State Limited",
    "repository": "world.karaokes.moe",
    "tid": "54df334c-0860-4a2e-8c82-2c43354d4645",
    "types": [
      "creators"
    ]
  }
}