{
    "patientName": "Ram Kapoor",
    "policyNumber": "1846828",
    "age": 30,
    "gender": "MALE",
    "medicalIdCard": "MAD123456",
    "policyName": "Bajaj Allianz Health Guard Silver Plan",
    "policyType": "INDIVIDUAL",
    "policyInceptionDate": "2012-01-17T00:00:00.000Z",
    "policyStartDate": "2019-01-17T00:00:00.000Z",
    "policyEndDate": "2020-01-17T00:00:00.000Z",
    "coPayPercentage": 10,
    "sumInsured": 500000,
    "cumulativeBonus": 0,
    "premiumPaymentZone": "ZONE_A",
    "claimHistory": "{\"claimNumber\":\"481790000123\", \"status\": \"Settled\", \"intimationDate\": \"1917-04-10T00:00:00.000Z\", \"illness\": \"Cataract\",\"details\": \"LEFT\", \"value\":\"232000\"}",
    "preExistingDisease": "Diabetes,Hypertension"
}
