{
    "patientName": "Sushma Singh",
    "policyNumber": "481800160098",
    "age": 54,
    "dob": "1964-04-22T00:00:00.000Z",
    "gender": "FEMALE",
    "medicalIdCard": "BAGI11800138005",
    "policyName": "Bajaj Allianz Health Guard Silver Plan",
    "policyType": "INDIVIDUAL",
    "policyInceptionDate": "2016-08-27T00:00:00.000Z",
    "policyStartDate": "2018-08-27T00:00:00.000Z",
    "policyEndDate": "2019-11-12T00:00:00.000Z",
    "coPayPercentage": 0,
    "sumInsured": 400000,
    "cumulativeBonus": 0,
    "premiumPaymentZone": "ZONE_A",
    "preExistingDisease": "Fibroids"
}
