{
    "patientName": "Ranjit Kapoor",
    "policyNumber": "481700298607",
    "age": 66,
    "dob": "1952-12-23T00:00:00.000Z",
    "gender": "MALE",
    "medicalIdCard": "BAGI11700216353",
    "policyName": "Bajaj Allianz Health Guard Silver Plan",
    "policyType": "INDIVIDUAL",
    "policyInceptionDate": "2015-08-10T00:00:00.000Z",
    "policyStartDate": "2017-08-10T00:00:00.000Z",
    "policyEndDate": "2019-08-10T00:00:00.000Z",
    "coPayPercentage": 0,
    "sumInsured": 200000,
    "cumulativeBonus": 0,
    "premiumPaymentZone": "ZONE_A"
}
