{
    "patientName": "Rajesh Singla",
    "policyNumber": "461800000063",
    "age": 29,
    "dob": "1989-05-23T00:00:00.000Z",
    "gender": "MALE",
    "medicalIdCard": "BAGI1800418357",
    "policyName": "Comprehensive Care Plan",
    "policyType": "CORPORATE",
    "policyInceptionDate": "2019-03-02T00:00:00.000Z",
    "policyStartDate": "2019-03-02T00:00:00.000Z",
    "policyEndDate": "2020-03-01T00:00:00.000Z",
    "coPayPercentage": 0,
    "sumInsured": 200000,
    "cumulativeBonus": 0,
    "premiumPaymentZone": "ZONE_A"
}
