{
    "patientName": "Sayan Mukherjee",
    "policyNumber": "481800320076",
    "age": 67,
    "dob": "1951-03-29T00:00:00.000Z",
    "gender": "MALE",
    "medicalIdCard": "BAGI11800408006",
    "policyName": "Bajaj Allianz Health Guard Silver Plan",
    "policyType": "INDIVIDUAL",
    "policyInceptionDate": "2015-11-13T00:00:00.000Z",
    "policyStartDate": "2018-11-13T00:00:00.000Z",
    "policyEndDate": "2019-11-13T00:00:00.000Z",
    "coPayPercentage": 0,
    "sumInsured": 300000,
    "cumulativeBonus": 90000,
    "premiumPaymentZone": "ZONE_A"
}
