{
    "patientName": "Devika Ashok",
    "policyNumber": "481800210034",
    "age": 55,
    "dob": "1963-06-06T00:00:00.000Z",
    "gender": "FEMALE",
    "medicalIdCard": "BAGI11800208064",
    "policyName": "Bajaj Allianz Health Guard Silver Plan",
    "policyType": "INDIVIDUAL",
    "policyInceptionDate": "2016-12-09T00:00:00.000Z",
    "policyStartDate": "2018-12-09T00:00:00.000Z",
    "policyEndDate": "2020-12-09T00:00:00.000Z",
    "coPayPercentage": 0,
    "sumInsured": 100000,
    "cumulativeBonus": 20000,
    "premiumPaymentZone": "ZONE_B",
    "claimHistory": "{\"claimNumber\":\"481890000009\", \"status\": \"Rejected\", \"intimationDate\": \"1918-04-02T00:00:00.000Z\", \"illness\": \"Cataract\", \"details\": \"BOTH\", \"value\":\"40000\"}",
    "preExistingDisease": "Hypertension"
}
