{
    "patientName": "Rahul Agrawal",
    "policyNumber": "481800126789",
    "age": 42,
    "dob": "1976-01-10T00:00:00.000Z",
    "gender": "MALE",
    "medicalIdCard": "BAGI1800213413",
    "policyName": "Health Guard Silver Plan",
    "policyType": "INDIVIDUAL",
    "policyInceptionDate": "2009-10-20T00:00:00.000Z",
    "policyStartDate": "2018-10-20T00:00:00.000Z",
    "policyEndDate": "2019-10-20T00:00:00.000Z",
    "coPayPercentage": 0,
    "sumInsured": 300000,
    "cumulativeBonus": 150000,
    "premiumPaymentZone": "ZONE_A"
}
