{
    "patientName": "Amitabh Sharma",
    "policyNumber": "481800215432",
    "age": 64,
    "dob": "1954-12-10T00:00:00.000Z",
    "gender": "MALE",
    "medicalIdCard": "BAGI11800416392",
    "policyName": "Bajaj Allianz Health Guard Silver Plan",
    "policyType": "INDIVIDUAL",
    "policyInceptionDate": "2012-02-01T00:00:00.000Z",
    "policyStartDate": "2019-02-01T00:00:00.000Z",
    "policyEndDate": "2020-02-01T00:00:00.000Z",
    "coPayPercentage": 10,
    "sumInsured": 200000,
    "cumulativeBonus": 0,
    "premiumPaymentZone": "ZONE_B",
    "claimHistory": "{\"claimNumber\":\"481690000520\", \"status\": \"Settled\", \"intimationDate\": \"1916-02-20T00:00:00.000Z\", \"illness\": \"Cataract\", \"details\": \"LEFT\", \"value\":\"39000\"}",
    "preExistingDisease": "Diabetes"
}
