{
    "patientName": "Lakshmi Mittal",
    "policyNumber": "481700214623",
    "age": 67,
    "dob": "1950-07-17T00:00:00.000Z",
    "gender": "FEMALE",
    "medicalIdCard": "BAGI11700516341",
    "policyName": "Bajaj Allianz Health Guard Silver Plan",
    "policyType": "INDIVIDUAL",
    "policyInceptionDate": "2016-03-13T00:00:00.000Z",
    "policyStartDate": "2018-03-13T00:00:00.000Z",
    "policyEndDate": "2019-03-13T00:00:00.000Z",
    "coPayPercentage": 0,
    "sumInsured": 30000,
    "cumulativeBonus": 0,
    "premiumPaymentZone": "ZONE_A",
    "claimHistory": "{\"claimNumber\":\"481790000415\", \"status\": \"Settled\", \"intimationDate\": \"1917-07-13T00:00:00.000Z\", \"illness\": \"Cataract\", \"details\": \"LEFT\", \"value\":\"35000\"}",
    "preExistingDisease": "Hypertension, High Cholesterol"
}
