{
    "patientName": "Leena S Roy",
    "policyNumber": "481800320001",
    "age": 66,
    "dob": "1952-01-30T00:00:00.000Z",
    "gender": "FEMALE",
    "medicalIdCard": "BAGI11800408007",
    "policyName": "Bajaj Allianz Health Guard Silver Plan",
    "policyType": "INDIVIDUAL",
    "policyInceptionDate": "2015-10-03T00:00:00.000Z",
    "policyStartDate": "2018-10-03T00:00:00.000Z",
    "policyEndDate": "2019-10-03T00:00:00.000Z",
    "coPayPercentage": 0,
    "sumInsured": 400000,
    "cumulativeBonus": 120000,
    "premiumPaymentZone": "ZONE_A",
    "preExistingDisease": "Diabetes,Osteoarthritis"
}
