{
    "patientName": "Melvick D'Souza",
    "policyNumber": "481700320019",
    "age": 67,
    "dob": "1950-08-03T00:00:00.000Z",
    "gender": "MALE",
    "medicalIdCard": "BAGI11700408089",
    "policyName": "Bajaj Allianz Health Guard Silver Plan",
    "policyType": "INDIVIDUAL",
    "policyInceptionDate": "2014-09-30T00:00:00.000Z",
    "policyStartDate": "2017-09-30T00:00:00.000Z",
    "policyEndDate": "2020-09-28T00:00:00.000Z",
    "coPayPercentage": 10,
    "sumInsured": 500000,
    "cumulativeBonus": 0,
    "premiumPaymentZone": "ZONE_A",
    "claimHistory": "{\"claimNumber\":\"481790000123\", \"status\": \"Settled\", \"intimationDate\": \"1917-04-10T00:00:00.000Z\", \"illness\": \"CABG\", \"value\":\"232000\"}",
    "preExistingDisease": "Osteoarthritis"
}
