\version "2.16.1"

#(set-global-staff-size 14)



\relative c'' {
<<
\new Staff { \clef "treble"   
                     \key f\major
                      \tempo "Vivace"
                      \time 3/4
                      
                      % Voice 1
                  }
\new Staff { \clef "treble" 
                     \key f\major
                        % Voice 2
                       
                  }
>>
}
