 
\version "2.16.1"
 
#(set-global-staff-size 14)
 
 
\relative c'' {
  \clef treble
  \key c\major
   \tempo "1. Allegro moderato"
  \time 4/4
    c4. d8 d4 e8 g
    a, f'4 d8 \grace f16 \times 2/3 {e16[ d c]} c8 r
}


\relative c'' {
  \clef treble
  \key c\major	
   \tempo "2. Allegro"
  \time 2/2
  \partial 8

}

\relative c'' {
  \clef treble
  \key c\major	
   \tempo "3. Largo"
  \time 6/8
  \partial 8

}

\relative c'' {
  \clef treble
  \key c\major	
   \tempo "4. Menuett"
  \time 3/4
  \partial 4
  
}