\version "2.16.1"

#(set-global-staff-size 14)
\layout {
   ident = #0
   line-width = #250
   ragged-last = ##t
}

\paper {
   ragged-bottom = ##t        % "Flatterrand" unten
   ragged-right = ##t         % "Flatterrand" rechts
   print-page-number = ##f    % "Keine Seitenzahlen drucken
}


\markuplist {
    \wordwrap-lines {
    \fontsize #3
    "Concerto I " 
    }
    \vspace #1.5
}

\relative c'' {
  \clef treble
  \key f\major
   \tempo "1. o.Bez."
  \time 4/4
  \partial 8
  c8
  a16 f c' a  f'8 c  d8. e32 f  c8 f,
}

\pageBreak

\markuplist {
    \wordwrap-lines {
    \fontsize #3
    "Concerto II " 
    }
    \vspace #1.5
}


\relative c'' {
  \clef treble
  \key g\minor
   \tempo "1. o.Bez."
  \time 2/2
  d8 g, g es'  \grace es8 d4. a'8
  d, g, g es'
}


