\version "2.16.1"

#(set-global-staff-size 14)


\relative c'' {
  \clef treble
  \key g\major
   \tempo "1. Allegro molto"
  \time 4/4
  \override TupletBracket #'stencil = ##f
  \override TupletNumber #'stencil = ##f
  \times 2/3 { g8 b a} \times 2/3 { g8 b a}  g4 r8 e'
  e d d2 d4
  \times 2/3 { g,8 b a} 
}
