 
\version "2.16.1"
 
#(set-global-staff-size 14)
 
\markuplist {
    \wordwrap-lines {
    \fontsize #3
    "March" 
    }
    \vspace #1.5
}


\relative c'' {
  \clef treble
  \key g\major
   \tempo ""
  \time 2/2
  \partial 4
  g4 d' d8 d d4 g
  fis4. e8 d c b a
  g fis g a fis4
}
