 
\version "2.16.1"
 
#(set-global-staff-size 14)
 
 
\relative c'' {
  \clef treble
  \key f\major
   \tempo "1. o.Bez."
  \time 2/2
    f8 c a f d' d~ d16[ f e f]
    c8[ c~] c16 e f a, bes8 d c16[ g a bes]
}


\relative c'' {
  \clef treble
  \key c\major	
   \tempo "2. Allegro"
  \time 2/2
  \partial 8

}

\relative c'' {
  \clef treble
  \key c\major	
   \tempo "3. Largo"
  \time 6/8
  \partial 8

}

\relative c'' {
  \clef treble
  \key c\major	
   \tempo "4. Menuett"
  \time 3/4
  \partial 4
  
}