1656330373380,    57.2,     2022-06-27,  13:46:13
1656330385001,    57.9,     2022-06-27,  13:46:24
1656331944022,    88.1,     2022-06-27,  14:12:24
1656332179424,    30.7,     2022-06-27,  14:16:19
