<svg xmlns="http://www.w3.org/2000/svg" xmlns:xlink="http://www.w3.org/1999/xlink" version="1.1" baseProfile="full" viewBox="0 0 200 200" width="50" height="50">
<g fill="white">
<path d="M 130.2 183.7 L 112.0 182.5 L 97.0 180.6 L 84.7 177.7 L 74.9 173.9 L 67.0 169.2 L 61.0 163.7 L 56.3 157.3 L 54.15256481170654 153.12443151474 L 52.0 155.4 L 48.6 158.9 L 45.0 162.3 L 37.8 168.7 L 34.3 171.8 L 30.7 174.8 L 27.2 177.7 L 23.444505500793458 180.70439558029176 L 23.5 184.7 L 20.2 183.3 L 11.7 174.6 L 13.4 173.4 L 17.2 171.2 L 28.9 164.3 L 41.2 157.1 L 44.0 155.60232553482055 L 44.0 95.0 L 14.0 95.0 L 14.0 91.0 L 44.0 91.0 L 50.0 86.0 L 61.0 95.0 L 56.0 99.0 L 56.0 151.03207550048828 L 59.6 154.7 L 65.0 159.3 L 70.9 163.1 L 78.1 166.2 L 87.1 168.7 L 98.4 170.4 L 112.7 171.5 L 130.4 171.9 L 151.9 171.5 L 177.7 170.4 L 189.0 169.9 L 178.2 183.5 L 152.1 184.0 Z M 99.0 131.0 L 148.0 131.0 L 154.0 126.0 L 165.0 135.0 L 160.0 139.0 L 160.0 157.0 L 148.0 163.0 L 148.0 155.0 L 99.0 155.0 L 99.0 158.0 L 87.0 164.0 L 87.0 125.0 Z M 99.0 135.0 L 99.0 151.0 L 148.0 151.0 L 148.0 135.0 Z M 113.6 105.8 L 114.4 109.3 L 110.5827338218689 108.4820143699646 L 110.0 109.0 L 106.2 112.2 L 102.0 115.2 L 97.6 118.2 L 93.0 121.1 L 88.0 123.9 L 82.8 126.6 L 77.4 129.2 L 71.5 131.6 L 65.4 133.7 L 64.5 132.2 L 69.7 128.3 L 74.7 124.6 L 79.4 121.0 L 83.9 117.6 L 88.1 114.2 L 92.0 110.8 L 95.7 107.4 L 99.0 104.1 L 102.1 100.8 L 104.25152702331543 98.34111194610595 L 104.2 98.3 L 105.2 97.2 Z M 181.0 106.0 L 183.0 106.0 L 181.0 115.0 L 183.4 116.6 L 185.0 119.0 L 183.4 121.4 L 181.0 123.0 L 149.6 123.0 L 147.3 122.8 L 145.0 122.3 L 142.9 121.3 L 140.9 120.0 L 139.2 118.2 L 137.9 116.2 L 136.9 113.9 L 136.3 111.5 L 136.0 109.0 L 136.0 97.0 L 148.0 99.0 L 151.0 101.0 L 148.0 102.8 L 148.0 109.0 L 147.8 110.2 L 147.8 111.9 L 147.9 112.5 L 148.0 112.9 L 148.2 113.4 L 148.7 113.8 L 149.4 114.3 L 150.5 114.7 L 152.0 115.0 L 177.0 115.0 Z M 76.5 94.2 L 77.1 96.9 L 77.4 99.8 L 77.2 102.7 L 76.7 105.7 L 75.9 108.7 L 74.6 111.7 L 70.8 114.2 L 66.3 113.5 L 63.8 109.7 L 64.5 105.2 L 66.0 103.6 L 67.2 101.9 L 68.3 100.2 L 69.1 98.5 L 69.8 96.7 L 70.3 94.7 L 70.6 92.5 L 70.7 90.2 L 70.5 87.7 L 69.6 85.3 L 71.2 84.4 L 72.7 86.8 L 74.3 89.1 L 75.0 90.44615383148194 L 75.0 90.0 L 117.0 90.0 L 117.0 78.0 L 129.0 80.0 L 132.0 82.0 L 129.0 83.8 L 129.0 90.0 L 169.0 90.0 L 169.54146337509155 89.54878044128418 L 169.6 89.3 L 169.75052757263182 89.37456035614014 L 175.0 85.0 L 186.0 94.0 L 181.0 97.0 L 176.81538457870482 98.74358978271485 L 174.7 101.0 L 173.0 102.6 L 171.3 104.3 L 169.5 106.0 L 167.5 107.7 L 165.4 109.4 L 163.7 111.5 L 162.2 110.4 L 163.6 108.1 L 164.4 105.6 L 165.3 103.2 L 166.1 100.9 L 166.9 98.8 L 167.6 96.7 L 168.2 94.7 L 168.38421049118043 94.0 L 76.4307692527771 94.0 Z M 131.8 20.7 L 132.7 24.2 L 128.2933734893799 23.34959840774536 L 128.1 23.5 L 126.2 24.9 L 122.2 27.7 L 120.1 29.0 L 118.0 30.4 L 115.9 31.7 L 115.3692307472229 32.0 L 156.0 32.0 L 162.0 27.0 L 173.0 36.0 L 168.0 40.0 L 168.0 76.0 L 156.0 82.0 L 156.0 76.0 L 92.0 76.0 L 80.0 82.0 L 80.0 26.0 L 92.0 32.0 L 111.33999996185302 32.0 L 111.9 31.3 L 113.1 29.0 L 114.4 26.8 L 115.6 24.7 L 116.9 22.6 L 121.7 14.6 L 122.26565465927123 13.622960186004638 L 122.1 13.5 L 122.74285717010498 12.798701286315918 L 122.8 12.7 L 122.81836738586426 12.71632652282715 L 123.2 12.3 Z M 92.0 63.0 L 92.0 72.0 L 156.0 72.0 L 156.0 63.0 Z M 46.0 50.2 L 44.0 47.2 L 41.8 44.2 L 39.3 41.2 L 36.6 38.2 L 33.7 35.2 L 30.5 32.2 L 27.1 29.2 L 23.4 26.2 L 24.3 24.6 L 28.8 26.4 L 33.1 28.2 L 37.2 30.3 L 41.1 32.7 L 44.8 35.2 L 48.2 37.9 L 51.4 40.7 L 54.4 43.8 L 57.1 47.0 L 59.6 50.3 L 60.2 54.9 L 57.5 58.5 L 52.9 59.1 L 49.3 56.4 L 47.7 53.3 Z M 92.0 49.0 L 92.0 59.0 L 156.0 59.0 L 156.0 49.0 Z M 92.0 36.0 L 92.0 45.0 L 156.0 45.0 L 156.0 36.0 Z " />
</g>
</svg>
