<svg xmlns="http://www.w3.org/2000/svg" xmlns:xlink="http://www.w3.org/1999/xlink" version="1.1" baseProfile="full" viewBox="0 0 200 200" width="50" height="50">
<g fill="white">
<path d="M 130.7 183.7 L 112.3 182.6 L 97.2 180.8 L 85.0 178.1 L 75.1 174.6 L 67.2 170.3 L 61.1 165.3 L 56.4 159.6 L 54.27821521759033 155.8868766784668 L 52.0 158.1 L 48.4 161.5 L 44.9 164.6 L 41.3 167.7 L 37.7 170.6 L 26.9 178.7 L 23.323113918304443 181.18394861221313 L 23.1 185.2 L 19.8 183.6 L 12.1 174.3 L 13.8 173.3 L 17.6 171.4 L 21.4 169.6 L 29.2 165.6 L 33.2 163.6 L 37.2 161.5 L 44.0 158.1 L 44.0 109.0 L 14.0 109.0 L 14.0 105.0 L 44.0 105.0 L 50.0 100.0 L 61.0 109.0 L 56.0 113.0 L 56.0 153.70384616851806 L 59.5 156.8 L 64.9 160.7 L 70.8 164.1 L 78.0 166.8 L 87.1 169.0 L 98.6 170.6 L 113.0 171.6 L 130.9 171.9 L 152.6 171.5 L 178.7 170.4 L 190.0 169.9 L 179.2 183.5 L 152.9 184.0 Z M 170.4 145.8 L 168.8 147.6 L 167.0 149.3 L 165.0 150.7 L 162.8 151.9 L 160.6 152.7 L 158.2 153.4 L 155.7 153.7 L 153.2 153.9 L 153.2 147.9 L 133.2 144.9 L 133.2 141.9 L 153.2 141.9 L 154.6 141.8 L 155.8 141.6 L 156.9 141.3 L 157.8 141.0 L 159.4 140.0 L 160.2 139.3 L 160.9 138.4 L 161.6 137.4 L 162.2 136.2 L 163.0 133.8 L 164.0 129.3 L 164.9 122.8 L 165.7 114.5 L 166.4 104.5 L 167.0 92.7 L 167.5 79.3 L 167.8 64.2 L 168.0 47.3 L 168.0 30.9 L 125.93191490173339 30.9 L 125.2 52.4 L 123.5 72.8 L 120.6 90.4 L 116.7 105.4 L 111.7 118.3 L 105.5 129.2 L 98.1 138.4 L 89.6 146.0 L 79.9 152.5 L 69.2 158.0 L 68.3 156.4 L 77.8 149.3 L 86.0 142.0 L 93.1 134.1 L 99.0 125.2 L 103.9 114.9 L 107.8 102.8 L 110.8 88.5 L 112.8 71.7 L 113.9 51.9 L 113.99130430221558 30.9 L 74.8 30.9 L 74.8 26.9 L 168.0 26.9 L 174.0 21.9 L 185.0 30.9 L 180.0 33.9 L 180.0 47.4 L 179.8 64.4 L 179.4 79.6 L 179.0 93.2 L 178.4 105.2 L 177.7 115.5 L 176.8 124.2 L 175.8 131.3 L 174.6 137.0 L 173.0 141.5 L 171.8 143.7 Z M 38.3 77.2 L 36.1 74.7 L 33.7 72.2 L 31.2 69.7 L 28.5 67.3 L 25.7 65.0 L 22.8 62.6 L 19.8 60.3 L 16.5 58.2 L 17.2 56.5 L 21.1 57.6 L 24.9 58.6 L 28.6 60.0 L 32.2 61.5 L 35.7 63.3 L 39.1 65.2 L 42.4 67.3 L 45.5 69.6 L 48.6 72.1 L 51.5 74.7 L 52.9 79.1 L 50.9 83.2 L 46.6 84.6 L 42.5 82.6 L 40.5 79.9 Z M 47.9 41.9 L 46.0 39.3 L 43.9 36.8 L 41.6 34.3 L 39.1 31.8 L 36.5 29.4 L 33.7 26.9 L 30.7 24.4 L 27.5 22.2 L 28.2 20.6 L 32.1 21.8 L 35.9 23.1 L 39.5 24.6 L 43.0 26.2 L 46.4 28.1 L 49.6 30.2 L 52.7 32.4 L 55.6 34.7 L 58.3 37.3 L 61.0 40.0 L 62.0 44.4 L 59.8 48.4 L 55.3 49.4 L 51.4 47.2 L 49.7 44.5 Z " />
</g>
</svg>
