<svg xmlns="http://www.w3.org/2000/svg" xmlns:xlink="http://www.w3.org/1999/xlink" version="1.1" baseProfile="full" viewBox="0 0 200 200" width="200" height="200">
<g fill="black">
<path d="M 130.7 183.7 L 112.3 182.6 L 97.2 180.8 L 85.0 178.1 L 75.1 174.6 L 67.2 170.3 L 61.1 165.3 L 56.4 159.6 L 54.27821521759033 155.8868766784668 L 52.0 158.1 L 48.4 161.5 L 44.9 164.6 L 41.3 167.7 L 37.7 170.6 L 26.9 178.7 L 23.323113918304443 181.18394861221313 L 23.1 185.2 L 19.8 183.6 L 12.1 174.3 L 13.8 173.3 L 17.6 171.4 L 21.4 169.6 L 29.2 165.6 L 33.2 163.6 L 37.2 161.5 L 44.0 158.1 L 44.0 109.0 L 14.0 109.0 L 14.0 105.0 L 44.0 105.0 L 50.0 100.0 L 61.0 109.0 L 56.0 113.0 L 56.0 153.70384616851806 L 59.5 156.8 L 64.9 160.7 L 70.8 164.1 L 78.0 166.8 L 87.0 168.97582416534425 L 87.0 125.0 L 99.0 131.0 L 148.0 131.0 L 154.0 126.0 L 165.0 135.0 L 160.0 139.0 L 160.0 162.0 L 148.0 168.0 L 148.0 160.0 L 99.0 160.0 L 99.0 163.0 L 87.03259258270263 168.98370370864868 L 87.1 169.0 L 98.6 170.6 L 113.0 171.6 L 130.9 171.9 L 152.6 171.5 L 178.7 170.4 L 190.0 169.9 L 179.2 183.5 L 152.9 184.0 Z M 99.0 135.0 L 99.0 156.0 L 148.0 156.0 L 148.0 135.0 Z M 185.0 119.0 L 183.4 121.4 L 181.0 123.0 L 149.6 123.0 L 147.3 122.8 L 145.0 122.3 L 142.9 121.3 L 140.9 120.0 L 139.2 118.2 L 137.9 116.2 L 136.9 113.9 L 136.3 111.5 L 136.0 109.0 L 136.0 94.0 L 115.88064517974854 94.0 L 115.1 95.1 L 111.3 100.3 L 107.3 105.2 L 103.0 109.9 L 98.4 114.2 L 93.6 118.3 L 88.5 122.1 L 83.1 125.6 L 77.5 128.8 L 71.6 131.5 L 65.4 133.7 L 64.5 132.2 L 69.7 128.2 L 74.6 124.3 L 79.2 120.3 L 83.7 116.2 L 87.8 112.1 L 91.8 107.7 L 95.4 103.3 L 98.8 98.6 L 101.77083330154419 94.0 L 76.4307692527771 94.0 L 76.5 94.2 L 77.1 96.9 L 77.4 99.8 L 77.2 102.7 L 76.7 105.7 L 75.9 108.7 L 74.6 111.7 L 70.8 114.2 L 66.3 113.5 L 63.8 109.7 L 64.5 105.2 L 66.0 103.6 L 67.2 101.9 L 68.3 100.2 L 69.1 98.5 L 69.8 96.7 L 70.3 94.7 L 70.6 92.5 L 70.7 90.2 L 70.5 87.7 L 69.6 85.3 L 71.2 84.4 L 72.7 86.8 L 74.3 89.1 L 75.0 90.44615383148194 L 75.0 90.0 L 169.0 90.0 L 169.54146337509155 89.54878044128418 L 169.6 89.3 L 169.75052757263182 89.37456035614014 L 175.0 85.0 L 186.0 94.0 L 181.0 97.0 L 176.81538457870482 98.74358978271485 L 174.7 101.0 L 173.0 102.6 L 171.3 104.3 L 169.5 106.0 L 167.5 107.7 L 165.4 109.4 L 163.7 111.5 L 162.2 110.4 L 163.6 108.1 L 164.4 105.6 L 165.3 103.2 L 166.1 100.9 L 166.9 98.8 L 167.6 96.7 L 168.2 94.7 L 168.38421049118043 94.0 L 148.0 94.0 L 148.0 109.0 L 147.8 110.2 L 147.8 111.9 L 147.9 112.5 L 148.0 112.9 L 148.2 113.4 L 148.7 113.8 L 149.4 114.3 L 150.5 114.7 L 152.0 115.0 L 181.0 115.0 L 183.4 116.6 Z M 38.3 77.2 L 36.1 74.7 L 33.7 72.2 L 31.2 69.7 L 28.5 67.3 L 25.7 65.0 L 22.8 62.6 L 19.8 60.3 L 16.5 58.2 L 17.2 56.5 L 21.1 57.6 L 24.9 58.6 L 28.6 60.0 L 32.2 61.5 L 35.7 63.3 L 39.1 65.2 L 42.4 67.3 L 45.5 69.6 L 48.6 72.1 L 51.5 74.7 L 52.9 79.1 L 50.9 83.2 L 46.6 84.6 L 42.5 82.6 L 40.5 79.9 Z M 129.3 17.6 L 131.4 20.6 L 126.42122449874878 21.47346935272217 L 124.8 23.5 L 123.4 25.0 L 122.1 26.5 L 120.6 28.1 L 119.0 29.6 L 118.0 30.6 L 153.7 30.6 L 159.7 25.6 L 170.7 34.6 L 165.7 38.6 L 165.7 76.3 L 153.7 82.3 L 153.7 74.3 L 93.2 74.3 L 93.2 77.3 L 81.2 83.3 L 81.2 24.6 L 93.2 30.6 L 115.25 30.6 L 115.5 30.1 L 115.9 27.9 L 116.3 25.8 L 116.7 23.8 L 117.3 20.0 L 117.6 18.2 L 117.8 16.5 L 118.0 14.9 L 118.03549489974975 14.367576789855956 L 117.8 14.3 L 118.09690723419189 13.446391773223876 L 118.1 13.4 L 118.1115385055542 13.404326915740967 L 118.6 12.0 Z M 93.2 54.1 L 93.2 70.3 L 153.7 70.3 L 153.7 54.1 Z M 93.2 34.6 L 93.2 50.1 L 153.7 50.1 L 153.7 34.6 Z M 47.9 41.9 L 46.0 39.3 L 43.9 36.8 L 41.6 34.3 L 39.1 31.8 L 36.5 29.4 L 33.7 26.9 L 30.7 24.4 L 27.5 22.2 L 28.2 20.6 L 32.1 21.8 L 35.9 23.1 L 39.5 24.6 L 43.0 26.2 L 46.4 28.1 L 49.6 30.2 L 52.7 32.4 L 55.6 34.7 L 58.3 37.3 L 61.0 40.0 L 62.0 44.4 L 59.8 48.4 L 55.3 49.4 L 51.4 47.2 L 49.7 44.5 Z " />
</g>
</svg>
