<svg xmlns="http://www.w3.org/2000/svg" xmlns:xlink="http://www.w3.org/1999/xlink" version="1.1" baseProfile="full" viewBox="0 0 200 200" width="50" height="50">
<g fill="white">
<path d="M 130.2 183.7 L 112.0 182.5 L 97.0 180.6 L 84.7 177.7 L 74.9 173.9 L 67.0 169.2 L 61.0 163.7 L 56.3 157.3 L 54.15256481170654 153.12443151474 L 52.0 155.4 L 48.6 158.9 L 45.0 162.3 L 37.8 168.7 L 34.3 171.8 L 30.7 174.8 L 27.2 177.7 L 23.444505500793458 180.70439558029176 L 23.5 184.7 L 20.2 183.3 L 11.7 174.6 L 13.4 173.4 L 17.2 171.2 L 28.9 164.3 L 41.2 157.1 L 44.0 155.60232553482055 L 44.0 95.0 L 14.0 95.0 L 14.0 91.0 L 44.0 91.0 L 50.0 86.0 L 61.0 95.0 L 56.0 99.0 L 56.0 151.03207550048828 L 59.6 154.7 L 65.0 159.3 L 70.9 163.1 L 78.1 166.2 L 87.0 168.6722222328186 L 87.0 126.31599998474121 L 85.4 127.5 L 80.1 131.0 L 74.6 134.5 L 68.7 137.7 L 62.4 140.7 L 61.5 139.2 L 66.5 134.6 L 71.4 130.1 L 76.1 125.8 L 80.6 121.6 L 84.7 117.5 L 88.7 113.3 L 92.3 109.2 L 95.7 105.2 L 98.8 101.1 L 101.02757682800294 97.91774740219117 L 101.0 97.9 L 102.0 96.5 L 111.1 104.4 L 112.3 107.8 L 108.45738725662231 107.33623638153077 L 107.5 108.4 L 103.6 112.4 L 99.5 116.3 L 95.0 120.1 L 92.01000003814697 122.50500001907349 L 99.0 126.0 L 148.0 126.0 L 154.0 121.0 L 165.0 130.0 L 160.0 134.0 L 160.0 158.0 L 148.0 164.0 L 148.0 156.0 L 99.0 156.0 L 99.0 163.0 L 87.48435373306275 168.7578230857849 L 98.4 170.4 L 112.7 171.5 L 130.4 171.9 L 151.9 171.5 L 177.7 170.4 L 189.0 169.9 L 178.2 183.5 L 152.1 184.0 Z M 99.0 130.0 L 99.0 152.0 L 148.0 152.0 L 148.0 130.0 Z M 166.1 128.4 L 163.2 125.0 L 160.0 121.7 L 156.6 118.3 L 152.9 115.0 L 149.1 111.6 L 145.0 108.3 L 140.8 104.8 L 136.4 101.2 L 137.3 99.6 L 142.7 101.5 L 147.9 103.7 L 152.8 106.2 L 157.4 108.8 L 161.8 111.7 L 162.3982608795166 112.1034782409668 L 163.5 109.9 L 164.4 107.2 L 166.0 102.2 L 166.8 99.9 L 167.4 97.6 L 168.1 95.5 L 168.45714282989502 94.0 L 76.39310340881347 94.0 L 76.6 94.6 L 77.2 97.7 L 77.4 100.8 L 77.3 103.9 L 76.8 107.1 L 75.9 110.3 L 74.6 113.5 L 70.9 116.1 L 66.4 115.5 L 63.7 111.8 L 64.3 107.3 L 65.8 105.5 L 67.1 103.6 L 68.2 101.6 L 69.0 99.6 L 69.7 97.4 L 70.2 95.1 L 70.5 92.6 L 70.5 90.0 L 70.4 87.1 L 69.6 84.2 L 71.2 83.5 L 72.7 86.2 L 74.4 88.9 L 75.0 90.3 L 75.0 90.0 L 169.0 90.0 L 169.47872343063355 89.60106382369995 L 169.5 89.5 L 169.5649582862854 89.52920141220093 L 175.0 85.0 L 186.0 94.0 L 181.0 97.0 L 177.3744680404663 98.51063833236694 L 174.8 101.6 L 171.4 105.4 L 169.6 107.4 L 167.6 109.3 L 165.5 111.2 L 163.92070846557618 113.13024520874023 L 166.1 114.6 L 170.1 117.7 L 173.8 121.0 L 177.4 124.3 L 180.8 127.9 L 182.0 132.3 L 179.8 136.3 L 175.4 137.5 L 171.4 135.4 L 168.9 131.9 Z M 132.0 21.5 L 133.1 24.9 L 128.77148151397705 24.302962970733642 L 126.4 26.3 L 122.4 29.5 L 118.2 32.7 L 115.9 34.3 L 114.82666664123535 35.0 L 157.0 35.0 L 163.0 30.0 L 174.0 39.0 L 169.0 43.0 L 169.0 78.0 L 157.0 84.0 L 157.0 78.0 L 92.0 78.0 L 80.0 84.0 L 80.0 29.0 L 92.0 35.0 L 111.22857141494751 35.0 L 111.8 34.2 L 113.0 31.7 L 114.3 29.3 L 116.7 24.7 L 118.0 22.5 L 119.2 20.3 L 120.3 18.2 L 121.5 16.1 L 122.13394432067871 14.889742660522462 L 122.0 14.8 L 122.475 14.23863639831543 L 122.6 14.0 L 122.64592084884643 14.03663902282715 L 123.1 13.5 Z M 92.0 57.0 L 92.0 74.0 L 157.0 74.0 L 157.0 57.0 Z M 46.0 50.2 L 44.0 47.2 L 41.8 44.2 L 39.3 41.2 L 36.6 38.2 L 33.7 35.2 L 30.5 32.2 L 27.1 29.2 L 23.4 26.2 L 24.3 24.6 L 28.8 26.4 L 33.1 28.2 L 37.2 30.3 L 41.1 32.7 L 44.8 35.2 L 48.2 37.9 L 51.4 40.7 L 54.4 43.8 L 57.1 47.0 L 59.6 50.3 L 60.2 54.9 L 57.5 58.5 L 52.9 59.1 L 49.3 56.4 L 47.7 53.3 Z M 92.0 39.0 L 92.0 53.0 L 157.0 53.0 L 157.0 39.0 Z " />
</g>
</svg>
