<svg xmlns="http://www.w3.org/2000/svg" xmlns:xlink="http://www.w3.org/1999/xlink" version="1.1" baseProfile="full" viewBox="0 0 200 200" width="50" height="50">
<g fill="white">
<path d="M 130.7 183.7 L 112.3 182.6 L 97.2 180.8 L 85.0 178.1 L 75.1 174.6 L 67.2 170.3 L 64.54308557510376 168.12220134735108 L 63.5 168.3 L 63.21937637329101 167.037193775177 L 61.1 165.3 L 56.4 159.6 L 54.27821521759033 155.8868766784668 L 52.0 158.1 L 48.4 161.5 L 44.9 164.6 L 41.3 167.7 L 37.7 170.6 L 26.9 178.7 L 23.323113918304443 181.18394861221313 L 23.1 185.2 L 19.8 183.6 L 12.1 174.3 L 13.8 173.3 L 17.6 171.4 L 21.4 169.6 L 29.2 165.6 L 33.2 163.6 L 37.2 161.5 L 44.0 158.1 L 44.0 109.0 L 14.0 109.0 L 14.0 105.0 L 44.0 105.0 L 50.0 100.0 L 61.0 109.0 L 56.0 113.0 L 56.0 153.70384616851806 L 59.5 156.8 L 64.9 160.7 L 70.05073385238647 163.66821956634521 L 71.2 163.2 L 78.4 159.6 L 84.9 155.8 L 90.5 151.7 L 95.4 147.4 L 99.5 142.7 L 102.8 137.7 L 105.4 132.4 L 107.4 126.7 L 108.375 122.2 L 63.3 122.2 L 63.3 118.2 L 117.5 118.2 L 117.5 103.1 L 129.5 105.1 L 132.5 107.1 L 129.5 108.9 L 129.5 118.2 L 166.21818180084227 118.2 L 174.4 109.2 L 184.4 118.2 L 184.4 122.2 L 118.01395349502563 122.2 L 120.4 123.1 L 123.0 125.6 L 119.215625 126.97613639831543 L 118.2 130.3 L 116.33088235855102 134.4 L 153.0 134.4 L 159.0 129.4 L 170.0 138.4 L 165.0 141.4 L 164.69828567504882 141.525714302063 L 164.6 143.0 L 164.4 145.8 L 164.1 148.3 L 163.8 150.6 L 163.4 152.6 L 163.0 154.5 L 162.5 156.2 L 161.8 157.9 L 160.6 159.7 L 158.9 161.5 L 157.2 163.2 L 155.3 164.7 L 153.3 166.0 L 151.2 167.1 L 149.0 168.0 L 146.7 168.7 L 144.4 169.1 L 142.0 169.4 L 139.6 169.5 L 139.6 163.5 L 119.6 160.5 L 119.6 157.5 L 141.0 157.5 L 142.4 157.3 L 145.0 156.7 L 146.1 156.2 L 147.2 155.6 L 148.3 154.9 L 149.4 154.1 L 150.4 153.1 L 151.18947372436523 152.23157892227172 L 151.2 152.2 L 151.4 151.5 L 151.7 150.3 L 151.9 148.8 L 152.2 146.9 L 152.4 144.6 L 152.6 142.1 L 152.8 139.3 L 152.85625 138.4 L 114.28225803375244 138.4 L 111.2 143.3 L 106.5 148.8 L 101.0 153.7 L 94.9 158.0 L 88.0 161.6 L 80.5 164.5 L 75.5609302520752 165.88534879684448 L 78.0 166.8 L 87.1 169.0 L 98.6 170.6 L 113.0 171.6 L 130.9 171.9 L 152.6 171.5 L 178.7 170.4 L 190.0 169.9 L 179.2 183.5 L 152.9 184.0 Z M 115.0 87.7 L 117.2 90.6 L 113.07578420639038 91.4682559967041 L 112.6 92.4 L 109.5 96.7 L 105.8 100.4 L 101.5 103.6 L 96.6 106.4 L 91.2 108.7 L 85.3 110.6 L 78.9 112.0 L 71.9 112.9 L 64.4 113.3 L 64.1 111.5 L 71.1 109.2 L 77.4 106.8 L 83.1 104.4 L 88.0 101.8 L 92.3 99.1 L 95.8 96.2 L 98.7 93.3 L 100.9 90.2 L 102.6 87.1 L 104.2 82.3 Z M 144.9 107.9 L 142.7 107.8 L 140.5 107.3 L 138.3 106.4 L 136.4 105.1 L 134.7 103.4 L 133.3 101.4 L 132.3 99.2 L 131.6 96.8 L 131.2 94.3 L 131.2 83.3 L 143.2 85.3 L 146.2 87.3 L 143.2 89.1 L 143.2 94.3 L 143.0 95.5 L 143.0 97.9 L 143.1 98.4 L 143.3 98.9 L 143.8 99.5 L 144.6 100.0 L 145.7 100.4 L 147.2 100.8 L 173.7 100.8 L 177.2 95.8 L 179.2 95.8 L 177.2 100.8 L 179.3 102.2 L 180.7 104.3 L 179.3 106.4 L 177.2 107.8 L 147.2 107.8 Z M 62.9 97.5 L 62.6 92.9 L 65.6 89.4 L 66.6 89.3 L 67.6 89.0 L 68.7 88.4 L 69.8 87.5 L 71.0 86.3 L 72.1 84.6 L 73.1 82.6 L 74.0 80.2 L 74.9 77.4 L 75.1 74.4 L 76.9 74.3 L 77.1 77.5 L 77.26000003814697 78.3 L 117.5 78.3 L 117.5 66.8 L 91.3 66.8 L 79.3 72.8 L 79.3 18.4 L 91.3 24.4 L 114.63999996185302 24.4 L 115.8 21.5 L 116.4 20.1 L 116.9 18.7 L 117.7 16.3 L 117.9 15.1 L 118.0815336227417 14.101564979553222 L 117.7 13.9 L 118.19397592544556 13.060240936279296 L 118.2 13.0 L 118.22133502960205 13.013730430603028 L 118.7 12.2 L 128.3 19.5 L 129.7 22.8 L 123.9 22.6 L 125.66000003814698 21.36000003814697 L 124.7 22.0 L 123.4 22.7 L 120.6 24.1 L 119.95714282989502 24.4 L 154.9 24.4 L 160.9 19.4 L 171.9 28.4 L 166.9 32.4 L 166.9 66.8 L 154.9 72.8 L 154.9 66.8 L 128.9 66.8 L 129.5 66.9 L 132.5 68.9 L 129.5 70.7 L 129.5 78.3 L 169.8 78.3 L 170.75172414779664 77.50689659118652 L 171.0 76.7 L 171.37894735336303 76.98421049118042 L 175.8 73.3 L 186.8 82.3 L 181.8 85.3 L 174.0666666984558 88.5222222328186 L 172.9 89.3 L 171.1 90.4 L 169.1 91.7 L 167.0 92.9 L 164.7 94.1 L 162.6 95.8 L 161.4 94.5 L 163.1 92.6 L 164.4 90.3 L 165.5 88.2 L 166.6 86.2 L 167.6 84.4 L 168.65 82.3 L 77.88620691299438 82.3 L 78.0 83.4 L 78.0 86.2 L 77.8 88.8 L 77.2 91.4 L 76.2 93.9 L 74.9 96.2 L 73.1 98.3 L 71.0 100.1 L 66.4 100.4 Z M 38.3 77.2 L 36.1 74.7 L 33.7 72.2 L 31.2 69.7 L 28.5 67.3 L 25.7 65.0 L 22.8 62.6 L 19.8 60.3 L 16.5 58.2 L 17.2 56.5 L 21.1 57.6 L 24.9 58.6 L 28.6 60.0 L 32.2 61.5 L 35.7 63.3 L 39.1 65.2 L 42.4 67.3 L 45.5 69.6 L 48.6 72.1 L 51.5 74.7 L 52.9 79.1 L 50.9 83.2 L 46.6 84.6 L 42.5 82.6 L 40.5 79.9 Z M 91.3 53.4 L 91.3 62.8 L 154.9 62.8 L 154.9 53.4 Z M 91.3 40.9 L 91.3 49.4 L 154.9 49.4 L 154.9 40.9 Z M 47.9 41.9 L 46.0 39.3 L 43.9 36.8 L 41.6 34.3 L 39.1 31.8 L 36.5 29.4 L 33.7 26.9 L 30.7 24.4 L 27.5 22.2 L 28.2 20.6 L 32.1 21.8 L 35.9 23.1 L 39.5 24.6 L 43.0 26.2 L 46.4 28.1 L 49.6 30.2 L 52.7 32.4 L 55.6 34.7 L 58.3 37.3 L 61.0 40.0 L 62.0 44.4 L 59.8 48.4 L 55.3 49.4 L 51.4 47.2 L 49.7 44.5 Z M 91.3 28.4 L 91.3 36.9 L 154.9 36.9 L 154.9 28.4 Z " />
</g>
</svg>
