<svg xmlns="http://www.w3.org/2000/svg" xmlns:xlink="http://www.w3.org/1999/xlink" version="1.1" baseProfile="full" viewBox="0 0 200 200" width="50" height="50">
<g fill="white">
<path d="M 130.2 183.7 L 112.0 182.5 L 97.0 180.6 L 84.7 177.7 L 74.9 173.9 L 67.0 169.2 L 61.0 163.7 L 56.3 157.3 L 54.15256481170654 153.12443151474 L 52.0 155.4 L 48.6 158.9 L 45.0 162.3 L 37.8 168.7 L 34.3 171.8 L 30.7 174.8 L 27.2 177.7 L 23.444505500793458 180.70439558029176 L 23.5 184.7 L 20.2 183.3 L 11.7 174.6 L 13.4 173.4 L 17.2 171.2 L 28.9 164.3 L 41.2 157.1 L 44.0 155.60232553482055 L 44.0 95.0 L 14.0 95.0 L 14.0 91.0 L 44.0 91.0 L 50.0 86.0 L 61.0 95.0 L 56.0 99.0 L 56.0 151.03207550048828 L 59.6 154.7 L 65.0 159.3 L 69.3826512336731 162.12272453308105 L 74.4 160.0 L 81.4 156.5 L 87.6 152.8 L 93.1 148.7 L 97.8 144.4 L 101.7 139.7 L 104.9 134.7 L 107.5 129.3 L 109.4 123.6 L 110.0 120.6 L 66.9 120.6 L 66.9 116.6 L 118.3 116.6 L 118.3 102.0 L 130.3 104.0 L 133.3 106.0 L 130.3 107.8 L 130.3 116.6 L 165.61818180084228 116.6 L 173.8 107.6 L 183.8 116.6 L 183.8 120.6 L 122.15890407562256 120.6 L 120.2 127.1 L 117.95 132.2 L 153.3 132.2 L 159.3 127.2 L 170.3 136.2 L 165.3 139.2 L 164.98457145690918 139.33142852783203 L 164.9 140.6 L 164.7 143.2 L 164.4 145.6 L 164.2 147.8 L 163.9 149.8 L 163.5 151.6 L 163.0 153.2 L 162.3 154.8 L 161.2 156.7 L 159.5 158.5 L 157.8 160.1 L 155.9 161.6 L 153.9 162.9 L 151.8 164.0 L 149.6 164.9 L 147.3 165.6 L 145.0 166.1 L 142.6 166.4 L 140.2 166.5 L 140.2 160.5 L 120.2 157.5 L 120.2 154.5 L 140.2 154.5 L 141.6 154.4 L 143.0 154.2 L 144.3 154.0 L 145.6 153.6 L 146.7 153.1 L 147.8 152.5 L 148.9 151.8 L 150.0 151.0 L 151.0 150.0 L 151.625 149.3125 L 151.8 148.7 L 152.1 147.6 L 152.3 146.1 L 152.5 144.3 L 152.7 142.2 L 152.9 139.7 L 153.1 137.0 L 153.15161294937133 136.2 L 115.79032258987426 136.2 L 113.4 140.1 L 108.8 145.7 L 103.5 150.6 L 97.5 154.9 L 90.9 158.5 L 83.6 161.4 L 75.6 163.6 L 73.09004039764405 164.04293403625488 L 78.1 166.2 L 87.1 168.7 L 98.4 170.4 L 112.7 171.5 L 130.4 171.9 L 151.9 171.5 L 177.7 170.4 L 189.0 169.9 L 178.2 183.5 L 152.1 184.0 Z M 179.6 88.0 L 181.6 88.0 L 179.6 97.0 L 182.0 98.6 L 183.6 101.0 L 182.0 103.4 L 179.6 105.0 L 146.6 105.0 L 144.3 104.8 L 142.0 104.3 L 139.9 103.3 L 137.9 102.0 L 136.2 100.2 L 134.9 98.2 L 133.9 95.9 L 133.3 93.5 L 133.0 91.0 L 133.0 78.6 L 112.3 78.6 L 119.1 82.0 L 121.2 84.9 L 117.23235292434693 85.73529415130615 L 116.7 86.8 L 113.6 91.1 L 110.0 94.9 L 105.7 98.4 L 101.0 101.5 L 95.7 104.1 L 89.9 106.4 L 83.5 108.3 L 76.6 109.7 L 69.2 110.7 L 68.7 108.9 L 75.5 106.1 L 81.7 103.2 L 87.2 100.4 L 92.1 97.5 L 96.3 94.4 L 99.8 91.3 L 102.7 88.1 L 104.9 84.8 L 106.6 81.5 L 107.4755187034607 79.01936378479004 L 107.4 79.0 L 107.55 78.6 L 78.6241379737854 78.6 L 78.7 79.7 L 78.7 82.6 L 78.5 85.3 L 77.8 87.9 L 76.9 90.4 L 75.5 92.7 L 73.7 94.9 L 71.5 96.7 L 67.0 97.0 L 63.5 94.1 L 63.2 89.5 L 66.1 86.0 L 67.2 85.9 L 68.2 85.5 L 69.4 84.9 L 70.5 84.0 L 71.7 82.7 L 72.8 81.0 L 73.8 78.9 L 74.7 76.5 L 75.6 73.7 L 75.8 70.6 L 77.6 70.5 L 77.9 73.7 L 78.07419357299804 74.6 L 172.2 74.6 L 173.0586206436157 73.88448276519776 L 173.3 73.1 L 173.6726674079895 73.37277717590332 L 178.2 69.6 L 189.2 78.6 L 184.2 81.6 L 176.6 84.76666669845581 L 175.2 85.7 L 173.3 86.9 L 171.3 88.2 L 169.1 89.4 L 166.8 90.7 L 164.8 92.4 L 163.5 91.1 L 165.3 89.1 L 166.5 86.8 L 167.8 84.7 L 168.9 82.7 L 169.9 80.8 L 171.0 78.6 L 139.0 78.6 L 145.0 79.6 L 148.0 81.6 L 145.0 83.4 L 145.0 91.0 L 144.8 92.2 L 144.8 93.9 L 144.9 94.5 L 145.0 94.9 L 145.2 95.4 L 145.7 95.8 L 146.4 96.3 L 147.5 96.7 L 149.0 97.0 L 175.6 97.0 Z M 130.1 17.2 L 132.0 20.3 L 126.66438360214234 20.955251121520995 L 124.5 23.3 L 123.2 24.6 L 121.8 25.9 L 120.4 27.3 L 119.6 28.0 L 159.0 28.0 L 165.0 23.0 L 176.0 32.0 L 171.0 36.0 L 171.0 64.0 L 159.0 70.0 L 159.0 64.0 L 94.0 64.0 L 82.0 70.0 L 82.0 22.0 L 94.0 28.0 L 116.86666669845582 28.0 L 117.0 27.7 L 117.3 25.6 L 117.6 23.7 L 118.2 20.1 L 118.4 18.4 L 118.7 16.8 L 118.8 15.3 L 119.0 13.9 L 119.0 13.532173919677735 L 118.6 13.4 L 119.0 12.519999980926514 L 119.0 12.5 L 119.00762367248535 12.503227996826173 L 119.6 11.2 Z M 94.0 47.0 L 94.0 60.0 L 159.0 60.0 L 159.0 47.0 Z M 46.0 50.2 L 44.0 47.2 L 41.8 44.2 L 39.3 41.2 L 36.6 38.2 L 33.7 35.2 L 30.5 32.2 L 27.1 29.2 L 23.4 26.2 L 24.3 24.6 L 28.8 26.4 L 33.1 28.2 L 37.2 30.3 L 41.1 32.7 L 44.8 35.2 L 48.2 37.9 L 51.4 40.7 L 54.4 43.8 L 57.1 47.0 L 59.6 50.3 L 60.2 54.9 L 57.5 58.5 L 52.9 59.1 L 49.3 56.4 L 47.7 53.3 Z M 94.0 32.0 L 94.0 43.0 L 159.0 43.0 L 159.0 32.0 Z " />
</g>
</svg>
