%YAML 1.1
%TAG !u! tag:unity3d.com,2011:
--- !u!1 &7164723822020310833
GameObject:
  m_ObjectHideFlags: 0
  m_CorrespondingSourceObject: {fileID: 0}
  m_PrefabInstance: {fileID: 0}
  m_PrefabAsset: {fileID: 0}
  serializedVersion: 6
  m_Component:
  - component: {fileID: 7164723822020310838}
  - component: {fileID: 7164723822020310858}
  - component: {fileID: 7164723822020310837}
  - component: {fileID: 7164723822020310839}
  m_Layer: 5
  m_Name: EggYolk
  m_TagString: Untagged
  m_Icon: {fileID: 0}
  m_NavMeshLayer: 0
  m_StaticEditorFlags: 0
  m_IsActive: 1
--- !u!224 &7164723822020310838
RectTransform:
  m_ObjectHideFlags: 0
  m_CorrespondingSourceObject: {fileID: 0}
  m_PrefabInstance: {fileID: 0}
  m_PrefabAsset: {fileID: 0}
  m_GameObject: {fileID: 7164723822020310833}
  m_LocalRotation: {x: 0, y: 0, z: 0, w: 1}
  m_LocalPosition: {x: 0, y: 0, z: 0}
  m_LocalScale: {x: 1, y: 1, z: 1}
  m_Children: []
  m_Father: {fileID: 0}
  m_RootOrder: 0
  m_LocalEulerAnglesHint: {x: 0, y: 0, z: 0}
  m_AnchorMin: {x: 0.5, y: 0.5}
  m_AnchorMax: {x: 0.5, y: 0.5}
  m_AnchoredPosition: {x: 0, y: 0}
  m_SizeDelta: {x: 163, y: 173}
  m_Pivot: {x: 0.5, y: 0.5}
--- !u!222 &7164723822020310858
CanvasRenderer:
  m_ObjectHideFlags: 0
  m_CorrespondingSourceObject: {fileID: 0}
  m_PrefabInstance: {fileID: 0}
  m_PrefabAsset: {fileID: 0}
  m_GameObject: {fileID: 7164723822020310833}
  m_CullTransparentMesh: 1
--- !u!114 &7164723822020310837
MonoBehaviour:
  m_ObjectHideFlags: 0
  m_CorrespondingSourceObject: {fileID: 0}
  m_PrefabInstance: {fileID: 0}
  m_PrefabAsset: {fileID: 0}
  m_GameObject: {fileID: 7164723822020310833}
  m_Enabled: 1
  m_EditorHideFlags: 0
  m_Script: {fileID: 11500000, guid: fe87c0e1cc204ed48ad3b37840f39efc, type: 3}
  m_Name: 
  m_EditorClassIdentifier: 
  m_Material: {fileID: 0}
  m_Color: {r: 1, g: 1, b: 1, a: 1}
  m_RaycastTarget: 1
  m_RaycastPadding: {x: 0, y: 0, z: 0, w: 0}
  m_Maskable: 1
  m_OnCullStateChanged:
    m_PersistentCalls:
      m_Calls: []
  m_Sprite: {fileID: 7151721930404559944, guid: e00b51d6dab0c7743b163d38ee2dc655,
    type: 3}
  m_Type: 0
  m_PreserveAspect: 1
  m_FillCenter: 1
  m_FillMethod: 4
  m_FillAmount: 1
  m_FillClockwise: 1
  m_FillOrigin: 0
  m_UseSpriteMesh: 0
  m_PixelsPerUnitMultiplier: 1
--- !u!114 &7164723822020310839
MonoBehaviour:
  m_ObjectHideFlags: 0
  m_CorrespondingSourceObject: {fileID: 0}
  m_PrefabInstance: {fileID: 0}
  m_PrefabAsset: {fileID: 0}
  m_GameObject: {fileID: 7164723822020310833}
  m_Enabled: 1
  m_EditorHideFlags: 0
  m_Script: {fileID: 11500000, guid: 7e6694c5f86fcea4a9ec1431cd615cfc, type: 3}
  m_Name: 
  m_EditorClassIdentifier: 
  minTimeCooked: 4
  maxTimeCooked: 12
  onCut: {fileID: 0}
  onPanSpriteList:
  - {fileID: 21300000, guid: a90ec306938160f409943f904d0d23d2, type: 3}
  - {fileID: 21300000, guid: eb3155358792b7f449994ac0b24251b1, type: 3}
  - {fileID: 21300000, guid: 2cce611c529244c4cb14be1af72c179e, type: 3}
  onDishSpriteList:
  - {fileID: -9079939368977665950, guid: d395b2cf2af474c48a257dd71ba68c20, type: 3}
  - {fileID: 3826981749124719136, guid: c33d8f41e094cbe4183885a0879aec9a, type: 3}
  - {fileID: -2576018641666344695, guid: efaf91bd4a7547c41864995e41d726ca, type: 3}
  mustHaveIngredientList:
  - Oil
  conflictIngredientList:
  - Egg
  - Pork
  - Fish
  - Cabbage
  - Basil
