%YAML 1.1
%TAG !u! tag:unity3d.com,2011:
--- !u!114 &11400000
MonoBehaviour:
  m_ObjectHideFlags: 0
  m_CorrespondingSourceObject: {fileID: 0}
  m_PrefabInstance: {fileID: 0}
  m_PrefabAsset: {fileID: 0}
  m_GameObject: {fileID: 0}
  m_Enabled: 1
  m_EditorHideFlags: 0
  m_Script: {fileID: 11500000, guid: 2c9a6fabe3bd4d9ebbdd84e116e58292, type: 3}
  m_Name: 4_Beggar
  m_EditorClassIdentifier: 
  charName: "\u0E02\u0E2D\u0E17\u0E32\u0E19"
  menu: PorkBasilLowSugar
  money: 0
  sprite: {fileID: 794729729635385337, guid: bf2c9bbcee71cce4cb9d0ed6d20b58c1, type: 3}
  happySprite: {fileID: -717607674954747463, guid: bf2c9bbcee71cce4cb9d0ed6d20b58c1,
    type: 3}
  iconSprite: {fileID: 21300000, guid: 7f86931643c22f5429a36848e033eeb9, type: 3}
  normalReact: "\u0E02\u0E2D\u0E1A\u0E43\u0E08\u0E21\u0E32\u0E01\u0E19\u0E30\u0E1E\u0E48\u0E2D\u0E2B\u0E19\u0E38\u0E48\u0E21"
  criticalFail: "\u0E1B\u0E23\u0E30\u0E18\u0E32\u0E19\u0E19\u0E32\u0E01\u0E04\u0E2D\u0E23\u0E4C\u0E1B\u0E44\u0E14\u0E49\u0E40\u0E02\u0E49\u0E32\u0E42\u0E23\u0E07\u0E1E\u0E22\u0E32\u0E1A\u0E32\u0E25\u0E08\u0E32\u0E01\u0E23\u0E49\u0E32\u0E19
    Granny !"
  goodFeedback: "\u0E27\u0E49\u0E32\u0E27 \u0E1E\u0E48\u0E2D\u0E2B\u0E19\u0E38\u0E48\u0E21\u0E04\u0E19\u0E19\u0E35\u0E49\u0E21\u0E35\u0E1D\u0E35\u0E21\u0E37\u0E2D\u0E40\u0E2A\u0E35\u0E22\u0E08\u0E23\u0E34\u0E07
    !"
  badFeedback: "\u0E16\u0E36\u0E07\u0E2D\u0E32\u0E2B\u0E32\u0E23\u0E08\u0E30\u0E44\u0E21\u0E48\u0E14\u0E35\u0E40\u0E17\u0E48\u0E32\u0E44\u0E2B\u0E23\u0E48
    \u0E41\u0E15\u0E48\u0E2D\u0E22\u0E48\u0E32\u0E07\u0E19\u0E49\u0E2D\u0E22\u0E40\u0E02\u0E32\u0E01\u0E47\u0E43\u0E08\u0E14\u0E35\u0E19\u0E30"
  startDialogueList:
  - "\u0E2A\u0E27\u0E31\u0E2A\u0E14\u0E35\u0E1E\u0E48\u0E2D\u0E2B\u0E19\u0E38\u0E48\u0E21"
  - "\u0E09\u0E31\u0E19\u0E44\u0E21\u0E48\u0E21\u0E35\u0E40\u0E07\u0E34\u0E19\u0E15\u0E34\u0E14\u0E15\u0E31\u0E27\u0E40\u0E25\u0E22
    \u0E02\u0E2D\u0E09\u0E31\u0E19\u0E15\u0E34\u0E14\u0E40\u0E07\u0E34\u0E19\u0E44\u0E27\u0E49\u0E01\u0E48\u0E2D\u0E19\u0E44\u0E14\u0E49\u0E44\u0E2B\u0E21"
  - "\u0E1E\u0E2D\u0E14\u0E35\u0E09\u0E31\u0E19\u0E40\u0E1B\u0E47\u0E19\u0E40\u0E1A\u0E32\u0E2B\u0E27\u0E32\u0E19
    \u0E02\u0E2D\u0E40\u0E1B\u0E47\u0E19 <color=#4285f4>\u0E01\u0E30\u0E40\u0E1E\u0E23\u0E32\u0E44\u0E21\u0E48\u0E21\u0E35\u0E19\u0E49\u0E33\u0E15\u0E32\u0E25</color>
    \u0E17\u0E35\u0E19\u0E30"
