{
  "timestamp": 1676634233000,
  "version": 20002,
  "index": {
    "name": "/index-v2.json",
    "sha256": "07fa4500736ae77fcc6434e4d70ab315b8e018aef52c2afca9f2834ddc73747d",
    "size": 32946,
    "numPackages": 10
  },
  "diffs": {}
}
