
  _________.__          __  .__       __      __             __
 /   _____/|  |   _____/  |_|  |__   /  \    /  \___________|  | __  ______
 \_____  \ |  |  /  _ \   __\  |  \  \   \/\/   /  _ \_  __ \  |/ / /  ___/
 /        \|  |_(  <_> )  | |   Y  \  \        (  <_> )  | \/    <  \___ \
/_______  /|____/\____/|__| |___|  /   \__/\  / \____/|__|  |__|_ \/____  >
        \/                       \/         \/                   \/     \/
