{
  "files": {
    "main.css": "/static/css/main.a564d08b.css",
    "main.js": "/static/js/main.13947652.js",
    "static/js/787.77f3a530.chunk.js": "/static/js/787.77f3a530.chunk.js",
    "index.html": "/index.html",
    "main.a564d08b.css.map": "/static/css/main.a564d08b.css.map",
    "main.13947652.js.map": "/static/js/main.13947652.js.map",
    "787.77f3a530.chunk.js.map": "/static/js/787.77f3a530.chunk.js.map"
  },
  "entrypoints": [
    "static/css/main.a564d08b.css",
    "static/js/main.13947652.js"
  ]
}