{
  "contact": [
    {
      "id": "location",
      "name": "Location",
      "name_tc": "地址",
      "name_sc": "地址",
      "value": "Ontario, Canada",
      "value_tc": "",
      "value_sc": "",
      "uri": "",
      "uri_target": "",
      "icon": ["fas", "location-dot"],
      "type": "work"
    },
    {
      "id": "phone",
      "name": "Phone",
      "name_tc": "電話",
      "name_sc": "电话",
      "value": "+1 (416) 887 0733",
      "value_tc": "",
      "value_sc": "",
      "uri": "",
      "uri_target": "",
      "icon": ["fas", "phone"],
      "type": "work"
    },
    {
      "id": "email",
      "name": "Email",
      "name_tc": "電郵",
      "name_sc": "电邮",
      "value": "kaming.lock@gmail.com",
      "value_tc": "",
      "value_sc": "",
      "uri": "",
      "uri_target": "",
      "icon": ["fas", "envelope"],
      "type": "work"
    },
    {
      "id": "linkedin",
      "name": "LinkedIn",
      "name_tc": "領英",
      "name_sc": "领英",
      "value": "Ka Ming Lock",
      "value_tc": "",
      "value_sc": "",
      "uri": "https://www.linkedin.com/in/ka-ming-lock-615687139",
      "uri_target": "_blank",
      "icon": ["fab", "linkedin"],
      "type": "work"
    },
    {
      "id": "whatsapp",
      "name": "WhatsApp",
      "name_tc": "WhatsApp",
      "name_sc": "WhatsApp",
      "value": "+1 (416) 887 0733",
      "value_tc": "",
      "value_sc": "",
      "uri": "",
      "uri_target": "",
      "icon": ["fab", "whatsapp"],
      "type": "work"
    },
    {
      "id": "skype",
      "name": "Skype",
      "name_tc": "Skype",
      "name_sc": "Skype",
      "value": "locker1998",
      "value_tc": "",
      "value_sc": "",
      "uri": "",
      "uri_target": "",
      "icon": ["fab", "skype"],
      "type": "work"
    },
    {
      "id": "gitlab",
      "name": "GitLab",
      "name_tc": "GitLab",
      "name_sc": "GitLab",
      "value": "martinonline",
      "value_tc": "",
      "value_sc": "",
      "uri": "https://git.dev-locker.synology.me/martinonline",
      "uri_target": "_blank",
      "icon": ["fab", "gitlab"],
      "type": "work"
    },
    {
      "id": "facebook",
      "name": "Facebook",
      "name_tc": "臉書",
      "name_sc": "臉書",
      "value": "Lock Ka Ming",
      "value_tc": "Facebook",
      "value_sc": "",
      "uri": "https://www.facebook.com/kaming.lock.98",
      "uri_target": "_blank",
      "icon": ["fab", "facebook"],
      "type": "social"
    },
    {
      "id": "instagram",
      "name": "Instagram",
      "name_tc": "Instagram",
      "name_sc": "Instagram",
      "value": "lockkaming",
      "value_tc": "",
      "value_sc": "",
      "uri": "https://www.instagram.com/lockkaming",
      "uri_target": "_blank",
      "icon": ["fab", "instagram"],
      "type": "social"
    },
    {
      "id": "twitter",
      "name": "Twitter",
      "name_tc": "推特",
      "name_sc": "推特",
      "value": "Lock Ka Ming",
      "value_tc": "",
      "value_sc": "",
      "uri": "https://twitter.com/1998Locker",
      "uri_target": "_blank",
      "icon": ["fab", "twitter"],
      "type": "social"
    },
    {
      "id": "youtube",
      "name": "YouTube",
      "name_tc": "YouTube",
      "name_sc": "YouTube",
      "value": "Lock Ka Ming",
      "value_tc": "",
      "value_sc": "",
      "uri": "https://www.youtube.com/channel/UCmUIeUvzPelsF8XFc1q3ytw",
      "uri_target": "_blank",
      "icon": ["fab", "youtube"],
      "type": "social"
    },
    {
      "id": "snapchat",
      "name": "SnapChat",
      "name_tc": "SnapChat",
      "name_sc": "SnapChat",
      "value": "lockkaming",
      "value_tc": "",
      "value_sc": "",
      "uri": "",
      "uri_target": "",
      "icon": ["fab", "snapchat"],
      "type": "social"
    },
    {
      "id": "line",
      "name": "Line",
      "name_tc": "Line",
      "name_sc": "Line",
      "value": "lockkaming",
      "value_tc": "",
      "value_sc": "",
      "uri": "",
      "uri_target": "",
      "icon": ["fab", "line"],
      "type": "social"
    },
    {
      "id": "wechat",
      "name": "WeChat",
      "name_tc": "微信",
      "name_sc": "微信",
      "value": "rekcolnitram",
      "value_tc": "",
      "value_sc": "",
      "uri": "",
      "uri_target": "",
      "icon": ["fab", "weixin"],
      "type": "social"
    },
    {
      "id": "steam",
      "name": "Steam",
      "name_tc": "Steam",
      "name_sc": "蒸汽平台",
      "value": "locker1998",
      "value_tc": "",
      "value_sc": "",
      "uri": "https://steamcommunity.com/id/locker1998",
      "uri_target": "_blank",
      "icon": ["fab", "steam"],
      "type": "games"
    },
    {
      "id": "discord",
      "name": "Discord",
      "name_tc": "Discord",
      "name_sc": "Discord",
      "value": "locker#1998",
      "value_tc": "",
      "value_sc": "",
      "uri": "",
      "uri_target": "",
      "icon": ["fab", "discord"],
      "type": "games"
    }
  ]
}
