{
  "pages": [
    {
      "name": "Home",
      "name_tc": "主頁",
      "name_sc": "主页",
      "uri": "/",
      "meta": {
        "desc": "I am Martin Lock and I'm a Web Developer",
        "desc_tc": "我是Martin Lock，我是一個網頁開發人員",
        "desc_sc": "我是Martin Lock，我是一个网页开发人员"
      }
    },
    {
      "name": "Programming",
      "name_tc": "編程",
      "name_sc": "编程",
      "uri": "/programming",
      "meta": {
        "desc": "Come and share thoughts and learn programming together!",
        "desc_tc": "快來交流心得，一起學編程吧！",
        "desc_sc": "快来交流心得，一起学编程吧！"
      }
    },
    {
      "name": "Games",
      "name_tc": "遊戲",
      "name_sc": "游戏",
      "uri": "/games",
      "meta": {
        "desc": "No game no life! Add me and play together!",
        "desc_tc": "沒有遊戲就沒有人生！加我一起玩吧！",
        "desc_sc": "没有游戏就没有人生！加我一起玩吧！"
      }
    },
    {
      "name": "Contact",
      "name_tc": "聯繫",
      "name_sc": "联系",
      "uri": "/contact",
      "meta": {
        "desc": "Looking for me? Find the best way to contact to contact me now!",
        "desc_tc": "在找我嗎？立即找到與我聯繫的最佳方式！",
        "desc_sc": "在找我吗？立即找到与我联系的最佳方式！"
      }
    },
    {
      "name": "Login",
      "name_tc": "登入",
      "name_sc": "登入",
      "uri": "/user",
      "meta": {
        "desc": "Log into my site and let's be friends together!",
        "desc_tc": "登錄我的網站，讓我們一起成為朋友吧！",
        "desc_sc": "登录我的网站，让我们一起成为朋友吧！"
      }
    },
    {
      "name": "Register",
      "name_tc": "註冊",
      "name_sc": "註冊",
      "uri": "/register",
      "meta": {
        "desc": "Log into my site and let's be friends together!",
        "desc_tc": "登錄我的網站，讓我們一起成為朋友吧！",
        "desc_sc": "登录我的网站，让我们一起成为朋友吧！"
      }
    }
  ],
  "nav": [
    { "page": 0, "target": "_self" },
    {
      "name": "GitLab",
      "name_tc": "GitLab",
      "name_sc": "GitLab",
      "uri": "https://git.dev-locker.synology.me/martinonline",
      "target": "_blank"
    },
    { "page": 1, "target": "_self" },
    { "page": 2, "target": "_self" },
    { "page": 3, "target": "_self" },
    { "page": 4, "target": "_self" }
  ]
}
