[
  {
    "value": "kfc",
    "name": "KFC",
    "name_tc": "雞團",
    "fullname": "Chicken King",
    "fullname_tc": "超級吱喳雞",
    "limit": 15,
    "limit_olympus": 15
  },
  {
    "value": "cuby",
    "name": "Cuby",
    "name_tc": "水團",
    "fullname": "Mother Cuby",
    "fullname_tc": "水鑲冰晶",
    "limit": 15,
    "limit_olympus": 15
  },
  {
    "value": "ginseng",
    "name": "Ginseng",
    "name_tc": "修羅",
    "fullname": "Ginseng",
    "fullname_tc": "阿修羅",
    "limit": 15,
    "limit_olympus": 15
  },
  {
    "value": "crasta",
    "name": "Crasta",
    "name_tc": "黑團",
    "fullname": "Dark Crasta",
    "fullname_tc": "陰暗卡巴拉魯",
    "limit": 15,
    "limit_olympus": 15
  },
  {
    "value": "namaju",
    "name": "Namaju",
    "name_tc": "魚團",
    "fullname": "Namaju",
    "fullname_tc": "鯰魚主宮",
    "limit": 15,
    "limit_olympus": 15
  },
  {
    "value": "blackspider",
    "name": "Black Spider",
    "name_tc": "黑蜘蛛",
    "fullname": "Giant Black Spider",
    "fullname_tc": "傑克毒蜘蛛",
    "limit": 15,
    "limit_olympus": 15
  },
  {
    "value": "slade",
    "name": "Slade",
    "name_tc": "多多團",
    "fullname": "Massive Slade",
    "fullname_tc": "史域多哈因",
    "limit": 15,
    "limit_olympus": 15
  },
  {
    "value": "fcfire",
    "name": "FC Fire",
    "name_tc": "火王",
    "fullname": "Lord Morcos",
    "fullname_tc": "穆克斯王",
    "limit": -1,
    "limit_olympus": -1
  },
  {
    "value": "fcdark",
    "name": "FC Dark",
    "name_tc": "暗王",
    "fullname": "Lord Hatus",
    "fullname_tc": "哈托斯王",
    "limit": -1,
    "limit_olympus": -1
  },
  {
    "value": "fcwater",
    "name": "FC Water",
    "name_tc": "水王",
    "fullname": "Lady Calvinas",
    "fullname_tc": "卡比納斯王",
    "limit": -1,
    "limit_olympus": -1
  },
  {
    "value": "fclight",
    "name": "FC Light",
    "name_tc": "光王",
    "fullname": "Lord Berios",
    "fullname_tc": "貝納奧斯王",
    "limit": -1,
    "limit_olympus": -1
  },
  {
    "value": "ibra",
    "name": "Ibra",
    "name_tc": "沙團",
    "fullname": "Ibrahim",
    "fullname_tc": "頭目依普拉罕穆",
    "limit": 15,
    "limit_olympus": 15
  },
  {
    "value": "kertos",
    "name": "Kertos",
    "name_tc": "狗團",
    "fullname": "Kertos the Demon Dog",
    "fullname_tc": "地獄守護犬克拉托斯",
    "limit": 15,
    "limit_olympus": 15
  },
  {
    "value": "vala",
    "name": "Valakus",
    "name_tc": "蜘蛛團",
    "fullname": "Valakus King of Fire",
    "fullname_tc": "暴炎之王巴拉酷斯",
    "limit": 15,
    "limit_olympus": 15
  },
  {
    "value": "firegod",
    "name": "Fire God",
    "name_tc": "太陽神",
    "fullname": "Fire God Grenigas",
    "fullname_tc": "暴炎的火神克萊尼卡斯",
    "limit": 15,
    "limit_olympus": 15
  },
  {
    "value": "zenas",
    "name": "Zenas",
    "name_tc": "天團",
    "fullname": "Goddess Zenas",
    "fullname_tc": "女神 吉隆崎",
    "limit": 20,
    "limit_olympus": 15
  },
  {
    "value": "erenia",
    "name": "Erenia",
    "name_tc": "惡團",
    "fullname": "Goddess Erenia",
    "fullname_tc": "女神 愛羅尼亞",
    "limit": 15,
    "limit_olympus": 15
  },
  {
    "value": "fernon",
    "name": "Fernon",
    "name_tc": "天惡",
    "fullname": "Incomplete Fernon",
    "fullname_tc": "不完全的佩拉諾",
    "limit": 8,
    "limit_olympus": 8
  },
  {
    "value": "kiro",
    "name": "Kiro",
    "name_tc": "靈王",
    "fullname": "Twisted Spirit King Kirollas",
    "fullname_tc": "異變靈王基洛拉斯",
    "limit": 8,
    "limit_olympus": 8
  },
  {
    "value": "carno",
    "name": "Carno",
    "name_tc": "獸王",
    "fullname": "Twisted Beast King Carno",
    "fullname_tc": "異變獸王卡諾",
    "limit": 8,
    "limit_olympus": 8
  },
  {
    "value": "belial",
    "name": "Belial",
    "name_tc": "大貝",
    "fullname": "Demon God Belial",
    "fullname_tc": "大惡魔貝利亞",
    "limit": 20,
    "limit_olympus": 20
  },
  {
    "value": "paimon",
    "name": "Paimon",
    "name_tc": "派蒙",
    "fullname": "Evil Overlord Paimon",
    "fullname_tc": "惡魔之王派蒙",
    "limit": 20,
    "limit_olympus": 0
  },
  {
    "value": "revenantpaimon",
    "name": "Revenant Paimon",
    "name_tc": "復仇派蒙",
    "fullname": "Revenant Paimon",
    "fullname_tc": "復仇的惡魔之王派蒙",
    "limit": 15,
    "limit_olympus": 0
  },
  {
    "value": "zombiedragon",
    "name": "Zombie Dragon",
    "name_tc": "不死龍",
    "fullname": "Zombie Dragon Valehir",
    "fullname_tc": "不死龍瓦萊希爾",
    "limit": 15,
    "limit_olympus": 0
  },
  {
    "value": "icedragon",
    "name": "Ice Dragon",
    "name_tc": "冰龍",
    "fullname": "Ice Dragon Alzanor",
    "fullname_tc": "冰龍阿爾札諾爾",
    "limit": 15,
    "limit_olympus": 0
  },
  {
    "value": "fafnir",
    "name": "Fafnir",
    "name_tc": "貪龍團",
    "fullname": "Greedy Fafnir",
    "fullname_tc": "貪婪之龍法布尼爾 貪龍團",
    "limit": 15,
    "limit_olympus": 15
  },
  {
    "value": "yerti",
    "name": "Yerti",
    "name_tc": "骨龍團",
    "fullname": "Twisted Yertirand",
    "fullname_tc": "腐化的尤柏蘭",
    "limit": 15,
    "limit_olympus": 0
  },
  {
    "value": "draco",
    "name": "Draco",
    "name_tc": "6轉團",
    "fullname": "Lord Draco",
    "fullname_tc": "破滅與渾沌 真紅猛焰龍",
    "limit": 15,
    "limit_olympus": 15
  },
  {
    "value": "glacerus",
    "name": "Glacerus",
    "name_tc": "7轉團",
    "fullname": "Glacerus the Ice Cold",
    "fullname_tc": "寒冰之刃 貝魯 夏納爾",
    "limit": 15,
    "limit_olympus": 15
  },
  {
    "value": "caligor",
    "name": "Caligor",
    "name_tc": "8轉團",
    "fullname": "Caligor",
    "fullname_tc": "渾沌",
    "limit": -1,
    "limit_olympus": -1
  },
  {
    "value": "laurena",
    "name": "Laurena",
    "name_tc": "9轉團",
    "fullname": "Witch Laurena",
    "fullname_tc": "大巫師 雷娜",
    "limit": 40,
    "limit_olympus": 15
  },
  {
    "value": "grasslin",
    "name": "Grasslin",
    "name_tc": "9轉團",
    "fullname": "Giant Grasslin",
    "fullname_tc": "巨大肉粽",
    "limit": 15,
    "limit_olympus": 0
  },
  {
    "value": "snowman",
    "name": "Snowman",
    "name_tc": "雪人",
    "fullname": "Huge Snowman Head",
    "fullname_tc": "紳士雪人",
    "limit": 15,
    "limit_olympus": 0
  },
  {
    "value": "halloween",
    "name": "halloween",
    "name_tc": "萬聖節團",
    "fullname": "Jack O'Lantern",
    "fullname_tc": "積高燈籠",
    "limit": 15,
    "limit_olympus": 0
  },
  {
    "value": "qfc",
    "name": "QFC",
    "name_tc": "雞女王",
    "fullname": "Chicken Queen",
    "fullname_tc": "吱喳雞女王",
    "limit": 15,
    "limit_olympus": 0
  },
  {
    "value": "pirate",
    "name": "Pirate",
    "name_tc": "海盜團",
    "fullname": "Captain Pete O'Peng",
    "fullname_tc": "獨眼龍船長 康胖",
    "limit": 15,
    "limit_olympus": 0
  },
  {
    "value": "foxy",
    "name": "Foxy",
    "name_tc": "九尾團",
    "fullname": "Foxy",
    "fullname_tc": "可愛的九尾妹妹",
    "limit": 15,
    "limit_olympus": 0
  },
  {
    "value": "meru",
    "name": "Meru",
    "name_tc": "虎王",
    "fullname": "Meru",
    "fullname_tc": "百年虎王",
    "limit": 15,
    "limit_olympus": 0
  },
  {
    "value": "imp",
    "name": "Imp",
    "name_tc": "青兵",
    "fullname": "Imp Cheongbi",
    "fullname_tc": "青‧兵衛",
    "limit": 15,
    "limit_olympus": 0
  },
  {
    "value": "rabbit",
    "name": "Rabbit",
    "name_tc": "兔團",
    "fullname": "Lola Lopears",
    "fullname_tc": "青澀兔 小芒",
    "limit": 15,
    "limit_olympus": 0
  },
  {
    "value": "madprof",
    "name": "Mad Prof",
    "name_tc": "瘋狂夢古",
    "fullname": "Mad Professor Macavity",
    "fullname_tc": "瘋狂Dr.夢古",
    "limit": 8,
    "limit_olympus": 0
  },
  {
    "value": "madmarch",
    "name": "Mad March",
    "name_tc": "瘋狂兔團",
    "fullname": "Mad March Hare",
    "fullname_tc": "瘋狂小丑兔",
    "limit": 15,
    "limit_olympus": 15
  },
  {
    "value": "a5",
    "name": "A5 Raids",
    "name_tc": "A5團",
    "fullname": "A5 Raids",
    "fullname_tc": "A5團",
    "limit": 15,
    "limit_olympus": 15
  },
  {
    "value": "a6",
    "name": "A6 Raids",
    "name_tc": "A6團",
    "fullname": "A6 Raids",
    "fullname_tc": "A6團",
    "limit": 15,
    "limit_olympus": 15
  },
  {
    "value": "ele",
    "name": "Ele",
    "name_tc": "67",
    "fullname": "Elementals",
    "fullname_tc": "67團",
    "limit": 15,
    "limit_olympus": 15
  },
  {
    "value": "lesser",
    "name": "Lesser",
    "name_tc": "Lesser",
    "fullname": "Lesser",
    "fullname_tc": "Lesser",
    "limit": -1,
    "limit_olympus": 15
  }
]
