/home/kamila/Desktop/kamilatest/src/main/java/helpers/backend/Minutely.java
/home/kamila/Desktop/kamilatest/src/main/java/helpers/backend/ErrorBody.java
/home/kamila/Desktop/kamilatest/src/main/java/helpers/backend/DataElementDaily.java
/home/kamila/Desktop/kamilatest/src/main/java/helpers/frontend/BrowserResults.java
/home/kamila/Desktop/kamilatest/src/main/java/helpers/backend/DataElementHourly.java
/home/kamila/Desktop/kamilatest/src/main/java/helpers/backend/Responses.java
/home/kamila/Desktop/kamilatest/src/main/java/helpers/backend/RequestBody.java
/home/kamila/Desktop/kamilatest/src/main/java/helpers/backend/Requests.java
/home/kamila/Desktop/kamilatest/src/main/java/helpers/backend/Currently.java
/home/kamila/Desktop/kamilatest/src/main/java/helpers/backend/Flags.java
/home/kamila/Desktop/kamilatest/src/main/java/helpers/backend/ResponseBody.java
/home/kamila/Desktop/kamilatest/src/main/java/config/Constants.java
/home/kamila/Desktop/kamilatest/src/main/java/helpers/backend/Hourly.java
/home/kamila/Desktop/kamilatest/src/main/java/helpers/backend/Daily.java
/home/kamila/Desktop/kamilatest/src/main/java/helpers/backend/DataElementMinutely.java
